AWS IoT Core Integration with NVIDIA DeepStream error in make command

Please provide complete information as applicable to your setup.

• Hardware Platform (Jetson / GPU) Jetson nano
• DeepStream Version 6.00
• JetPack Version (valid for Jetson only)
• TensorRT Version
• NVIDIA GPU Driver Version (valid for GPU only)
• Issue Type( questions, new requirements, bugs)
• How to reproduce the issue ? (This is for bugs. Including which sample app is using, the configuration files content, the command line used and other details for reproducing)
• Requirement details( This is for new requirement. Including the module name-for which plugin or for which sample application, the function description)

anamika@anamika-desktop:~/Downloads/aws-iot-core-integration-with-nvidia-deepstream$ gcc --version
gcc (Ubuntu/Linaro 7.5.0-3ubuntu1~18.04) 7.5.0
Copyright (C) 2017 Free Software Foundation, Inc.
This is free software; see the source for copying conditions. There is NO
warranty; not even for MERCHANTABILITY or FITNESS FOR A PARTICULAR PURPOSE.

anamika@anamika-desktop:~/Downloads/aws-iot-core-integration-with-nvidia-deepstream$ aws --version
aws-cli/1.22.46 Python/3.6.9 Linux/4.9.253-tegra botocore/1.23.48
anamika@anamika-desktop:~/Downloads/aws-iot-core-integration-with-nvidia-deepstream$ cd ${DEEPSTREAM_SDK_PATH}/sources/libs/aws_protocol_adaptor/device_client/
anamika@anamika-desktop:/opt/nvidia/deepstream/deepstream-6.0/sources/libs/aws_protocol_adaptor/device_client$ sudo make clean
rm -f ./aws_nvmsgbroker_test
rm -f *.o
rm -f *.so
make -C …/aws-iot-sdk/external_libs/mbedTLS/mbedtls clean
make[1]: Entering directory ‘/opt/nvidia/deepstream/deepstream-6.0/sources/libs/aws_protocol_adaptor/aws-iot-sdk/external_libs/mbedTLS/mbedtls’
make[2]: Entering directory ‘/opt/nvidia/deepstream/deepstream-6.0/sources/libs/aws_protocol_adaptor/aws-iot-sdk/external_libs/mbedTLS/mbedtls/library’
make[2]: Leaving directory ‘/opt/nvidia/deepstream/deepstream-6.0/sources/libs/aws_protocol_adaptor/aws-iot-sdk/external_libs/mbedTLS/mbedtls/library’
make[2]: Entering directory ‘/opt/nvidia/deepstream/deepstream-6.0/sources/libs/aws_protocol_adaptor/aws-iot-sdk/external_libs/mbedTLS/mbedtls/programs’
make[3]: Entering directory ‘/opt/nvidia/deepstream/deepstream-6.0/sources/libs/aws_protocol_adaptor/aws-iot-sdk/external_libs/mbedTLS/mbedtls/programs/fuzz’
make[3]: Leaving directory ‘/opt/nvidia/deepstream/deepstream-6.0/sources/libs/aws_protocol_adaptor/aws-iot-sdk/external_libs/mbedTLS/mbedtls/programs/fuzz’
make[2]: Leaving directory ‘/opt/nvidia/deepstream/deepstream-6.0/sources/libs/aws_protocol_adaptor/aws-iot-sdk/external_libs/mbedTLS/mbedtls/programs’
make[2]: Entering directory ‘/opt/nvidia/deepstream/deepstream-6.0/sources/libs/aws_protocol_adaptor/aws-iot-sdk/external_libs/mbedTLS/mbedtls/tests’
make[2]: Leaving directory ‘/opt/nvidia/deepstream/deepstream-6.0/sources/libs/aws_protocol_adaptor/aws-iot-sdk/external_libs/mbedTLS/mbedtls/tests’
make[1]: Leaving directory ‘/opt/nvidia/deepstream/deepstream-6.0/sources/libs/aws_protocol_adaptor/aws-iot-sdk/external_libs/mbedTLS/mbedtls’
anamika@anamika-desktop:/opt/nvidia/deepstream/deepstream-6.0/sources/libs/aws_protocol_adaptor/device_client$ sudo make
find: ‘…/aws-iot-sdk/external_libs/jsmn’: No such file or directory
find: ‘…/aws-iot-sdk/platform/linux/mbedtls/’: No such file or directory
find: ‘…/aws-iot-sdk/platform/linux/common/’: No such file or directory
find: ‘…/aws-iot-sdk/external_libs/jsmn’: No such file or directory
find: ‘…/aws-iot-sdk/platform/linux/mbedtls/’: No such file or directory
find: ‘…/aws-iot-sdk/platform/linux/common/’: No such file or directory
make -C …/aws-iot-sdk/external_libs/mbedTLS/mbedtls
make[1]: Entering directory ‘/opt/nvidia/deepstream/deepstream-6.0/sources/libs/aws_protocol_adaptor/aws-iot-sdk/external_libs/mbedTLS/mbedtls’
make[2]: Entering directory ‘/opt/nvidia/deepstream/deepstream-6.0/sources/libs/aws_protocol_adaptor/aws-iot-sdk/external_libs/mbedTLS/mbedtls/library’
CC aes.c
CC aesni.c
CC aria.c
CC asn1parse.c
CC asn1write.c
CC base64.c
CC bignum.c
CC camellia.c
CC ccm.c
CC chacha20.c
CC chachapoly.c
CC cipher.c
CC cipher_wrap.c
CC cmac.c
CC constant_time.c
CC ctr_drbg.c
CC des.c
CC dhm.c
CC ecdh.c
CC ecdsa.c
CC ecjpake.c
CC ecp.c
CC ecp_curves.c
CC entropy.c
CC entropy_poll.c
CC error.c
CC gcm.c
CC hkdf.c
CC hmac_drbg.c
CC md.c
CC md5.c
CC memory_buffer_alloc.c
CC mps_reader.c
CC mps_trace.c
CC nist_kw.c
CC oid.c
CC padlock.c
CC pem.c
CC pk.c
CC pk_wrap.c
CC pkcs12.c
CC pkcs5.c
CC pkparse.c
CC pkwrite.c
CC platform.c
CC platform_util.c
CC poly1305.c
CC psa_crypto.c
CC psa_crypto_aead.c
CC psa_crypto_cipher.c
CC psa_crypto_client.c
CC psa_crypto_driver_wrappers.c
CC psa_crypto_ecp.c
CC psa_crypto_hash.c
CC psa_crypto_mac.c
CC psa_crypto_rsa.c
CC psa_crypto_se.c
CC psa_crypto_slot_management.c
CC psa_crypto_storage.c
CC psa_its_file.c
CC ripemd160.c
CC rsa.c
CC rsa_alt_helpers.c
CC sha1.c
CC sha256.c
CC sha512.c
CC ssl_debug_helpers_generated.c
CC threading.c
CC timing.c
CC version.c
CC version_features.c
CC …/3rdparty/everest/library/everest.c
CC …/3rdparty/everest/library/x25519.c
CC …/3rdparty/everest/library/Hacl_Curve25519_joined.c
AR libmbedcrypto.a
CC x509.c
CC x509_create.c
CC x509_crl.c
CC x509_crt.c
CC x509_csr.c
CC x509write_crt.c
CC x509write_csr.c
AR libmbedx509.a
CC debug.c
CC net_sockets.c
CC ssl_cache.c
CC ssl_ciphersuites.c
CC ssl_cli.c
CC ssl_cookie.c
CC ssl_msg.c
CC ssl_srv.c
CC ssl_ticket.c
CC ssl_tls.c
CC ssl_tls13_keys.c
CC ssl_tls13_client.c
CC ssl_tls13_server.c
CC ssl_tls13_generic.c
AR libmbedtls.a
make[2]: Leaving directory ‘/opt/nvidia/deepstream/deepstream-6.0/sources/libs/aws_protocol_adaptor/aws-iot-sdk/external_libs/mbedTLS/mbedtls/library’
make[2]: Entering directory ‘/opt/nvidia/deepstream/deepstream-6.0/sources/libs/aws_protocol_adaptor/aws-iot-sdk/external_libs/mbedTLS/mbedtls/tests’
CC src/helpers.c
CC src/asn1_helpers.c
CC src/psa_crypto_helpers.c
CC src/psa_exercise_key.c
CC src/threading_helpers.c
CC src/random.c
CC src/fake_external_rng_for_test.c
CC src/certs.c
CC src/drivers/test_driver_aead.c
CC src/drivers/test_driver_signature.c
CC src/drivers/test_driver_key_management.c
CC src/drivers/test_driver_cipher.c
CC src/drivers/hash.c
CC src/drivers/test_driver_mac.c
CC src/drivers/platform_builtin_keys.c
make[2]: Leaving directory ‘/opt/nvidia/deepstream/deepstream-6.0/sources/libs/aws_protocol_adaptor/aws-iot-sdk/external_libs/mbedTLS/mbedtls/tests’
make[2]: Entering directory ‘/opt/nvidia/deepstream/deepstream-6.0/sources/libs/aws_protocol_adaptor/aws-iot-sdk/external_libs/mbedTLS/mbedtls/programs’
CC aes/crypt_and_hash.c
CC hash/generic_sum.c
CC hash/hello.c
CC pkey/dh_client.c
CC pkey/dh_genprime.c
CC pkey/dh_server.c
CC pkey/ecdh_curve25519.c
CC pkey/ecdsa.c
CC pkey/gen_key.c
CC pkey/key_app.c
CC pkey/key_app_writer.c
CC pkey/mpi_demo.c
CC pkey/pk_decrypt.c
CC pkey/pk_encrypt.c
CC pkey/pk_sign.c
CC pkey/pk_verify.c
CC pkey/rsa_decrypt.c
CC pkey/rsa_encrypt.c
CC pkey/rsa_genkey.c
CC pkey/rsa_sign.c
CC pkey/rsa_sign_pss.c
CC pkey/rsa_verify.c
CC pkey/rsa_verify_pss.c
CC psa/crypto_examples.c
CC psa/key_ladder_demo.c
CC psa/psa_constant_names.c
CC random/gen_entropy.c
CC random/gen_random_ctr_drbg.c
CC ssl/dtls_client.c
CC ssl/dtls_server.c
CC ssl/mini_client.c
CC ssl/ssl_client1.c
CC test/query_config.c
CC ssl/ssl_test_lib.c
CC ssl/ssl_client2.c
CC ssl/ssl_context_info.c
CC ssl/ssl_fork_server.c
CC ssl/ssl_mail_client.c
CC ssl/ssl_server.c
CC ssl/ssl_server2.c
CC test/benchmark.c
CC test/query_compile_time_config.c
CC test/selftest.c
CC test/udp_proxy.c
CC test/zeroize.c
CC util/pem2der.c
CC util/strerror.c
CC x509/cert_app.c
CC x509/cert_req.c
CC x509/cert_write.c
CC x509/crl_app.c
CC x509/load_roots.c
CC x509/req_app.c
make[3]: Entering directory ‘/opt/nvidia/deepstream/deepstream-6.0/sources/libs/aws_protocol_adaptor/aws-iot-sdk/external_libs/mbedTLS/mbedtls/programs/fuzz’
cc common.o onefile.o fuzz_privkey.o …/…/tests/src/helpers.o …/…/tests/src/asn1_helpers.o …/…/tests/src/psa_crypto_helpers.o …/…/tests/src/psa_exercise_key.o …/…/tests/src/threading_helpers.o …/…/tests/src/random.o …/…/tests/src/fake_external_rng_for_test.o …/…/tests/src/certs.o …/…/tests/src/drivers/test_driver_aead.o …/…/tests/src/drivers/test_driver_signature.o …/…/tests/src/drivers/test_driver_key_management.o …/…/tests/src/drivers/test_driver_cipher.o …/…/tests/src/drivers/hash.o …/…/tests/src/drivers/test_driver_mac.o …/…/tests/src/drivers/platform_builtin_keys.o -L…/…/library -lmbedtls -lmbedx509 -lmbedcrypto -o fuzz_privkey
cc common.o onefile.o fuzz_x509csr.o …/…/tests/src/helpers.o …/…/tests/src/asn1_helpers.o …/…/tests/src/psa_crypto_helpers.o …/…/tests/src/psa_exercise_key.o …/…/tests/src/threading_helpers.o …/…/tests/src/random.o …/…/tests/src/fake_external_rng_for_test.o …/…/tests/src/certs.o …/…/tests/src/drivers/test_driver_aead.o …/…/tests/src/drivers/test_driver_signature.o …/…/tests/src/drivers/test_driver_key_management.o …/…/tests/src/drivers/test_driver_cipher.o …/…/tests/src/drivers/hash.o …/…/tests/src/drivers/test_driver_mac.o …/…/tests/src/drivers/platform_builtin_keys.o -L…/…/library -lmbedtls -lmbedx509 -lmbedcrypto -o fuzz_x509csr
cc common.o onefile.o fuzz_server.o …/…/tests/src/helpers.o …/…/tests/src/asn1_helpers.o …/…/tests/src/psa_crypto_helpers.o …/…/tests/src/psa_exercise_key.o …/…/tests/src/threading_helpers.o …/…/tests/src/random.o …/…/tests/src/fake_external_rng_for_test.o …/…/tests/src/certs.o …/…/tests/src/drivers/test_driver_aead.o …/…/tests/src/drivers/test_driver_signature.o …/…/tests/src/drivers/test_driver_key_management.o …/…/tests/src/drivers/test_driver_cipher.o …/…/tests/src/drivers/hash.o …/…/tests/src/drivers/test_driver_mac.o …/…/tests/src/drivers/platform_builtin_keys.o -L…/…/library -lmbedtls -lmbedx509 -lmbedcrypto -o fuzz_server
cc common.o onefile.o fuzz_x509crt.o …/…/tests/src/helpers.o …/…/tests/src/asn1_helpers.o …/…/tests/src/psa_crypto_helpers.o …/…/tests/src/psa_exercise_key.o …/…/tests/src/threading_helpers.o …/…/tests/src/random.o …/…/tests/src/fake_external_rng_for_test.o …/…/tests/src/certs.o …/…/tests/src/drivers/test_driver_aead.o …/…/tests/src/drivers/test_driver_signature.o …/…/tests/src/drivers/test_driver_key_management.o …/…/tests/src/drivers/test_driver_cipher.o …/…/tests/src/drivers/hash.o …/…/tests/src/drivers/test_driver_mac.o …/…/tests/src/drivers/platform_builtin_keys.o -L…/…/library -lmbedtls -lmbedx509 -lmbedcrypto -o fuzz_x509crt
cc common.o onefile.o fuzz_dtlsclient.o …/…/tests/src/helpers.o …/…/tests/src/asn1_helpers.o …/…/tests/src/psa_crypto_helpers.o …/…/tests/src/psa_exercise_key.o …/…/tests/src/threading_helpers.o …/…/tests/src/random.o …/…/tests/src/fake_external_rng_for_test.o …/…/tests/src/certs.o …/…/tests/src/drivers/test_driver_aead.o …/…/tests/src/drivers/test_driver_signature.o …/…/tests/src/drivers/test_driver_key_management.o …/…/tests/src/drivers/test_driver_cipher.o …/…/tests/src/drivers/hash.o …/…/tests/src/drivers/test_driver_mac.o …/…/tests/src/drivers/platform_builtin_keys.o -L…/…/library -lmbedtls -lmbedx509 -lmbedcrypto -o fuzz_dtlsclient
cc common.o onefile.o fuzz_pubkey.o …/…/tests/src/helpers.o …/…/tests/src/asn1_helpers.o …/…/tests/src/psa_crypto_helpers.o …/…/tests/src/psa_exercise_key.o …/…/tests/src/threading_helpers.o …/…/tests/src/random.o …/…/tests/src/fake_external_rng_for_test.o …/…/tests/src/certs.o …/…/tests/src/drivers/test_driver_aead.o …/…/tests/src/drivers/test_driver_signature.o …/…/tests/src/drivers/test_driver_key_management.o …/…/tests/src/drivers/test_driver_cipher.o …/…/tests/src/drivers/hash.o …/…/tests/src/drivers/test_driver_mac.o …/…/tests/src/drivers/platform_builtin_keys.o -L…/…/library -lmbedtls -lmbedx509 -lmbedcrypto -o fuzz_pubkey
cc common.o onefile.o fuzz_x509crl.o …/…/tests/src/helpers.o …/…/tests/src/asn1_helpers.o …/…/tests/src/psa_crypto_helpers.o …/…/tests/src/psa_exercise_key.o …/…/tests/src/threading_helpers.o …/…/tests/src/random.o …/…/tests/src/fake_external_rng_for_test.o …/…/tests/src/certs.o …/…/tests/src/drivers/test_driver_aead.o …/…/tests/src/drivers/test_driver_signature.o …/…/tests/src/drivers/test_driver_key_management.o …/…/tests/src/drivers/test_driver_cipher.o …/…/tests/src/drivers/hash.o …/…/tests/src/drivers/test_driver_mac.o …/…/tests/src/drivers/platform_builtin_keys.o -L…/…/library -lmbedtls -lmbedx509 -lmbedcrypto -o fuzz_x509crl
cc common.o onefile.o fuzz_client.o …/…/tests/src/helpers.o …/…/tests/src/asn1_helpers.o …/…/tests/src/psa_crypto_helpers.o …/…/tests/src/psa_exercise_key.o …/…/tests/src/threading_helpers.o …/…/tests/src/random.o …/…/tests/src/fake_external_rng_for_test.o …/…/tests/src/certs.o …/…/tests/src/drivers/test_driver_aead.o …/…/tests/src/drivers/test_driver_signature.o …/…/tests/src/drivers/test_driver_key_management.o …/…/tests/src/drivers/test_driver_cipher.o …/…/tests/src/drivers/hash.o …/…/tests/src/drivers/test_driver_mac.o …/…/tests/src/drivers/platform_builtin_keys.o -L…/…/library -lmbedtls -lmbedx509 -lmbedcrypto -o fuzz_client
cc common.o onefile.o fuzz_dtlsserver.o …/…/tests/src/helpers.o …/…/tests/src/asn1_helpers.o …/…/tests/src/psa_crypto_helpers.o …/…/tests/src/psa_exercise_key.o …/…/tests/src/threading_helpers.o …/…/tests/src/random.o …/…/tests/src/fake_external_rng_for_test.o …/…/tests/src/certs.o …/…/tests/src/drivers/test_driver_aead.o …/…/tests/src/drivers/test_driver_signature.o …/…/tests/src/drivers/test_driver_key_management.o …/…/tests/src/drivers/test_driver_cipher.o …/…/tests/src/drivers/hash.o …/…/tests/src/drivers/test_driver_mac.o …/…/tests/src/drivers/platform_builtin_keys.o -L…/…/library -lmbedtls -lmbedx509 -lmbedcrypto -o fuzz_dtlsserver
make[3]: Leaving directory ‘/opt/nvidia/deepstream/deepstream-6.0/sources/libs/aws_protocol_adaptor/aws-iot-sdk/external_libs/mbedTLS/mbedtls/programs/fuzz’
make[2]: Leaving directory ‘/opt/nvidia/deepstream/deepstream-6.0/sources/libs/aws_protocol_adaptor/aws-iot-sdk/external_libs/mbedTLS/mbedtls/programs’
make[2]: Entering directory ‘/opt/nvidia/deepstream/deepstream-6.0/sources/libs/aws_protocol_adaptor/aws-iot-sdk/external_libs/mbedTLS/mbedtls/tests’
Gen test_suite_memory_buffer_alloc.c
CC test_suite_memory_buffer_alloc.c
Gen test_suite_gcm.camellia.c
CC test_suite_gcm.camellia.c
Gen test_suite_pk.c
CC test_suite_pk.c
Gen test_suite_aes.ofb.c
CC test_suite_aes.ofb.c
Gen test_suite_hmac_drbg.nopr.c
CC test_suite_hmac_drbg.nopr.c
Gen test_suite_aes.rest.c
CC test_suite_aes.rest.c
Gen test_suite_cipher.padding.c
CC test_suite_cipher.padding.c
Gen test_suite_psa_crypto_init.c
CC test_suite_psa_crypto_init.c
Gen test_suite_cipher.nist_kw.c
CC test_suite_cipher.nist_kw.c
Gen test_suite_pem.c
CC test_suite_pem.c
Gen test_suite_base64.c
CC test_suite_base64.c
Gen test_suite_psa_crypto_storage_format.v0.c
CC test_suite_psa_crypto_storage_format.v0.c
Gen test_suite_psa_crypto_slot_management.c
CC test_suite_psa_crypto_slot_management.c
Gen test_suite_ecdsa.c
CC test_suite_ecdsa.c
Gen test_suite_psa_crypto_se_driver_hal_mocks.c
CC test_suite_psa_crypto_se_driver_hal_mocks.c
Gen test_suite_pkcs1_v15.c
CC test_suite_pkcs1_v15.c
Gen test_suite_camellia.c
CC test_suite_camellia.c
Gen test_suite_x509parse.c
CC test_suite_x509parse.c
Gen test_suite_cipher.gcm.c
CC test_suite_cipher.gcm.c
Gen test_suite_psa_crypto_attributes.c
CC test_suite_psa_crypto_attributes.c
Gen test_suite_oid.c
CC test_suite_oid.c
Gen test_suite_mps.c
CC test_suite_mps.c
Gen test_suite_ccm.c
CC test_suite_ccm.c
Gen test_suite_entropy.c
CC test_suite_entropy.c
Gen test_suite_pkparse.c
CC test_suite_pkparse.c
Gen test_suite_cipher.des.c
CC test_suite_cipher.des.c
Gen test_suite_error.c
CC test_suite_error.c
Gen test_suite_gcm.aes256_de.c
CC test_suite_gcm.aes256_de.c
Gen test_suite_psa_crypto_generate_key.generated.c
CC test_suite_psa_crypto_generate_key.generated.c
Gen test_suite_aria.c
CC test_suite_aria.c
Gen test_suite_aes.cbc.c
CC test_suite_aes.cbc.c
Gen test_suite_net.c
CC test_suite_net.c
Gen test_suite_poly1305.c
CC test_suite_poly1305.c
Gen test_suite_psa_crypto_driver_wrappers.c
CC test_suite_psa_crypto_driver_wrappers.c
Gen test_suite_hmac_drbg.misc.c
CC test_suite_hmac_drbg.misc.c
Gen test_suite_psa_crypto_storage_format.misc.c
CC test_suite_psa_crypto_storage_format.misc.c
Gen test_suite_hmac_drbg.no_reseed.c
CC test_suite_hmac_drbg.no_reseed.c
Gen test_suite_gcm.aes192_en.c
CC test_suite_gcm.aes192_en.c
Gen test_suite_chachapoly.c
CC test_suite_chachapoly.c
Gen test_suite_psa_crypto_se_driver_hal.c
CC test_suite_psa_crypto_se_driver_hal.c
Gen test_suite_cipher.ccm.c
CC test_suite_cipher.ccm.c
Gen test_suite_hmac_drbg.pr.c
CC test_suite_hmac_drbg.pr.c
Gen test_suite_asn1parse.c
CC test_suite_asn1parse.c
Gen test_suite_nist_kw.c
CC test_suite_nist_kw.c
Gen test_suite_psa_its.c
CC test_suite_psa_its.c
Gen test_suite_rsa.c
CC test_suite_rsa.c
Gen test_suite_dhm.c
CC test_suite_dhm.c
Gen test_suite_ctr_drbg.c
CC test_suite_ctr_drbg.c
Gen test_suite_timing.c
CC test_suite_timing.c
Gen test_suite_gcm.aes128_en.c
CC test_suite_gcm.aes128_en.c
Gen test_suite_chacha20.c
CC test_suite_chacha20.c
Gen test_suite_ecjpake.c
CC test_suite_ecjpake.c
Gen test_suite_aes.ecb.c
CC test_suite_aes.ecb.c
Gen test_suite_psa_crypto_storage_format.current.c
CC test_suite_psa_crypto_storage_format.current.c
Gen test_suite_cmac.c
CC test_suite_cmac.c
Gen test_suite_random.c
CC test_suite_random.c
Gen test_suite_cipher.misc.c
CC test_suite_cipher.misc.c
Gen test_suite_mdx.c
CC test_suite_mdx.c
Gen test_suite_pkwrite.c
CC test_suite_pkwrite.c
Gen test_suite_shax.c
CC test_suite_shax.c
Gen test_suite_debug.c
CC test_suite_debug.c
Gen test_suite_cipher.chacha20.c
CC test_suite_cipher.chacha20.c
Gen test_suite_psa_crypto.c
CC test_suite_psa_crypto.c
Gen test_suite_psa_crypto_entropy.c
CC test_suite_psa_crypto_entropy.c
Gen test_suite_cipher.null.c
CC test_suite_cipher.null.c
Gen test_suite_psa_crypto_persistent_key.c
CC test_suite_psa_crypto_persistent_key.c
Gen test_suite_pkcs1_v21.c
CC test_suite_pkcs1_v21.c
Gen test_suite_hkdf.c
CC test_suite_hkdf.c
Gen test_suite_cipher.aria.c
CC test_suite_cipher.aria.c
Gen test_suite_aes.xts.c
CC test_suite_aes.xts.c
Gen test_suite_version.c
CC test_suite_version.c
Gen test_suite_x509write.c
CC test_suite_x509write.c
Gen test_suite_des.c
CC test_suite_des.c
Gen test_suite_psa_crypto_hash.c
CC test_suite_psa_crypto_hash.c
Gen test_suite_cipher.aes.c
CC test_suite_cipher.aes.c
Gen test_suite_gcm.misc.c
CC test_suite_gcm.misc.c
Gen test_suite_gcm.aes192_de.c
CC test_suite_gcm.aes192_de.c
Gen test_suite_psa_crypto_not_supported.generated.c
CC test_suite_psa_crypto_not_supported.generated.c
Gen test_suite_ssl.c
CC test_suite_ssl.c
Gen test_suite_gcm.aes256_en.c
CC test_suite_gcm.aes256_en.c
Gen test_suite_aes.cfb.c
CC test_suite_aes.cfb.c
Gen test_suite_md.c
CC test_suite_md.c
Gen test_suite_asn1write.c
CC test_suite_asn1write.c
Gen test_suite_ecdh.c
CC test_suite_ecdh.c
Gen test_suite_psa_crypto_not_supported.misc.c
CC test_suite_psa_crypto_not_supported.misc.c
Gen test_suite_pkcs12.c
CC test_suite_pkcs12.c
Gen test_suite_gcm.aes128_de.c
CC test_suite_gcm.aes128_de.c
Gen test_suite_cipher.camellia.c
CC test_suite_cipher.camellia.c
Gen test_suite_cipher.chachapoly.c
CC test_suite_cipher.chachapoly.c
Gen test_suite_mpi.c
CC test_suite_mpi.c
Gen test_suite_ecp.c
CC test_suite_ecp.c
Gen test_suite_psa_crypto_metadata.c
CC test_suite_psa_crypto_metadata.c
Gen test_suite_pkcs5.c
CC test_suite_pkcs5.c
make[2]: Leaving directory ‘/opt/nvidia/deepstream/deepstream-6.0/sources/libs/aws_protocol_adaptor/aws-iot-sdk/external_libs/mbedTLS/mbedtls/tests’
make[2]: Entering directory ‘/opt/nvidia/deepstream/deepstream-6.0/sources/libs/aws_protocol_adaptor/aws-iot-sdk/external_libs/mbedTLS/mbedtls’
make[2]: Leaving directory ‘/opt/nvidia/deepstream/deepstream-6.0/sources/libs/aws_protocol_adaptor/aws-iot-sdk/external_libs/mbedTLS/mbedtls’
make[1]: Leaving directory ‘/opt/nvidia/deepstream/deepstream-6.0/sources/libs/aws_protocol_adaptor/aws-iot-sdk/external_libs/mbedTLS/mbedtls’
gcc: error: …/aws-iot-sdk/src/aws_iot_mqtt_client.c: No such file or directory
gcc: error: …/aws-iot-sdk/src/aws_iot_mqtt_client_common_internal.c: No such file or directory
gcc: error: …/aws-iot-sdk/src/aws_iot_mqtt_client_connect.c: No such file or directory
gcc: error: …/aws-iot-sdk/src/aws_iot_mqtt_client_publish.c: No such file or directory
gcc: error: …/aws-iot-sdk/src/aws_iot_mqtt_client_subscribe.c: No such file or directory
gcc: error: …/aws-iot-sdk/src/aws_iot_mqtt_client_unsubscribe.c: No such file or directory
gcc: error: …/aws-iot-sdk/src/aws_iot_mqtt_client_yield.c: No such file or directory
Makefile:105: recipe for target ‘all’ failed
make: *** [all] Error 1
anamika@anamika-desktop:/opt/nvidia/deepstream/deepstream-6.0/sources/libs/aws_protocol_adaptor/device_client$

please ignore,i have fixed the dependency errors

Now I am having different issue

make[2]: Leaving directory ‘/opt/nvidia/deepstream/deepstream-6.0/sources/libs/aws_protocol_adaptor/aws-iot-sdk/external_libs/mbedTLS/mbedtls/tests’
make[2]: Entering directory ‘/opt/nvidia/deepstream/deepstream-6.0/sources/libs/aws_protocol_adaptor/aws-iot-sdk/external_libs/mbedTLS/mbedtls’
make[2]: Leaving directory ‘/opt/nvidia/deepstream/deepstream-6.0/sources/libs/aws_protocol_adaptor/aws-iot-sdk/external_libs/mbedTLS/mbedtls’
make[1]: Leaving directory ‘/opt/nvidia/deepstream/deepstream-6.0/sources/libs/aws_protocol_adaptor/aws-iot-sdk/external_libs/mbedTLS/mbedtls’
gcc: warning: …/aws-iot-sdk/external_libs/mbedTLS/mbedtls/library/libmbedtls.a: linker input file unused because linking not done
gcc: warning: …/aws-iot-sdk/external_libs/mbedTLS/mbedtls/library/libmbedcrypto.a: linker input file unused because linking not done
gcc: warning: …/aws-iot-sdk/external_libs/mbedTLS/mbedtls/library/libmbedx509.a: linker input file unused because linking not done

Sorry for the late response, is this still an issue to support? Thanks

yes please

There is no update from you for a period, assuming this is not an issue any more.
Hence we are closing this topic. If need further support, please open a new one.
Thanks

Hi @AnamikaPaul ,
May I know where you got aws-iot-core-integration-with-nvidia-deepstream ?

Thanks!

This topic was automatically closed 14 days after the last reply. New replies are no longer allowed.