Boot stuck

I tried display and headless mode. It won’t work.
Here serial log

[0000.125] [L4T TegraBoot] (version 00.00.2018.01-l4t-e82258de)
[0000.130] Processing in cold boot mode Bootloader 2
[0000.135] A02 Bootrom Patch rev = 1023
[0000.138] Power-up reason: pmc por
[0000.141] No Battery Present
[0000.144] pmic max77620 reset reason
[0000.147] pmic max77620 NVERC : 0x40
[0000.151] RamCode = 1
[0000.153] Platform has DDR4 type RAM
[0000.156] max77620 disabling SD1 Remote Sense
[0000.161] Setting DDR voltage to 1125mv
[0000.165] Serial Number of Pmic Max77663: 0x607ad
[0000.172] Entering ramdump check
[0000.175] Get RamDumpCarveOut = 0x0
[0000.178] RamDumpCarveOut=0x0, RamDumperFlag=0xe59ff3f8
[0000.184] Last reboot was clean, booting normally!
[0000.188] Sdram initialization is successful
[0000.192] SecureOs Carveout Base=0x00000000ff800000 Size=0x00800000
[0000.198] Lp0 Carveout Base=0x00000000ff800000 Size=0x00000000
[0000.204] BpmpFw Carveout Base=0x00000000ff800000 Size=0x00000000
[0000.210] GSC1 Carveout Base=0x00000000ff800000 Size=0x00000000
[0000.216] Resize the SecureOs Carveout to 0x00100000
[0000.221] GSC2 Carveout Base=0x00000000ff900000 Size=0x00100000
[0000.226] GSC4 Carveout Base=0x00000000ff800000 Size=0x00000000
[0000.232] GSC5 Carveout Base=0x00000000ff800000 Size=0x00000000
[0000.238] GSC3 Carveout Base=0x00000000bf800000 Size=0x00200000
[0000.244] RamDump Carveout Base=0x0000000000000000 Size=0x00000000
[0000.250] Platform-DebugCarveout: 0
[0000.253] Nck Carveout Base=0x00000000ff800000 Size=0x00000000
[0000.259] Non secure mode, and RB not enabled.
[0000.263] BoardID = 3448, SKU = 0x3
[0000.266] QSPI-ONLY: SkipQspiOnlyFlag = 0
[0000.270] Nano-SD: checking PT table on QSPI …
[0000.274] Read PT from (2:0)
[0000.290] Using BFS PT to query partitions
[0000.295] Loading Tboot-CPU binary
[0000.324] Verifying TBC in OdmNonSecureSBK mode
[0000.334] Bootloader load address is 0xa0000000, entry address is 0xa0000258
[0000.341] Bootloader downloaded successfully.
[0000.345] Downloaded Tboot-CPU binary to 0xa0000258
[0000.350] MAX77620_GPIO5 configured
[0000.353] CPU power rail is up
[0000.356] CPU clock enabled
[0000.360] Performing RAM repair
[0000.363] Updating A64 Warmreset Address to 0xa00002e9
[0000.368] BoardID = 3448, SKU = 0x3
[0000.371] QSPI-ONLY: SkipQspiOnlyFlag = 0
[0000.375] Nano-SD: checking PT table on QSPI …
[0000.379] Loading NvTbootBootloaderDTB
[0000.446] Verifying NvTbootBootloaderDTB in OdmNonSecureSBK mode
[0000.525] Bootloader DTB Load Address: 0x83000000
[0000.530] BoardID = 3448, SKU = 0x3
[0000.533] QSPI-ONLY: SkipQspiOnlyFlag = 0
[0000.537] Nano-SD: checking PT table on QSPI …
[0000.542] Loading NvTbootKernelDTB
[0000.608] Verifying NvTbootKernelDTB in OdmNonSecureSBK mode
[0000.687] Kernel DTB Load Address: 0x83100000
[0000.691] BoardID = 3448, SKU = 0x3
[0000.695] QSPI-ONLY: SkipQspiOnlyFlag = 0
[0000.698] Nano-SD: checking PT table on QSPI …
[0000.705] Loading cboot binary
[0000.820] Verifying EBT in OdmNonSecureSBK mode
[0000.862] Bootloader load address is 0x92c00000, entry address is 0x92c00258
[0000.869] Bootloader downloaded successfully.
[0000.873] BoardID = 3448, SKU = 0x3
[0000.877] QSPI-ONLY: SkipQspiOnlyFlag = 0
[0000.880] Nano-SD: checking PT table on QSPI …
[0000.885] PT: Partition NCT NOT found !
[0000.889] Warning: Find Partition via PT Failed
[0000.893] Next binary entry address: 0x92c00258
[0000.897] BoardId: 3448
[0000.902] Overriding pmu board id with proc board id
[0000.907] Display board id is not available
[0000.911] No Bpmp FW loaded
[0000.914] Not loading WB0 as no bpmp/sc7entry fw
[0000.918] Set NvDecSticky Bits
[0000.922] GSC2 address ff93fffc value c0edbbcc
[0000.928] GSC MC Settings done
[0000.931] BoardID = 3448, SKU = 0x3
[0000.934] QSPI-ONLY: SkipQspiOnlyFlag = 0
[0000.938] Nano-SD: checking PT table on QSPI …
[0000.943] TOS Image length 53680
[0000.946] Monitor size 53680
[0000.949] OS size 0
[0000.964] Secure Os AES-CMAC Verification Success!
[0000.969] TOS image cipher info: plaintext
[0000.973] Loading and Validation of Secure OS Successful
[0000.989] NvTbootPackSdramParams: start.
[0000.994] NvTbootPackSdramParams: done.
[0000.997] Tegraboot started after 51823 us
[0001.001] Basic modules init took 922538 us
[0001.005] Sec Bootdevice Read Time = 12 ms, Read Size = 61 KB
[0001.011] Sec Bootdevice Write Time = 0 ms, Write Size = 0 KB
[0001.016] Next stage binary read took 11286 us
[0001.021] Carveout took -63804 us
[0001.024] CPU initialization took 99946 us
[0001.028] Total time taken by TegraBoot 969966 us

[0001.032] Starting CPU & Halting co-processor

64NOTICE: BL31: v1.3(release):5b49e7f80
NOTICE: BL31: Built : 08:37:40, Feb 19 2021
ERROR: Error initializing runtime service trusty_fast
[0001.154] RamCode = 1
[0001.159] LPDDR4 Training: Read DT: Number of tables = 2
[0001.164] EMC Training (SRC-freq: 204000; DST-freq: 1600000)
[0001.176] EMC Training Successful
[0001.179] 408000 not found in DVFS table
[0001.186] RamCode = 1
[0001.189] DT Write: emc-table@204000 succeeded
[0001.195] DT Write: emc-table@1600000 succeeded
[0001.199] LPDDR4 Training: Write DT: Number of tables = 2
[0001.237]
[0001.238] Debug Init done
[0001.240] Marked DTB cacheable
[0001.243] Bootloader DTB loaded at 0x83000000
[0001.248] Marked DTB cacheable
[0001.251] Kernel DTB loaded at 0x83100000
[0001.255] DeviceTree Init done
[0001.268] Pinmux applied successfully
[0001.272] gicd_base: 0x50041000
[0001.276] gicc_base: 0x50042000
[0001.279] Interrupts Init done
[0001.283] Using base:0x60005090 & irq:208 for tick-timer
[0001.288] Using base:0x60005098 for delay-timer
[0001.292] platform_init_timer: DONE
[0001.296] Timer(tick) Init done
[0001.300] osc freq = 38400 khz
[0001.303]
[0001.305] Welcome to L4T Cboot
[0001.308]
[0001.309] Cboot Version: 00.00.2018.01-t210-39562017
[0001.314] calling constructors
[0001.317] initializing heap
[0001.319] initializing threads
[0001.322] initializing timers
[0001.325] creating bootstrap completion thread
[0001.329] top of bootstrap2()
[0001.332] CPU: ARM Cortex A57
[0001.335] CPU: MIDR: 0x411FD071, MPIDR: 0x80000000
[0001.340] initializing platform
[0001.348] Manufacturer: MF = 0xc2, ID MSB = 0x25
[0001.352] ID LSB = 0x36, ID-CFI len = 194 bytes
[0001.357] Macronix QSPI chip present
[0001.360] SPI device register
[0001.363] init boot device
[0001.365] allocating memory for boot device(SPI)
[0001.370] registering boot device
[0001.378] QSPI bdev is already initialized
[0001.382] Enable APE clock
[0001.385] Un-powergate APE partition
[0001.388] of_register: registering tegra_udc to of_hal
[0001.394] of_register: registering inv20628-driver to of_hal
[0001.399] of_register: registering ads1015-driver to of_hal
[0001.405] of_register: registering lp8557-bl-driver to of_hal
[0001.411] of_register: registering bq2419x_charger to of_hal
[0001.416] of_register: registering bq27441_fuel_gauge to of_hal
[0001.428] gpio framework initialized
[0001.431] of_register: registering tca9539_gpio to of_hal
[0001.437] of_register: registering tca9539_gpio to of_hal
[0001.442] of_register: registering i2c_bus_driver to of_hal
[0001.447] of_register: registering i2c_bus_driver to of_hal
[0001.453] of_register: registering i2c_bus_driver to of_hal
[0001.459] pmic framework initialized
[0001.462] of_register: registering max77620_pmic to of_hal
[0001.468] regulator framework initialized
[0001.471] of_register: registering tps65132_bl_driver to of_hal
[0001.477] initializing target
[0001.483] gpio_driver_register: register ‘tegra_gpio_driver’ driver
[0001.491] board ID = D78, board SKU = 3
[0001.495] Skipping Z3!
[0001.500] fixed regulator driver initialized
[0001.519] initializing OF layer
[0001.522] NCK carveout not present
[0001.525] Skipping dts_overrides
[0001.529] of_children_init: Ops found for compatible string nvidia,tegra210-i2c
[0001.546] I2C Bus Init done
[0001.549] of_children_init: Ops found for compatible string nvidia,tegra210-i2c
[0001.559] I2C Bus Init done
[0001.562] of_children_init: Ops found for compatible string nvidia,tegra210-i2c
[0001.572] I2C Bus Init done
[0001.575] of_children_init: Ops found for compatible string nvidia,tegra210-i2c
[0001.585] I2C Bus Init done
[0001.588] of_children_init: Ops found for compatible string nvidia,tegra210-i2c
[0001.598] I2C Bus Init done
[0001.601] of_children_init: Ops found for compatible string maxim,max77620
[0001.611] max77620_init using irq 118
[0001.616] register ‘maxim,max77620’ pmic
[0001.621] gpio_driver_register: register ‘max77620-gpio’ driver
[0001.627] of_children_init: Ops found for compatible string nvidia,tegra210-i2c
[0001.637] I2C Bus Init done
[0001.641] NCK carveout not present
[0001.651] Find /i2c@7000c000’s alias i2c0
[0001.655] get eeprom at 1-a0, size 256, type 0
[0001.664] Find /i2c@7000c500’s alias i2c2
[0001.667] get eeprom at 3-a0, size 256, type 0
[0001.672] get eeprom at 3-ae, size 256, type 0
[0001.676] pm_ids_update: Updating 1,a0, size 256, type 0
[0001.682] I2C slave not started
[0001.685] I2C write failed
[0001.687] Writing offset failed
[0001.690] eeprom_init: EEPROM read failed
[0001.694] pm_ids_update: eeprom init failed
[0001.698] pm_ids_update: Updating 3,a0, size 256, type 0
[0001.728] pm_ids_update: The pm board id is 3448-0003-400
[0001.735] Adding plugin-manager/ids/3448-0003-400=/i2c@7000c500:module@0x50
[0001.744] pm_ids_update: pm id update successful
[0001.748] pm_ids_update: Updating 3,ae, size 256, type 0
[0001.779] pm_ids_update: The pm board id is 3542-0000-201
[0001.785] Adding plugin-manager/ids/3542-0000-201=/i2c@7000c500:module@0x57
[0001.793] pm_ids_update: pm id update successful
[0001.823] eeprom_get_mac: EEPROM invalid MAC address (all 0xff)
[0001.829] shim_eeprom_update_mac:267: Failed to update 0 MAC address in DTB
[0001.837] eeprom_get_mac: EEPROM invalid MAC address (all 0xff)
[0001.843] shim_eeprom_update_mac:267: Failed to update 1 MAC address in DTB
[0001.851] updating /chosen/nvidia,ethernet-mac node 48:b0:2d:2e:db:33
[0001.857] Plugin Manager: Parse ODM data 0x000a4000
[0001.871] shim_cmdline_install: /chosen/bootargs: earlycon=uart8250,mmio32,0x70006000
[0001.886] Find /i2c@7000c000’s alias i2c0
[0001.889] get eeprom at 1-a0, size 256, type 0
[0001.898] Find /i2c@7000c500’s alias i2c2
[0001.902] get eeprom at 3-a0, size 256, type 0
[0001.907] get eeprom at 3-ae, size 256, type 0
[0001.911] pm_ids_update: Updating 1,a0, size 256, type 0
[0001.916] I2C slave not started
[0001.919] I2C write failed
[0001.922] Writing offset failed
[0001.925] eeprom_init: EEPROM read failed
[0001.929] pm_ids_update: eeprom init failed
[0001.933] pm_ids_update: Updating 3,a0, size 256, type 0
[0001.963] pm_ids_update: The pm board id is 3448-0003-400
[0001.969] Adding plugin-manager/ids/3448-0003-400=/i2c@7000c500:module@0x50
[0001.976] pm_ids_update: pm id update successful
[0001.981] pm_ids_update: Updating 3,ae, size 256, type 0
[0002.011] pm_ids_update: The pm board id is 3542-0000-201
[0002.017] Adding plugin-manager/ids/3542-0000-201=/i2c@7000c500:module@0x57
[0002.024] pm_ids_update: pm id update successful
[0002.055] Add serial number:1424320033604 as DT property
[0002.062] Applying platform configs
[0002.069] platform-init is not present. Skipping
[0002.074] calling apps_init()
[0002.079] Couldn’t find GPT header
[0002.084] Proceeding to Cold Boot
[0002.087] starting app android_boot_app
[0002.091] Device state: unlocked
[0002.094] display console init
[0002.102] could not find regulator
[0002.126] hdmi cable not connected
[0002.129] is_hdmi_needed: HDMI not connected, returning false
[000[0002.139] DT entry for leds-pwm not found
2.135] hdmi is not connected
[0002.145] sor0 is not supported
[0002.148] display_console_init: no valid display out_type
[0002.156] subnode volume_up is not found !
[0002.160] subnode back is not found !
[0002.164] subnode volume_down is not found !
[0002.168] subnode menu is not found !
[0002.172] Gpio keyboard init success
[0002.252] found decompressor handler: lz4-legacy
[0002.267] decompressing blob (type 1)…
[0002.332] display_resolution: No display init
[0002.336] Failed to retrieve display resolution
[0002.340] Could not load/initialize BMP blob…ignoring
[0002.415] decompressor handler not found
[0002.419] load_firmware_blob: Firmware blob loaded, entries=2
[0002.425] XUSB blob version 0 size 124416 @ 0x92ca828c
[0002.431] -------> se_aes_verify_sbk_clear: 747
[0002.435] se_aes_verify_sbk_clear: Error
[0002.439] SE operation failed
[0002.442] bl_battery_charging: connected to external power supply
[0002.451] display_console_ioctl: No display init
[0002.456] switch_backlight failed
[0002.462] device_query_partition_size: failed to open partition spiflash0:MSC !
[0002.469] MSC Partition not found
[0002.476] device_query_partition_size: failed to open partition spiflash0:USP !
[0002.483] USP partition read failed!
[0002.486] blob_init: blob-partition USP header read failed
[0002.492] android_boot Unable to update recovery partition
[0002.497] kfs_getpartname: name = LNX
[0002.501] Loading kernel from LNX
[0002.510] Found 19 BFS partitions in “spiflash0”
[0002.827] load kernel from storage
[0002.832] decompressor handler not found
[0003.094] Successfully loaded kernel and ramdisk images
[0003.099] board ID = D78, board SKU = 3
[0003.104] sdmmc node status = okay
[0003.107] sdcard instance = 0
[0003.110] sdcard gpio handle 0x5a
[0003.113] sdcard gpio pin 0xc9
[0003.116] sdcard gpio flags 0x0
[0003.119] vmmc-supply 0x9d
[0003.122] cd_gpio_pin = 201
[0003.125] pin_state = 0
[0003.127] Found sdcard
[0003.129] SD-card IS present …
[0003.132] load_and_boot_kernel: SD card detected OK
[0003.138] display_resolution: No display init
[0003.142] Failed to retrieve display resolution
[0003.147] bmp blob is not loaded and initialized
[0003.151] Failed to display boot-logo
[0003.155] NCK carveout not present
[0003.158] Skipping dts_overrides
[0003.162] NCK carveout not present
[0003.171] Find /i2c@7000c000’s alias i2c0
[0003.175] get eeprom at 1-a0, size 256, type 0
[0003.184] Find /i2c@7000c500’s alias i2c2
[0003.188] get eeprom at 3-a0, size 256, type 0
[0003.192] get eeprom at 3-ae, size 256, type 0
[0003.197] pm_ids_update: Updating 1,a0, size 256, type 0
[0003.202] I2C slave not started
[0003.205] I2C write failed
[0003.208] Writing offset failed
[0003.211] eeprom_init: EEPROM read failed
[0003.215] pm_ids_update: eeprom init failed
[0003.219] pm_ids_update: Updating 3,a0, size 256, type 0
[0003.249] pm_ids_update: The pm board id is 3448-0003-400
[0003.256] Adding plugin-manager/ids/3448-0003-400=/i2c@7000c500:module@0x50
[0003.265] pm_ids_update: pm id update successful
[0003.269] pm_ids_update: Updating 3,ae, size 256, type 0
[0003.299] pm_ids_update: The pm board id is 3542-0000-201
[0003.305] Adding plugin-manager/ids/3542-0000-201=/i2c@7000c500:module@0x57
[0003.313] pm_ids_update: pm id update successful
[0003.344] eeprom_get_mac: EEPROM invalid MAC address (all 0xff)
[0003.350] shim_eeprom_update_mac:267: Failed to update 0 MAC address in DTB
[0003.358] eeprom_get_mac: EEPROM invalid MAC address (all 0xff)
[0003.363] shim_eeprom_update_mac:267: Failed to update 1 MAC address in DTB
[0003.372] updating /chosen/nvidia,ethernet-mac node 48:b0:2d:2e:db:33
[0003.378] Plugin Manager: Parse ODM data 0x000a4000
[0003.391] shim_cmdline_install: /chosen/bootargs: earlycon=uart8250,mmio32,0x70006000
[0003.400] Add serial number:1424320033604 as DT property
[0003.408] Updated bpmp info to DTB
[0003.412] Updated initrd info to DTB
[0003.416] “proc-board” doesn’t exist, creating
[0003.422] Updated board info to DTB
[0003.425] “pmu-board” doesn’t exist, creating
[0003.432] Updated board info to DTB
[0003.435] “display-board” doesn’t exist, creating
[0003.441] Updated board info to DTB
[0003.444] “reset” doesn’t exist, creating
[0003.449] Updated reset info to DTB
[0003.452] display_console_ioctl: No display init
[0003.457] display_console_ioctl: No display init
[0003.462] display_console_ioctl: No display init
[0003.466] Cmdline: tegraid=21.1.2.0.0 ddr_die=2048M@2048M section=256M memtype=0 vpr_resize usb_port_owner_info=0 lane_owner_info=0 emc_max_dvfs=0 touch_id=0@63 video=tegrafb no_console_suspend=1 console=ttyS0,115200n8 debug_uartport=lsport,4 earlyprintk=uart8250-32bit,0x70006000 maxcpus=4 usbcore.old_scheme_first=1 core_edp_mv=1125 core_edp_ma=4000 gpt
[0003.498] DTB cmdline: earlycon=uart8250,mmio32,0x70006000
[0003.504] boot image cmdline: root=/dev/mmcblk0p1 rw rootwait rootfstype=ext4 console=ttyS0,115200n8 console=tty0 fbcon=map:0 net.ifnames=0
[0003.517] Updated bootarg info to DTB
[0003.521] Adding uuid 000000016450a5061400000015fb81c0 to DT
[0003.526] Adding eks info 0 to DT
[0003.532] WARNING: Failed to pass NS DRAM ranges to TOS, err: -7
[0003.538] Updated memory info to DTB
[0003.546] set vdd_core voltage to 1125 mv
[0003.550] setting ‘vdd-core’ regulator to 1125000 micro volts
[0003.556] Found secure-pmc; disable BPMP

U-Boot 2020.04-g6b630d64fd (Feb 19 2021 - 08:37:45 -0800)

SoC: tegra210
Model: NVIDIA Jetson Nano 2GB Developer Kit
Board: NVIDIA P3541-0000
DRAM: 2 GiB
MMC: sdhci@700b0000: 1, sdhci@700b0600: 0
Loading Environment from SPI Flash… SF: Detected mx25u3235f with page size 256 Bytes, erase size 4 KiB, total 4 MiB
*** Warning - bad CRC, using default environment

In: serial
Out: serial
Err: serial
Net: No ethernet found.
Hit any key to stop autoboot: 0
switch to partitions #0, OK
mmc1 is current device
Scanning mmc 1:1…
Found /boot/extlinux/extlinux.conf
Retrieving file: /boot/extlinux/extlinux.conf
844 bytes read in 20 ms (41 KiB/s)
1: primary kernel
Retrieving file: /boot/initrd
7159841 bytes read in 325 ms (21 MiB/s)
Retrieving file: /boot/Image
34338824 bytes read in 1502 ms (21.8 MiB/s)
append: tegraid=21.1.2.0.0 ddr_die=2048M@2048M section=256M memtype=0 vpr_resize usb_port_owner_info=0 lane_owner_info=0 emc_max_dvfs=0 touch_id=0@63 video=tegrafb no_console_suspend=1 console=ttyS0,115200n8 debug_uartport=lsport,4 earlyprintk=uart8250-32bit,0x70006000 maxcpus=4 usbcore.old_scheme_first=1 core_edp_mv=1125 core_edp_ma=4000 gpt earlycon=uart8250,mmio32,0x70006000 root=/dev/mmcblk0p1 rw rootwait rootfstype=ext4 console=ttyS0,115200n8 console=tty0 fbcon=map:0 net.ifnames=0 quiet root=/dev/mmcblk0p1 rw rootwait rootfstype=ext4 console=ttyS0,115200n8 console=tty0 fbcon=map:0 net.ifnames=0

Flattened Device Tree blob at 83100000

Booting using the fdt blob at 0x83100000
ERROR: reserving fdt memory region failed (addr=0 size=0)
ERROR: reserving fdt memory region failed (addr=0 size=0)
Using Device Tree in place at 0000000083100000, end 00000000831843cf
copying carveout for /host1x@50000000/dc@54200000…
copying carveout for /host1x@50000000/dc@54240000…

Starting kernel …

[ 0.000000] Booting Linux on physical CPU 0x0
[ 0.000000] Linux version 4.9.201-tegra (buildbrain@mobile-u64-5294-d8000) (gcc version 7.3.1 20180425 [linaro-7.3-2018.05 revision d29120a424ecfbc167ef90065c0eeb7f91977701] (Linaro GCC 7.3-2018.05) ) #1 SMP PREEMPT Fri Feb 19 08:40:32 PST 2021
[ 0.000000] Boot CPU: AArch64 Processor [411fd071]
[ 0.000000] OF: fdt:memory scan node memory@80000000, reg size 48,
[ 0.000000] OF: fdt: - 80000000 , 3f800000
[ 0.000000] OF: fdt: - bfa00000 , 3fe00000
[ 0.000000] OF: fdt: - ffa00000 , 600000
[ 0.000000] earlycon: uart8250 at MMIO32 0x0000000070006000 (options ‘’)
[ 0.000000] bootconsole [uart8250] enabled
[ 1.280171] imx219 6-0010: imx219_board_setup: error during i2c read probe (-121)
[ 1.287817] imx219 6-0010: board setup failed
[ 2.130714] cgroup: cgroup2: unknown option “nsdelegate”

Ubuntu 18.04.5 LTS localhost.localdomain ttyS0

localhost login:

The boot is done. The serial console is waiting for you to enter your user account and password to login.

2.130714] cgroup: cgroup2: unknown option “nsdelegate”
Ubuntu 18.04.5 LTS localhost.localdomain ttyS0
localhost login:

The problem is, did you ever configure your user account?

After boot with HDMI it shows nvidia logo, boot console and then blank screen.
With micro usb nano cant be detected.

What is your “headless setup” mentioned here? Also, is this from sdkmanager or still the sdcard? I know you had another topic related to boot failure.

Headless with micro usb and i flashed with flash.sh

I don’t get what do you mean “headless with mirco usb”. So did you configure the user account during the first boot or not?

In guide its called " Headless Mode". But nano is not detected so its not working.
There was no first boot setup.

  1. Where is your flash.sh coming from? Is it prepared by the sdkmanager or you prepare it from the driver package manually?

  2. What is the environment of your host machine?

  1. flash.sh prepared by sdkmanager
    Log:

sudo ./flash.sh jetson-nano-devkit mmcblk0p1
###############################################################################

L4T BSP Information:

R32 , REVISION: 5.1

###############################################################################

Target Board Information:

Name: jetson-nano-devkit, Board Family: t210ref, SoC: Tegra 210,

OpMode: production, Boot Authentication: ,

Disk encryption: disabled ,

###############################################################################
./tegraflash.py --chip 0x21 --applet “/media/ass/WD/nvtmp/JetPack_4.5.1_Linux_JETSON_NANO_TARGETS/Linux_for_Tegra/bootloader/nvtboot_recovery.bin” --skipuid --cmd “dump eeprom boardinfo cvm.bin”
Welcome to Tegra Flash
version 1.0.0
Type ? or help for help and q or quit to exit
Use ! to execute system commands

[ 0.1423 ] Generating RCM messages
[ 0.1443 ] tegrarcm --listrcm rcm_list.xml --chip 0x21 0 --download rcm /media/ass/WD/nvtmp/JetPack_4.5.1_Linux_JETSON_NANO_TARGETS/Linux_for_Tegra/bootloader/nvtboot_recovery.bin 0 0
[ 0.1460 ] RCM 0 is saved as rcm_0.rcm
[ 0.1842 ] RCM 1 is saved as rcm_1.rcm
[ 0.1956 ] List of rcm files are saved in rcm_list.xml
[ 0.1957 ]
[ 0.1958 ] Signing RCM messages
[ 0.2104 ] tegrasign --key None --list rcm_list.xml --pubkeyhash pub_key.key
[ 0.2179 ] Assuming zero filled SBK key
[ 0.2415 ]
[ 0.2416 ] Copying signature to RCM mesages
[ 0.2439 ] tegrarcm --chip 0x21 0 --updatesig rcm_list_signed.xml
[ 0.2502 ]
[ 0.2503 ] Boot Rom communication
[ 0.2524 ] tegrarcm --chip 0x21 0 --rcm rcm_list_signed.xml --skipuid
[ 0.2540 ] RCM version 0X210001
[ 0.5785 ] Boot Rom communication completed
[ 1.5871 ]
[ 1.5873 ] dump EEPROM info
[ 1.5903 ] tegrarcm --oem platformdetails eeprom /media/ass/WD/nvtmp/JetPack_4.5.1_Linux_JETSON_NANO_TARGETS/Linux_for_Tegra/bootloader/cvm.bin
[ 1.5926 ] Applet version 00.01.0000
[ 1.8742 ] Saved platform info in /media/ass/WD/nvtmp/JetPack_4.5.1_Linux_JETSON_NANO_TARGETS/Linux_for_Tegra/bootloader/cvm.bin
[ 1.9553 ]
[ 1.9596 ] tegrarcm --reboot recovery
[ 1.9614 ] Applet version 00.01.0000
[ 2.2563 ]
Board ID(3448) version(400)
copying bctfile(/media/ass/WD/nvtmp/JetPack_4.5.1_Linux_JETSON_NANO_TARGETS/Linux_for_Tegra/bootloader/t210ref/BCT/P3448_A00_lpddr4_204Mhz_P987.cfg)… done.
copying bootloader(/media/ass/WD/nvtmp/JetPack_4.5.1_Linux_JETSON_NANO_TARGETS/Linux_for_Tegra/bootloader/t210ref/cboot.bin)… done.
copying initrd(/media/ass/WD/nvtmp/JetPack_4.5.1_Linux_JETSON_NANO_TARGETS/Linux_for_Tegra/bootloader/l4t_initrd.img)… done.
populating kernel to rootfs… done.
populating initrd to rootfs… done.
populating /media/ass/WD/nvtmp/JetPack_4.5.1_Linux_JETSON_NANO_TARGETS/Linux_for_Tegra/kernel/dtb/tegra210-p3448-0003-p3542-0000.dtb to rootfs… done.
Making Boot image… done.
Existing sosfile(/media/ass/WD/nvtmp/JetPack_4.5.1_Linux_JETSON_NANO_TARGETS/Linux_for_Tegra/bootloader/nvtboot_recovery.bin) reused.
copying tegraboot(/media/ass/WD/nvtmp/JetPack_4.5.1_Linux_JETSON_NANO_TARGETS/Linux_for_Tegra/bootloader/t210ref/nvtboot.bin)… done.
copying cpu_bootloader(/media/ass/WD/nvtmp/JetPack_4.5.1_Linux_JETSON_NANO_TARGETS/Linux_for_Tegra/bootloader/t210ref/cboot.bin)… done.
copying bpffile(/media/ass/WD/nvtmp/JetPack_4.5.1_Linux_JETSON_NANO_TARGETS/Linux_for_Tegra/bootloader/t210ref/sc7entry-firmware.bin)… done.
Existing badpagefile(/media/ass/WD/nvtmp/JetPack_4.5.1_Linux_JETSON_NANO_TARGETS/Linux_for_Tegra/bootloader/badpage.bin) reused.
copying wb0boot(/media/ass/WD/nvtmp/JetPack_4.5.1_Linux_JETSON_NANO_TARGETS/Linux_for_Tegra/bootloader/t210ref/warmboot.bin)… done.
Existing tosfile(/media/ass/WD/nvtmp/JetPack_4.5.1_Linux_JETSON_NANO_TARGETS/Linux_for_Tegra/bootloader/tos-mon-only.img) reused.
Existing eksfile(/media/ass/WD/nvtmp/JetPack_4.5.1_Linux_JETSON_NANO_TARGETS/Linux_for_Tegra/bootloader/eks.img) reused.
copying dtbfile(/media/ass/WD/nvtmp/JetPack_4.5.1_Linux_JETSON_NANO_TARGETS/Linux_for_Tegra/kernel/dtb/tegra210-p3448-0003-p3542-0000.dtb)… done.
Copying nv_boot_control.conf to rootfs
Making system.img…
populating rootfs from /media/ass/WD/nvtmp/JetPack_4.5.1_Linux_JETSON_NANO_TARGETS/Linux_for_Tegra/rootfs … tar: boot/extlinux: time stamp 2021-05-16 16:00:15 is 5602.463619445 s in the future
tar: boot/tegra210-p3448-0000-p3449-0000-a02.dtb: time stamp 2021-05-16 16:00:31 is 5618.327932428 s in the future
done.
populating /boot/extlinux/extlinux.conf … done.
Sync’ing system.img … done.
Converting RAW image to Sparse image… done.
system.img built successfully.
Existing tbcfile(/media/ass/WD/nvtmp/JetPack_4.5.1_Linux_JETSON_NANO_TARGETS/Linux_for_Tegra/bootloader/nvtboot_cpu.bin) reused.
copying tbcdtbfile(/media/ass/WD/nvtmp/JetPack_4.5.1_Linux_JETSON_NANO_TARGETS/Linux_for_Tegra/kernel/dtb/tegra210-p3448-0003-p3542-0000.dtb)… done.
copying cfgfile(/media/ass/WD/nvtmp/JetPack_4.5.1_Linux_JETSON_NANO_TARGETS/Linux_for_Tegra/bootloader/t210ref/cfg/flash_l4t_t210_max-spi_sd_p3448.xml) to flash.xml… done.
copying flasher(/media/ass/WD/nvtmp/JetPack_4.5.1_Linux_JETSON_NANO_TARGETS/Linux_for_Tegra/bootloader/t210ref/cboot.bin)… done.
Existing flashapp(/media/ass/WD/nvtmp/JetPack_4.5.1_Linux_JETSON_NANO_TARGETS/Linux_for_Tegra/bootloader/tegraflash.py) reused.
./tegraflash.py --bl cboot.bin --bct P3448_A00_lpddr4_204Mhz_P987.cfg --odmdata 0xa4000 --bldtb kernel_tegra210-p3448-0003-p3542-0000.dtb --applet nvtboot_recovery.bin --cmd “flash; reboot” --cfg flash.xml --chip 0x21 --bins “EBT cboot.bin; DTB tegra210-p3448-0003-p3542-0000.dtb”
saving flash command in /media/ass/WD/nvtmp/JetPack_4.5.1_Linux_JETSON_NANO_TARGETS/Linux_for_Tegra/bootloader/flashcmd.txt
saving Windows flash command to /media/ass/WD/nvtmp/JetPack_4.5.1_Linux_JETSON_NANO_TARGETS/Linux_for_Tegra/bootloader/flash_win.bat
*** Flashing target device started. ***
Welcome to Tegra Flash
version 1.0.0
Type ? or help for help and q or quit to exit
Use ! to execute system commands

[ 0.0245 ] tegrasign --key None --getmode mode.txt
[ 0.0282 ] Assuming zero filled SBK key
[ 0.0408 ]
[ 0.0413 ] Generating RCM messages
[ 0.0588 ] tegrarcm --listrcm rcm_list.xml --chip 0x21 0 --download rcm nvtboot_recovery.bin 0 0
[ 0.0626 ] RCM 0 is saved as rcm_0.rcm
[ 0.0775 ] RCM 1 is saved as rcm_1.rcm
[ 0.0956 ] List of rcm files are saved in rcm_list.xml
[ 0.0956 ]
[ 0.0958 ] Signing RCM messages
[ 0.0975 ] tegrasign --key None --list rcm_list.xml --pubkeyhash pub_key.key
[ 0.0989 ] Assuming zero filled SBK key
[ 0.1188 ]
[ 0.1189 ] Copying signature to RCM mesages
[ 0.1226 ] tegrarcm --chip 0x21 0 --updatesig rcm_list_signed.xml
[ 0.1297 ]
[ 0.1298 ] Parsing partition layout
[ 0.1500 ] tegraparser --pt flash.xml.tmp
[ 0.1571 ]
[ 0.1576 ] Creating list of images to be signed
[ 0.1717 ] tegrahost --chip 0x21 0 --partitionlayout flash.xml.bin --list images_list.xml
[ 0.2772 ]
[ 0.2776 ] Generating signatures
[ 0.2823 ] tegrasign --key None --list images_list.xml --pubkeyhash pub_key.key
[ 0.2843 ] Assuming zero filled SBK key
[ 0.4328 ]
[ 0.4329 ] Generating br-bct
[ 0.4524 ] tegrabct --bct P3448_A00_lpddr4_204Mhz_P987.cfg --chip 0x21 0
[ 0.4566 ] Copying Sdram info from 2 to 3 set
[ 0.4783 ]
[ 0.4785 ] Updating boot device parameters
[ 0.4806 ] tegrabct --bct P3448_A00_lpddr4_204Mhz_P987.bct --chip 0x21 0 --updatedevparam flash.xml.bin
[ 0.4827 ] Warning: No sdram params
[ 0.4842 ]
[ 0.4842 ] Updating bl info
[ 0.4862 ] tegrabct --bct P3448_A00_lpddr4_204Mhz_P987.bct --chip 0x21 0 --updateblinfo flash.xml.bin --updatesig images_list_signed.xml
[ 0.4977 ]
[ 0.4978 ] Updating secondary storage information into bct
[ 0.4998 ] tegraparser --pt flash.xml.bin --chip 0x21 0 --updatecustinfo P3448_A00_lpddr4_204Mhz_P987.bct
[ 0.5027 ]
[ 0.5028 ] Updating Odmdata
[ 0.5047 ] tegrabct --bct P3448_A00_lpddr4_204Mhz_P987.bct --chip 0x21 0 --updatefields Odmdata =0xa4000
[ 0.5071 ] Warning: No sdram params
[ 0.5080 ]
[ 0.5082 ] Get Signed section of bct
[ 0.5098 ] tegrabct --bct P3448_A00_lpddr4_204Mhz_P987.bct --chip 0x21 0 --listbct bct_list.xml
[ 0.5120 ]
[ 0.5121 ] Signing BCT
[ 0.5152 ] tegrasign --key None --list bct_list.xml --pubkeyhash pub_key.key
[ 0.5169 ] Assuming zero filled SBK key
[ 0.5192 ]
[ 0.5193 ] Updating BCT with signature
[ 0.5231 ] tegrabct --bct P3448_A00_lpddr4_204Mhz_P987.bct --chip 0x21 0 --updatesig bct_list_signed.xml
[ 0.5274 ]
[ 0.5275 ] Copying signatures
[ 0.5294 ] tegrahost --chip 0x21 0 --partitionlayout flash.xml.bin --updatesig images_list_signed.xml
[ 0.5768 ]
[ 0.5769 ] Updating BFS information on BCT
[ 0.5788 ] tegrabct --bct P3448_A00_lpddr4_204Mhz_P987.bct --chip 0x21 0 --updatebfsinfo flash.xml.bin
[ 0.5818 ]
[ 0.5823 ] Boot Rom communication
[ 0.5852 ] tegrarcm --chip 0x21 0 --rcm rcm_list_signed.xml
[ 0.5868 ] BR_CID: 0x321010016450a5061400000015fb81c0
[ 0.7339 ] RCM version 0X210001
[ 0.8818 ] Boot Rom communication completed
[ 1.8904 ]
[ 1.8905 ] Sending BCTs
[ 1.8932 ] tegrarcm --download bct P3448_A00_lpddr4_204Mhz_P987.bct
[ 1.8954 ] Applet version 00.01.0000
[ 2.1854 ] Sending bct
[ 2.1861 ] […] 100%
[ 2.4089 ]
[ 2.4113 ] tegrahost --chip 0x21 --align cboot.bin
[ 2.4143 ]
[ 2.4167 ] tegrahost --magicid EBT --appendsigheader cboot.bin cboot.bin_blheader
[ 2.4448 ]
[ 2.4474 ] tegrasign --key None --list cboot.bin_list.xml
[ 2.4489 ] Assuming zero filled SBK key
[ 2.4819 ]
[ 2.4842 ] tegrahost --updatesigheader cboot.bin_blheader.encrypt cboot.bin_blheader.hash zerosbk
[ 2.4968 ]
[ 2.5083 ] tegrahost --chip 0x21 --align tegra210-p3448-0003-p3542-0000.dtb
[ 2.5128 ]
[ 2.5148 ] tegrahost --magicid DTB --appendsigheader tegra210-p3448-0003-p3542-0000.dtb tegra210-p3448-0003-p3542-0000.dtb_blheader
[ 2.5329 ]
[ 2.5355 ] tegrasign --key None --list tegra210-p3448-0003-p3542-0000.dtb_list.xml
[ 2.5370 ] Assuming zero filled SBK key
[ 2.5558 ]
[ 2.5580 ] tegrahost --updatesigheader tegra210-p3448-0003-p3542-0000.dtb_blheader.encrypt tegra210-p3448-0003-p3542-0000.dtb_blheader.hash zerosbk
[ 2.5656 ]
[ 2.5709 ] Sending bootloader and pre-requisite binaries
[ 2.5727 ] tegrarcm --download ebt cboot.bin.encrypt 0 0 --download rp1 tegra210-p3448-0003-p3542-0000.dtb.encrypt 0
[ 2.5747 ] Applet version 00.01.0000
[ 2.8626 ] Sending ebt
[ 2.8631 ] […] 100%
[ 2.9748 ] Sending rp1
[ 2.9775 ] […] 100%
[ 3.0420 ]
[ 3.0444 ] tegrarcm --boot recovery
[ 3.0464 ] Applet version 00.01.0000
[ 3.3406 ]
[ 3.3407 ] Retrieving storage infomation
[ 3.3449 ] tegrarcm --oem platformdetails storage storage_info.bin
[ 3.3474 ] Applet is not running on device. Continue with Bootloader
[ 4.1413 ]
[ 4.1641 ] tegradevflash --oem platformdetails storage storage_info.bin
[ 4.1674 ] Cboot version 00.01.0000
[ 4.3095 ] Saved platform info in storage_info.bin
[ 4.3148 ]
[ 4.3149 ] Flashing the device
[ 4.3173 ] tegradevflash --pt flash.xml.bin --storageinfo storage_info.bin --create
[ 4.3190 ] Cboot version 00.01.0000
[ 4.4721 ] Writing partition GPT with gpt.bin
[ 4.4745 ] […] 100%
[ 4.4831 ] Writing partition PT with flash.xml.bin
[ 17.9556 ] […] 100%
[ 17.9617 ] Writing partition NVC with nvtboot.bin.encrypt
[ 18.2126 ] […] 100%
[ 18.2274 ] Writing partition NVC_R with nvtboot.bin.encrypt
[ 28.2405 ] […] 100%
[ 28.2580 ] Writing partition TBC with nvtboot_cpu.bin.encrypt
[ 38.2803 ] […] 100%
[ 38.2938 ] Writing partition RP1 with kernel_tegra210-p3448-0003-p3542-0000.dtb.encrypt
[ 42.4612 ] […] 100%
[ 42.4818 ] Writing partition EBT with cboot.bin.encrypt
[ 58.6033 ] […] 100%
[ 58.6341 ] Writing partition WB0 with warmboot.bin.encrypt
[ 87.6877 ] […] 100%
[ 87.7006 ] Writing partition BPF with sc7entry-firmware.bin.encrypt
[ 87.9639 ] […] 100%
[ 87.9745 ] Writing partition TOS with tos-mon-only.img.encrypt
[ 88.2377 ] […] 100%
[ 88.2511 ] Writing partition DTB with kernel_tegra210-p3448-0003-p3542-0000.dtb.encrypt
[ 91.6869 ] […] 100%
[ 91.7075 ] Writing partition LNX with boot.img.encrypt
[ 107.8296 ] […] 100%
[ 107.8663 ] Warning: EKS partition magic header mismatch!
[ 147.1814 ] Writing partition EKS with eks.img
[ 147.1821 ] […] 100%
[ 147.1945 ] Writing partition BMP with bmp.blob
[ 147.4579 ] […] 100%
[ 147.4956 ] Writing partition RP4 with rp4.blob
[ 156.5427 ] […] 100%
[ 156.5660 ] Writing partition VER_b with qspi_bootblob_ver.txt
[ 164.1493 ] […] 100%
[ 164.1611 ] Writing partition VER with qspi_bootblob_ver.txt
[ 164.4250 ] […] 100%
[ 164.4366 ] Writing partition APP with system.img
[ 164.6999 ] […] 100%
[ 788.7871 ]
[ 788.8084 ] tegradevflash --write BCT P3448_A00_lpddr4_204Mhz_P987.bct
[ 788.8103 ] Cboot version 00.01.0000
[ 788.9540 ] Writing partition BCT with P3448_A00_lpddr4_204Mhz_P987.bct
[ 788.9560 ] […] 100%
[ 795.6249 ]
[ 795.6250 ] Flashing completed

[ 795.6251 ] Coldbooting the device
[ 795.6277 ] tegradevflash --reboot coldboot
[ 795.6301 ] Cboot version 00.01.0000
[ 795.7785 ]
*** The target t210ref has been flashed successfully. ***
Reset the board to boot from internal eMMC.

2.Host is windows 7 but nano detected in recovery mode

  1. Just a confirm, is it a jeton nano 2gb?

  2. Could you try to find a native ubuntu host? We didn’t test/support sdkmanager and flash.sh on any VM.

  1. Yes
  2. It was not VM.

We also don’t support running sdkmanager or flash.sh on windows 7…

Only ubuntu 16.04 /18.04 support it.

I was flashed in ubuntu 18.04 but im working in windows 7

Please reflash the device with sdkm again.

Move to the ubuntu and

  1. Dump the serial console log during first boot from uart .

  2. Check if there is a node /dev/ttyACM0 on your host side after jetson is up and connected to your host with usb cable. If there is not, please dump me the dmesg on your host.

Please do not use Windows OS for any debug usage.

BTW, you can also remove the “quite” from Linux_For_Tegra/boot/extlinux/extlinux.conf before flash to enable more logs from the serial console log.

New log

[0000.125] [L4T TegraBoot] (version 00.00.2018.01-l4t-e82258de)
[0000.130] Processing in cold boot mode Bootloader 2
[0000.135] A02 Bootrom Patch rev = 1023
[0000.138] Power-up reason: pmc por
[0000.142] No Battery Present
[0000.144] pmic max77620 reset reason
[0000.148] pmic max77620 NVERC : 0x40
[0000.151] RamCode = 1
[0000.153] Platform has DDR4 type RAM
[0000.157] max77620 disabling SD1 Remote Sense
[0000.161] Setting DDR voltage to 1125mv
[0000.165] Serial Number of Pmic Max77663: 0x607ad
[0000.172] Entering ramdump check
[0000.175] Get RamDumpCarveOut = 0x0
[0000.179] RamDumpCarveOut=0x0, RamDumperFlag=0xe59ff3f8
[0000.184] Last reboot was clean, booting normally!
[0000.188] Sdram initialization is successful
[0000.192] SecureOs Carveout Base=0x00000000ff800000 Size=0x00800000
[0000.199] Lp0 Carveout Base=0x00000000ff800000 Size=0x00000000
[0000.204] BpmpFw Carveout Base=0x00000000ff800000 Size=0x00000000
[0000.210] GSC1 Carveout Base=0x00000000ff800000 Size=0x00000000
[0000.216] Resize the SecureOs Carveout to 0x00100000
[0000.221] GSC2 Carveout Base=0x00000000ff900000 Size=0x00100000
[0000.227] GSC4 Carveout Base=0x00000000ff800000 Size=0x00000000
[0000.232] GSC5 Carveout Base=0x00000000ff800000 Size=0x00000000
[0000.238] GSC3 Carveout Base=0x00000000bf800000 Size=0x00200000
[0000.244] RamDump Carveout Base=0x0000000000000000 Size=0x00000000
[0000.250] Platform-DebugCarveout: 0
[0000.253] Nck Carveout Base=0x00000000ff800000 Size=0x00000000
[0000.259] Non secure mode, and RB not enabled.
[0000.263] BoardID = 3448, SKU = 0x3
[0000.266] QSPI-ONLY: SkipQspiOnlyFlag = 0
[0000.270] Nano-SD: checking PT table on QSPI …
[0000.275] Read PT from (2:0)
[0000.290] Using BFS PT to query partitions
[0000.296] Loading Tboot-CPU binary
[0000.324] Verifying TBC in OdmNonSecureSBK mode
[0000.334] Bootloader load address is 0xa0000000, entry address is 0xa0000258
[0000.341] Bootloader downloaded successfully.
[0000.345] Downloaded Tboot-CPU binary to 0xa0000258
[0000.350] MAX77620_GPIO5 configured
[0000.353] CPU power rail is up
[0000.356] CPU clock enabled
[0000.360] Performing RAM repair
[0000.363] Updating A64 Warmreset Address to 0xa00002e9
[0000.368] BoardID = 3448, SKU = 0x3
[0000.371] QSPI-ONLY: SkipQspiOnlyFlag = 0
[0000.375] Nano-SD: checking PT table on QSPI …
[0000.380] Loading NvTbootBootloaderDTB
[0000.446] Verifying NvTbootBootloaderDTB in OdmNonSecureSBK mode
[0000.526] Bootloader DTB Load Address: 0x83000000
[0000.530] BoardID = 3448, SKU = 0x3
[0000.534] QSPI-ONLY: SkipQspiOnlyFlag = 0
[0000.537] Nano-SD: checking PT table on QSPI …
[0000.542] Loading NvTbootKernelDTB
[0000.608] Verifying NvTbootKernelDTB in OdmNonSecureSBK mode
[0000.687] Kernel DTB Load Address: 0x83100000
[0000.692] BoardID = 3448, SKU = 0x3
[0000.695] QSPI-ONLY: SkipQspiOnlyFlag = 0
[0000.699] Nano-SD: checking PT table on QSPI …
[0000.705] Loading cboot binary
[0000.821] Verifying EBT in OdmNonSecureSBK mode
[0000.862] Bootloader load address is 0x92c00000, entry address is 0x92c00258
[0000.869] Bootloader downloaded successfully.
[0000.873] BoardID = 3448, SKU = 0x3
[0000.877] QSPI-ONLY: SkipQspiOnlyFlag = 0
[0000.881] Nano-SD: checking PT table on QSPI …
[0000.885] PT: Partition NCT NOT found !
[0000.889] Warning: Find Partition via PT Failed
[0000.893] Next binary entry address: 0x92c00258
[0000.898] BoardId: 3448
[0000.902] Overriding pmu board id with proc board id
[0000.907] Display board id is not available
[0000.911] No Bpmp FW loaded
[0000.914] Not loading WB0 as no bpmp/sc7entry fw
[0000.918] Set NvDecSticky Bits
[0000.922] GSC2 address ff93fffc value c0edbbcc
[0000.928] GSC MC Settings done
[0000.931] BoardID = 3448, SKU = 0x3
[0000.934] QSPI-ONLY: SkipQspiOnlyFlag = 0
[0000.938] Nano-SD: checking PT table on QSPI …
[0000.943] TOS Image length 53680
[0000.946] Monitor size 53680
[0000.949] OS size 0
[0000.964] Secure Os AES-CMAC Verification Success!
[0000.969] TOS image cipher info: plaintext
[0000.973] Loading and Validation of Secure OS Successful
[0000.989] NvTbootPackSdramParams: start.
[0000.994] NvTbootPackSdramParams: done.
[0000.998] Tegraboot started after 52030 us
[0001.002] Basic modules init took 922527 us
[0001.006] Sec Bootdevice Read Time = 12 ms, Read Size = 61 KB
[0001.011] Sec Bootdevice Write Time = 0 ms, Write Size = 0 KB
[0001.017] Next stage binary read took 11286 us
[0001.021] Carveout took -63804 us
[0001.024] CPU initialization took 99958 us
[0001.028] Total time taken by TegraBoot 969967 us

[0001.033] Starting CPU & Halting co-processor

64NOTICE: BL31: v1.3(release):5b49e7f80
NOTICE: BL31: Built : 08:37:40, Feb 19 2021
ERROR: Error initializing runtime service trusty_fast
[0001.154] RamCode = 1
[0001.159] LPDDR4 Training: Read DT: Number of tables = 2
[0001.164] EMC Training (SRC-freq: 204000; DST-freq: 1600000)
[0001.176] EMC Training Successful
[0001.180] 408000 not found in DVFS table
[0001.186] RamCode = 1
[0001.189] DT Write: emc-table@204000 succeeded
[0001.195] DT Write: emc-table@1600000 succeeded
[0001.199] LPDDR4 Training: Write DT: Number of tables = 2
[0001.237]
[0001.238] Debug Init done
[0001.240] Marked DTB cacheable
[0001.243] Bootloader DTB loaded at 0x83000000
[0001.248] Marked DTB cacheable
[0001.251] Kernel DTB loaded at 0x83100000
[0001.255] DeviceTree Init done
[0001.268] Pinmux applied successfully
[0001.272] gicd_base: 0x50041000
[0001.276] gicc_base: 0x50042000
[0001.279] Interrupts Init done
[0001.283] Using base:0x60005090 & irq:208 for tick-timer
[0001.288] Using base:0x60005098 for delay-timer
[0001.293] platform_init_timer: DONE
[0001.296] Timer(tick) Init done
[0001.300] osc freq = 38400 khz
[0001.304]
[0001.305] Welcome to L4T Cboot
[0001.308]
[0001.309] Cboot Version: 00.00.2018.01-t210-39562017
[0001.314] calling constructors
[0001.317] initializing heap
[0001.319] initializing threads
[0001.322] initializing timers
[0001.325] creating bootstrap completion thread
[0001.330] top of bootstrap2()
[0001.333] CPU: ARM Cortex A57
[0001.335] CPU: MIDR: 0x411FD071, MPIDR: 0x80000000
[0001.340] initializing platform
[0001.348] Manufacturer: MF = 0xc2, ID MSB = 0x25
[0001.352] ID LSB = 0x36, ID-CFI len = 194 bytes
[0001.357] Macronix QSPI chip present
[0001.360] SPI device register
[0001.363] init boot device
[0001.366] allocating memory for boot device(SPI)
[0001.370] registering boot device
[0001.379] QSPI bdev is already initialized
[0001.383] Enable APE clock
[0001.385] Un-powergate APE partition
[0001.389] of_register: registering tegra_udc to of_hal
[0001.394] of_register: registering inv20628-driver to of_hal
[0001.399] of_register: registering ads1015-driver to of_hal
[0001.405] of_register: registering lp8557-bl-driver to of_hal
[0001.411] of_register: registering bq2419x_charger to of_hal
[0001.416] of_register: registering bq27441_fuel_gauge to of_hal
[0001.428] gpio framework initialized
[0001.431] of_register: registering tca9539_gpio to of_hal
[0001.437] of_register: registering tca9539_gpio to of_hal
[0001.442] of_register: registering i2c_bus_driver to of_hal
[0001.448] of_register: registering i2c_bus_driver to of_hal
[0001.453] of_register: registering i2c_bus_driver to of_hal
[0001.459] pmic framework initialized
[0001.462] of_register: registering max77620_pmic to of_hal
[0001.468] regulator framework initialized
[0001.472] of_register: registering tps65132_bl_driver to of_hal
[0001.478] initializing target
[0001.483] gpio_driver_register: register ‘tegra_gpio_driver’ driver
[0001.491] board ID = D78, board SKU = 3
[0001.495] Skipping Z3!
[0001.500] fixed regulator driver initialized
[0001.519] initializing OF layer
[0001.522] NCK carveout not present
[0001.525] Skipping dts_overrides
[0001.529] of_children_init: Ops found for compatible string nvidia,tegra210-i2c
[0001.547] I2C Bus Init done
[0001.549] of_children_init: Ops found for compatible string nvidia,tegra210-i2c
[0001.559] I2C Bus Init done
[0001.562] of_children_init: Ops found for compatible string nvidia,tegra210-i2c
[0001.572] I2C Bus Init done
[0001.575] of_children_init: Ops found for compatible string nvidia,tegra210-i2c
[0001.586] I2C Bus Init done
[0001.588] of_children_init: Ops found for compatible string nvidia,tegra210-i2c
[0001.599] I2C Bus Init done
[0001.601] of_children_init: Ops found for compatible string maxim,max77620
[0001.612] max77620_init using irq 118
[0001.616] register ‘maxim,max77620’ pmic
[0001.621] gpio_driver_register: register ‘max77620-gpio’ driver
[0001.627] of_children_init: Ops found for compatible string nvidia,tegra210-i2c
[0001.638] I2C Bus Init done
[0001.641] NCK carveout not present
[0001.651] Find /i2c@7000c000’s alias i2c0
[0001.655] get eeprom at 1-a0, size 256, type 0
[0001.664] Find /i2c@7000c500’s alias i2c2
[0001.668] get eeprom at 3-a0, size 256, type 0
[0001.672] get eeprom at 3-ae, size 256, type 0
[0001.677] pm_ids_update: Updating 1,a0, size 256, type 0
[0001.682] I2C slave not started
[0001.685] I2C write failed
[0001.687] Writing offset failed
[0001.690] eeprom_init: EEPROM read failed
[0001.694] pm_ids_update: eeprom init failed
[0001.699] pm_ids_update: Updating 3,a0, size 256, type 0
[0001.729] pm_ids_update: The pm board id is 3448-0003-400
[0001.736] Adding plugin-manager/ids/3448-0003-400=/i2c@7000c500:module@0x50
[0001.744] pm_ids_update: pm id update successful
[0001.749] pm_ids_update: Updating 3,ae, size 256, type 0
[0001.779] pm_ids_update: The pm board id is 3542-0000-201
[0001.785] Adding plugin-manager/ids/3542-0000-201=/i2c@7000c500:module@0x57
[0001.793] pm_ids_update: pm id update successful
[0001.823] eeprom_get_mac: EEPROM invalid MAC address (all 0xff)
[0001.829] shim_eeprom_update_mac:267: Failed to update 0 MAC address in DTB
[0001.837] eeprom_get_mac: EEPROM invalid MAC address (all 0xff)
[0001.843] shim_eeprom_update_mac:267: Failed to update 1 MAC address in DTB
[0001.851] updating /chosen/nvidia,ethernet-mac node 48:b0:2d:2e:db:33
[0001.858] Plugin Manager: Parse ODM data 0x000a4000
[0001.871] shim_cmdline_install: /chosen/bootargs: earlycon=uart8250,mmio32,0x70006000
[0001.886] Find /i2c@7000c000’s alias i2c0
[0001.890] get eeprom at 1-a0, size 256, type 0
[0001.899] Find /i2c@7000c500’s alias i2c2
[0001.903] get eeprom at 3-a0, size 256, type 0
[0001.907] get eeprom at 3-ae, size 256, type 0
[0001.911] pm_ids_update: Updating 1,a0, size 256, type 0
[0001.917] I2C slave not started
[0001.920] I2C write failed
[0001.922] Writing offset failed
[0001.925] eeprom_init: EEPROM read failed
[0001.929] pm_ids_update: eeprom init failed
[0001.933] pm_ids_update: Updating 3,a0, size 256, type 0
[0001.963] pm_ids_update: The pm board id is 3448-0003-400
[0001.970] Adding plugin-manager/ids/3448-0003-400=/i2c@7000c500:module@0x50
[0001.977] pm_ids_update: pm id update successful
[0001.981] pm_ids_update: Updating 3,ae, size 256, type 0
[0002.011] pm_ids_update: The pm board id is 3542-0000-201
[0002.018] Adding plugin-manager/ids/3542-0000-201=/i2c@7000c500:module@0x57
[0002.024] pm_ids_update: pm id update successful
[0002.055] Add serial number:1424320033604 as DT property
[0002.063] Applying platform configs
[0002.069] platform-init is not present. Skipping
[0002.074] calling apps_init()
[0002.080] Couldn’t find GPT header
[0002.084] Proceeding to Cold Boot
[0002.088] starting app android_boot_app
[0002.091] Device state: unlocked
[0002.094] display console init
[0002.103] could not find regulator
[0002.126] hdmi cable not connected
[0002.129] is_hdmi_needed: HDMI not connected, returning false
[0[0002.139] DT entry for leds-pwm not found
002.135] hdmi is not connected
[0002.145] sor0 is not supported
[0002.148] display_console_init: no valid display out_type
[0002.157] subnode volume_up is not found !
[0002.161] subnode back is not found !
[0002.164] subnode volume_down is not found !
[0002.168] subnode menu is not found !
[0002.172] Gpio keyboard init success
[0002.252] found decompressor handler: lz4-legacy
[0002.267] decompressing blob (type 1)…
[0002.332] display_resolution: No display init
[0002.336] Failed to retrieve display resolution
[0002.341] Could not load/initialize BMP blob…ignoring
[0002.416] decompressor handler not found
[0002.419] load_firmware_blob: Firmware blob loaded, entries=2
[0002.425] XUSB blob version 0 size 124416 @ 0x92ca828c
[0002.431] -------> se_aes_verify_sbk_clear: 747
[0002.436] se_aes_verify_sbk_clear: Error
[0002.439] SE operation failed
[0002.442] bl_battery_charging: connected to external power supply
[0002.452] display_console_ioctl: No display init
[0002.456] switch_backlight failed
[0002.462] device_query_partition_size: failed to open partition spiflash0:MSC !
[0002.470] MSC Partition not found
[0002.476] device_query_partition_size: failed to open partition spiflash0:USP !
[0002.483] USP partition read failed!
[0002.487] blob_init: blob-partition USP header read failed
[0002.492] android_boot Unable to update recovery partition
[0002.498] kfs_getpartname: name = LNX
[0002.501] Loading kernel from LNX
[0002.510] Found 19 BFS partitions in “spiflash0”
[0002.827] load kernel from storage
[0002.832] decompressor handler not found
[0003.095] Successfully loaded kernel and ramdisk images
[0003.100] board ID = D78, board SKU = 3
[0003.104] sdmmc node status = okay
[0003.108] sdcard instance = 0
[0003.110] sdcard gpio handle 0x5a
[0003.114] sdcard gpio pin 0xc9
[0003.117] sdcard gpio flags 0x0
[0003.120] vmmc-supply 0x9d
[0003.122] cd_gpio_pin = 201
[0003.125] pin_state = 0
[0003.127] Found sdcard
[0003.130] SD-card IS present …
[0003.133] load_and_boot_kernel: SD card detected OK
[0003.139] display_resolution: No display init
[0003.143] Failed to retrieve display resolution
[0003.147] bmp blob is not loaded and initialized
[0003.152] Failed to display boot-logo
[0003.155] NCK carveout not present
[0003.159] Skipping dts_overrides
[0003.162] NCK carveout not present
[0003.172] Find /i2c@7000c000’s alias i2c0
[0003.176] get eeprom at 1-a0, size 256, type 0
[0003.184] Find /i2c@7000c500’s alias i2c2
[0003.188] get eeprom at 3-a0, size 256, type 0
[0003.193] get eeprom at 3-ae, size 256, type 0
[0003.197] pm_ids_update: Updating 1,a0, size 256, type 0
[0003.202] I2C slave not started
[0003.205] I2C write failed
[0003.208] Writing offset failed
[0003.211] eeprom_init: EEPROM read failed
[0003.215] pm_ids_update: eeprom init failed
[0003.219] pm_ids_update: Updating 3,a0, size 256, type 0
[0003.249] pm_ids_update: The pm board id is 3448-0003-400
[0003.256] Adding plugin-manager/ids/3448-0003-400=/i2c@7000c500:module@0x50
[0003.265] pm_ids_update: pm id update successful
[0003.269] pm_ids_update: Updating 3,ae, size 256, type 0
[0003.299] pm_ids_update: The pm board id is 3542-0000-201
[0003.306] Adding plugin-manager/ids/3542-0000-201=/i2c@7000c500:module@0x57
[0003.314] pm_ids_update: pm id update successful
[0003.344] eeprom_get_mac: EEPROM invalid MAC address (all 0xff)
[0003.350] shim_eeprom_update_mac:267: Failed to update 0 MAC address in DTB
[0003.358] eeprom_get_mac: EEPROM invalid MAC address (all 0xff)
[0003.364] shim_eeprom_update_mac:267: Failed to update 1 MAC address in DTB
[0003.372] updating /chosen/nvidia,ethernet-mac node 48:b0:2d:2e:db:33
[0003.378] Plugin Manager: Parse ODM data 0x000a4000
[0003.391] shim_cmdline_install: /chosen/bootargs: earlycon=uart8250,mmio32,0x70006000
[0003.400] Add serial number:1424320033604 as DT property
[0003.408] Updated bpmp info to DTB
[0003.413] Updated initrd info to DTB
[0003.416] “proc-board” doesn’t exist, creating
[0003.422] Updated board info to DTB
[0003.426] “pmu-board” doesn’t exist, creating
[0003.432] Updated board info to DTB
[0003.435] “display-board” doesn’t exist, creating
[0003.441] Updated board info to DTB
[0003.445] “reset” doesn’t exist, creating
[0003.449] Updated reset info to DTB
[0003.453] display_console_ioctl: No display init
[0003.457] display_console_ioctl: No display init
[0003.462] display_console_ioctl: No display init
[0003.466] Cmdline: tegraid=21.1.2.0.0 ddr_die=2048M@2048M section=256M memtype=0 vpr_resize usb_port_owner_info=0 lane_owner_info=0 emc_max_dvfs=0 touch_id=0@63 video=tegrafb no_console_suspend=1 console=ttyS0,115200n8 debug_uartport=lsport,4 earlyprintk=uart8250-32bit,0x70006000 maxcpus=4 usbcore.old_scheme_first=1 core_edp_mv=1125 core_edp_ma=4000 gpt
[0003.499] DTB cmdline: earlycon=uart8250,mmio32,0x70006000
[0003.504] boot image cmdline: root=/dev/mmcblk0p1 rw rootwait rootfstype=ext4 console=ttyS0,115200n8 console=tty0 fbcon=map:0 net.ifnames=0
[0003.517] Updated bootarg info to DTB
[0003.521] Adding uuid 000000016450a5061400000015fb81c0 to DT
[0003.527] Adding eks info 0 to DT
[0003.532] WARNING: Failed to pass NS DRAM ranges to TOS, err: -7
[0003.538] Updated memory info to DTB
[0003.546] set vdd_core voltage to 1125 mv
[0003.550] setting ‘vdd-core’ regulator to 1125000 micro volts
[0003.556] Found secure-pmc; disable BPMP

U-Boot 2020.04-g6b630d64fd (Feb 19 2021 - 08:37:45 -0800)

SoC: tegra210
Model: NVIDIA Jetson Nano 2GB Developer Kit
Board: NVIDIA P3541-0000
DRAM: 2 GiB
MMC: sdhci@700b0000: 1, sdhci@700b0600: 0
Loading Environment from SPI Flash… SF: Detected mx25u3235f with page size 256 Bytes, erase size 4 KiB, total 4 MiB
*** Warning - bad CRC, using default environment

In: serial
Out: serial
Err: serial
Net: No ethernet found.
Hit any key to stop autoboot: 0
switch to partitions #0, OK
mmc1 is current device
Scanning mmc 1:1…
Found /boot/extlinux/extlinux.conf
Retrieving file: /boot/extlinux/extlinux.conf
838 bytes read in 20 ms (40 KiB/s)
1: primary kernel
Retrieving file: /boot/initrd
7159841 bytes read in 326 ms (20.9 MiB/s)
Retrieving file: /boot/Image
34338824 bytes read in 1501 ms (21.8 MiB/s)
append: tegraid=21.1.2.0.0 ddr_die=2048M@2048M section=256M memtype=0 vpr_resize usb_port_owner_info=0 lane_owner_info=0 emc_max_dvfs=0 touch_id=0@63 video=tegrafb no_console_suspend=1 console=ttyS0,115200n8 debug_uartport=lsport,4 earlyprintk=uart8250-32bit,0x70006000 maxcpus=4 usbcore.old_scheme_first=1 core_edp_mv=1125 core_edp_ma=4000 gpt earlycon=uart8250,mmio32,0x70006000 root=/dev/mmcblk0p1 rw rootwait rootfstype=ext4 console=ttyS0,115200n8 console=tty0 fbcon=map:0 net.ifnames=0 root=/dev/mmcblk0p1 rw rootwait rootfstype=ext4 console=ttyS0,115200n8 console=tty0 fbcon=map:0 net.ifnames=0

Flattened Device Tree blob at 83100000

Booting using the fdt blob at 0x83100000
ERROR: reserving fdt memory region failed (addr=0 size=0)
ERROR: reserving fdt memory region failed (addr=0 size=0)
Using Device Tree in place at 0000000083100000, end 00000000831843cf
copying carveout for /host1x@50000000/dc@54200000…
copying carveout for /host1x@50000000/dc@54240000…

Starting kernel …

[ 0.000000] Booting Linux on physical CPU 0x0
[ 0.000000] Linux version 4.9.201-tegra (buildbrain@mobile-u64-5294-d8000) (gcc version 7.3.1 20180425 [linaro-7.3-2018.05 revision d29120a424ecfbc167ef90065c0eeb7f91977701] (Linaro GCC 7.3-2018.05) ) #1 SMP PREEMPT Fri Feb 19 08:40:32 PST 2021
[ 0.000000] Boot CPU: AArch64 Processor [411fd071]
[ 0.000000] OF: fdt:memory scan node memory@80000000, reg size 48,
[ 0.000000] OF: fdt: - 80000000 , 3f800000
[ 0.000000] OF: fdt: - bfa00000 , 3fe00000
[ 0.000000] OF: fdt: - ffa00000 , 600000
[ 0.000000] earlycon: uart8250 at MMIO32 0x0000000070006000 (options ‘’)
[ 0.000000] bootconsole [uart8250] enabled
[ 0.000000] OF: fdt:Reserved memory: failed to reserve memory for node ‘fb0_carveout’: base 0x0000000000000000, size 0 MiB
[ 0.000000] OF: fdt:Reserved memory: failed to reserve memory for node ‘fb0_carveout’: base 0x0000000000000000, size 0 MiB
[ 0.000000] OF: fdt:Reserved memory: failed to reserve memory for node ‘fb1_carveout’: base 0x0000000000000000, size 0 MiB
[ 0.000000] OF: fdt:Reserved memory: failed to reserve memory for node ‘fb1_carveout’: base 0x0000000000000000, size 0 MiB
[ 0.000000] OF: reserved mem: initialized node iram-carveout, compatible id nvidia,iram-carveout
[ 0.000000] OF: reserved mem: initialized node ramoops_carveout, compatible id nvidia,ramoops
[ 0.000000] cma: Reserved 64 MiB at 0x00000000fb800000
[ 0.000000] psci: probing for conduit method from DT.
[ 0.000000] psci: PSCIv1.0 detected in firmware.
[ 0.000000] psci: Using standard PSCI v0.2 function IDs
[ 0.000000] psci: MIGRATE_INFO_TYPE not supported.
[ 0.000000] psci: SMC Calling Convention v1.1
[ 0.000000] percpu: Embedded 24 pages/cpu s57560 r8192 d32552 u98304
[ 0.000000] CPU features: enabling workaround for ARM erratum 832075
[ 0.000000] Speculative Store Bypass Disable mitigation not required
[ 0.000000] Built 1 zonelists in Zone order, mobility grouping on. Total pages: 514560
[ 0.000000] Kernel command line: tegraid=21.1.2.0.0 ddr_die=2048M@2048M section=256M memtype=0 vpr_resize usb_port_owner_info=0 lane_owner_info=0 emc_max_dvfs=0 touch_id=0@63 video=tegrafb no_console_suspend=1 console=ttyS0,115200n8 debug_uartport=lsport,4 earlyprintk=uart8250-32bit,0x70006000 maxcpus=4 usbcore.old_scheme_first=1 core_edp_mv=1125 core_edp_ma=4000 gpt earlycon=uart8250,mmio32,0x70006000 root=/dev/mmcblk0p1 rw rootwait rootfstype=ext4 console=ttyS0,115200n8 console=tty0 fbcon=map:0 net.ifnames=0 root=/dev/mmcblk0p1 rw rootwait rootfstype=ext4 console=ttyS0,115200n8 console=tty0 fbcon=map:0 net.ifnames=0
[ 0.000000] log_buf_len individual max cpu contribution: 32768 bytes
[ 0.000000] log_buf_len total cpu_extra contributions: 98304 bytes
[ 0.000000] log_buf_len min size: 32768 bytes
[ 0.000000] log_buf_len: 131072 bytes
[ 0.000000] early log buf free: 29564(90%)
[ 0.000000] PID hash table entries: 4096 (order: 3, 32768 bytes)
[ 0.000000] Dentry cache hash table entries: 262144 (order: 9, 2097152 bytes)
[ 0.000000] Inode-cache hash table entries: 131072 (order: 8, 1048576 bytes)
[ 0.000000] Memory: 1946276K/2091008K available (15294K kernel code, 2942K rwdata, 6664K rodata, 8576K init, 609K bss, 79196K reserved, 65536K cma-reserved)
[ 0.000000] Virtual kernel memory layout:
[ 0.000000] modules : 0xffffff8000000000 - 0xffffff8008000000 ( 128 MB)
[ 0.000000] vmalloc : 0xffffff8008000000 - 0xffffffbebfff0000 ( 250 GB)
[ 0.000000] .text : 0xffffff8008080000 - 0xffffff8008f70000 ( 15296 KB)
[ 0.000000] .rodata : 0xffffff8008f70000 - 0xffffff8009600000 ( 6720 KB)
[ 0.000000] .init : 0xffffff8009600000 - 0xffffff8009e60000 ( 8576 KB)
[ 0.000000] .data : 0xffffff8009e60000 - 0xffffff800a13f808 ( 2943 KB)
[ 0.000000] .bss : 0xffffff800a13f808 - 0xffffff800a1d7cbc ( 610 KB)
[ 0.000000] fixed : 0xffffffbefe7fd000 - 0xffffffbefec00000 ( 4108 KB)
[ 0.000000] PCI I/O : 0xffffffbefee00000 - 0xffffffbeffe00000 ( 16 MB)
[ 0.000000] vmemmap : 0xffffffbf00000000 - 0xffffffc000000000 ( 4 GB maximum)
[ 0.000000] 0xffffffbf00000000 - 0xffffffbf02000000 ( 32 MB actual)
[ 0.000000] memory : 0xffffffc000000000 - 0xffffffc080000000 ( 2048 MB)
[ 0.000000] SLUB: HWalign=64, Order=0-3, MinObjects=0, CPUs=4, Nodes=1
[ 0.000000] Preemptible hierarchical RCU implementation.
[ 0.000000] Build-time adjustment of leaf fanout to 64.
[ 0.000000] RCU restricting CPUs from NR_CPUS=64 to nr_cpu_ids=4.
[ 0.000000] RCU: Adjusting geometry for rcu_fanout_leaf=64, nr_cpu_ids=4
[ 0.000000] NR_IRQS:64 nr_irqs:64 0
[ 0.000000] /interrupt-controller@60004000: 192 interrupts forwarded to /interrupt-controller
[ 0.000000] t210 clock and reset probe
[ 0.000000] tegra-pmc: get_secure_pmc_setting: done secure_pmc=1
[ 0.000000] clk_cbus_recalc_rate: no gbus parent
[ 0.000000] clk_cbus_recalc_rate: no gbus parent
[ 0.000000] clk_cbus_recalc_rate: no gbus parent
[ 0.000000] clk_cbus_recalc_rate: no gbus parent
[ 0.000000] clk_cbus_recalc_rate: no gbus parent
[ 0.000000] arm_arch_timer: Architected cp15 timer(s) running at 19.20MHz (phys).
[ 0.000000] clocksource: arch_sys_counter: mask: 0xffffffffffffff max_cycles: 0x46d987e47, max_idle_ns: 440795202767 ns
[ 0.000005] sched_clock: 56 bits at 19MHz, resolution 52ns, wraps every 4398046511078ns
[ 0.010005] Console: colour dummy device 80x25
[ 0.014653] console [tty0] enabled
[ 0.018165] bootconsole [uart8250] disabled
[ 0.000000] Booting Linux on physical CPU 0x0
[ 0.000000] Linux version 4.9.201-tegra (buildbrain@mobile-u64-5294-d8000) (gcc version 7.3.1 20180425 [linaro-7.3-2018.05 revision d29120a424ecfbc167ef90065c0eeb7f91977701] (Linaro GCC 7.3-2018.05) ) #1 SMP PREEMPT Fri Feb 19 08:40:32 PST 2021
[ 0.000000] Boot CPU: AArch64 Processor [411fd071]
[ 0.000000] OF: fdt:memory scan node memory@80000000, reg size 48,
[ 0.000000] OF: fdt: - 80000000 , 3f800000
[ 0.000000] OF: fdt: - bfa00000 , 3fe00000
[ 0.000000] OF: fdt: - ffa00000 , 600000
[ 0.000000] earlycon: uart8250 at MMIO32 0x0000000070006000 (options ‘’)
[ 0.000000] bootconsole [uart8250] enabled
[ 0.000000] OF: fdt:Reserved memory: failed to reserve memory for node ‘fb0_carveout’: base 0x0000000000000000, size 0 MiB
[ 0.000000] OF: fdt:Reserved memory: failed to reserve memory for node ‘fb0_carveout’: base 0x0000000000000000, size 0 MiB
[ 0.000000] OF: fdt:Reserved memory: failed to reserve memory for node ‘fb1_carveout’: base 0x0000000000000000, size 0 MiB
[ 0.000000] OF: fdt:Reserved memory: failed to reserve memory for node ‘fb1_carveout’: base 0x0000000000000000, size 0 MiB
[ 0.000000] OF: reserved mem: initialized node iram-carveout, compatible id nvidia,iram-carveout
[ 0.000000] OF: reserved mem: initialized node ramoops_carveout, compatible id nvidia,ramoops
[ 0.000000] cma: Reserved 64 MiB at 0x00000000fb800000
[ 0.000000] psci: probing for conduit method from DT.
[ 0.000000] psci: PSCIv1.0 detected in firmware.
[ 0.000000] psci: Using standard PSCI v0.2 function IDs
[ 0.000000] psci: MIGRATE_INFO_TYPE not supported.
[ 0.000000] psci: SMC Calling Convention v1.1
[ 0.000000] percpu: Embedded 24 pages/cpu s57560 r8192 d32552 u98304
[ 0.000000] CPU features: enabling workaround for ARM erratum 832075
[ 0.000000] Speculative Store Bypass Disable mitigation not required
[ 0.000000] Built 1 zonelists in Zone order, mobility grouping on. Total pages: 514560
[ 0.000000] Kernel command line: tegraid=21.1.2.0.0 ddr_die=2048M@2048M section=256M memtype=0 vpr_resize usb_port_owner_info=0 lane_owner_info=0 emc_max_dvfs=0 touch_id=0@63 video=tegrafb no_console_suspend=1 console=ttyS0,115200n8 debug_uartport=lsport,4 earlyprintk=uart8250-32bit,0x70006000 maxcpus=4 usbcore.old_scheme_first=1 core_edp_mv=1125 core_edp_ma=4000 gpt earlycon=uart8250,mmio32,0x70006000 root=/dev/mmcblk0p1 rw rootwait rootfstype=ext4 console=ttyS0,115200n8 console=tty0 fbcon=map:0 net.ifnames=0 root=/dev/mmcblk0p1 rw rootwait rootfstype=ext4 console=ttyS0,115200n8 console=tty0 fbcon=map:0 net.ifnames=0
[ 0.000000] log_buf_len individual max cpu contribution: 32768 bytes
[ 0.000000] log_buf_len total cpu_extra contributions: 98304 bytes
[ 0.000000] log_buf_len min size: 32768 bytes
[ 0.000000] log_buf_len: 131072 bytes
[ 0.000000] early log buf free: 29564(90%)
[ 0.000000] PID hash table entries: 4096 (order: 3, 32768 bytes)
[ 0.000000] Dentry cache hash table entries: 262144 (order: 9, 2097152 bytes)
[ 0.000000] Inode-cache hash table entries: 131072 (order: 8, 1048576 bytes)
[ 0.000000] Memory: 1946276K/2091008K available (15294K kernel code, 2942K rwdata, 6664K rodata, 8576K init, 609K bss, 79196K reserved, 65536K cma-reserved)
[ 0.000000] Virtual kernel memory layout:
[ 0.000000] modules : 0xffffff8000000000 - 0xffffff8008000000 ( 128 MB)
[ 0.000000] vmalloc : 0xffffff8008000000 - 0xffffffbebfff0000 ( 250 GB)
[ 0.000000] .text : 0xffffff8008080000 - 0xffffff8008f70000 ( 15296 KB)
[ 0.000000] .rodata : 0xffffff8008f70000 - 0xffffff8009600000 ( 6720 KB)
[ 0.000000] .init : 0xffffff8009600000 - 0xffffff8009e60000 ( 8576 KB)
[ 0.000000] .data : 0xffffff8009e60000 - 0xffffff800a13f808 ( 2943 KB)
[ 0.000000] .bss : 0xffffff800a13f808 - 0xffffff800a1d7cbc ( 610 KB)
[ 0.000000] fixed : 0xffffffbefe7fd000 - 0xffffffbefec00000 ( 4108 KB)
[ 0.000000] PCI I/O : 0xffffffbefee00000 - 0xffffffbeffe00000 ( 16 MB)
[ 0.000000] vmemmap : 0xffffffbf00000000 - 0xffffffc000000000 ( 4 GB maximum)
[ 0.000000] 0xffffffbf00000000 - 0xffffffbf02000000 ( 32 MB actual)
[ 0.000000] memory : 0xffffffc000000000 - 0xffffffc080000000 ( 2048 MB)
[ 0.000000] SLUB: HWalign=64, Order=0-3, MinObjects=0, CPUs=4, Nodes=1
[ 0.000000] Preemptible hierarchical RCU implementation.
[ 0.000000] Build-time adjustment of leaf fanout to 64.
[ 0.000000] RCU restricting CPUs from NR_CPUS=64 to nr_cpu_ids=4.
[ 0.000000] RCU: Adjusting geometry for rcu_fanout_leaf=64, nr_cpu_ids=4
[ 0.000000] NR_IRQS:64 nr_irqs:64 0
[ 0.000000] /interrupt-controller@60004000: 192 interrupts forwarded to /interrupt-controller
[ 0.000000] t210 clock and reset probe
[ 0.000000] tegra-pmc: get_secure_pmc_setting: done secure_pmc=1
[ 0.000000] clk_cbus_recalc_rate: no gbus parent
[ 0.000000] clk_cbus_recalc_rate: no gbus parent
[ 0.000000] clk_cbus_recalc_rate: no gbus parent
[ 0.000000] clk_cbus_recalc_rate: no gbus parent
[ 0.000000] clk_cbus_recalc_rate: no gbus parent
[ 0.000000] arm_arch_timer: Architected cp15 timer(s) running at 19.20MHz (phys).
[ 0.000000] clocksource: arch_sys_counter: mask: 0xffffffffffffff max_cycles: 0x46d987e47, max_idle_ns: 440795202767 ns
[ 0.000005] sched_clock: 56 bits at 19MHz, resolution 52ns, wraps every 4398046511078ns
[ 0.010005] Console: colour dummy device 80x25
[ 0.014653] console [tty0] enabled
[ 0.018165] bootconsole [uart8250] disabled
[ 0.022491] kmemleak: Kernel memory leak detector disabled
[ 0.022516] Calibrating delay loop (skipped), value calculated using timer frequency… 38.40 BogoMIPS (lpj=76800)
[ 0.022538] pid_max: default: 32768 minimum: 301
[ 0.022999] Security Framework initialized
[ 0.023223] Mount-cache hash table entries: 4096 (order: 3, 32768 bytes)
[ 0.023235] Mountpoint-cache hash table entries: 4096 (order: 3, 32768 bytes)
[ 0.024313] ftrace: allocating 47208 entries in 185 pages
[ 0.192809] ASID allocator initialised with 65536 entries
[ 0.232171] tegra-id: chipid=22117.
[ 0.232203] tegra-id: opt_subrevision=0.
[ 0.232226] Tegra Speedo/IDDQ fuse revision 4
[ 0.232236] Tegra: CPU Speedo ID 9, SoC Speedo ID 0, GPU Speedo ID 2
[ 0.232246] Tegra: CPU Process ID 0, SoC Process ID 0, GPU Process ID 0
[ 0.232257] Tegra: CPU Speedo Value 1944, SoC Speedo Value 1890, GPU Speedo Value 1989
[ 0.232268] Tegra: CPU IDDQ Value 1288, SoC IDDQ Value 1648, GPU IDDQ Value 1950
[ 0.232293] Tegra Revision: A02 SKU: 0x8f CPU Process: 0 SoC Process: 0
[ 0.232314] DTS File Name: /dvs/git/dirty/git-master_linux/kernel/kernel-4.9/arch/arm64/boot/dts/…/…/…/…/…/…/hardware/nvidia/platform/t210/batuu/kernel-dts/tegra210-p3448-0003-p3542-0000.dts
[ 0.232335] DTB Build time: Feb 19 2021 08:42:41
[ 0.281270] CPU1: Booted secondary processor [411fd071]
[ 0.313176] CPU2: Booted secondary processor [411fd071]
[ 0.345152] CPU3: Booted secondary processor [411fd071]
[ 0.345246] Brought up 4 CPUs
[ 0.345299] SMP: Total of 4 processors activated.
[ 0.345315] CPU features: detected feature: 32-bit EL0 Support
[ 0.345584] CPU: All CPU(s) started at EL2
[ 0.345612] alternatives: patching kernel code
[ 0.353037] devtmpfs: initialized
[ 0.393518] Initilizing CustomIPI irq domain
[ 0.393926] clocksource: jiffies: mask: 0xffffffff max_cycles: 0xffffffff, max_idle_ns: 7645041785100000 ns
[ 0.393970] futex hash table entries: 1024 (order: 4, 65536 bytes)
[ 0.395672] pinctrl core: initialized pinctrl subsystem
[ 0.396144] OS set in device tree is not L4T.
[ 0.396527] regulator-dummy: no parameters
[ 0.396802] Initializing plugin-manager
[ 0.396952] Plugin module not found
[ 0.397322] node /plugin-manager/fragment@1 match with board >=3448-0003-400
[ 0.398498] node /plugin-manager/fragement@7 match with odm-data enable-pmic-wdt
[ 0.398723] node /plugin-manager/fragement@8 match with odm-data enable-pmic-wdt
[ 0.399143] node /plugin-manager/fragement@9 match with board >=3448-0003-000
[ 0.400457] node /plugin-manager/fragment@12 match with board >=3448-0003-400
[ 0.400735] node /plugin-manager/fragement@13 match with board >=3448-0003-400
[ 0.404391] NET: Registered protocol family 16
[ 0.405773] pstore: using zlib compression
[ 0.406264] console [pstore-1] enabled
[ 0.406279] pstore: Registered ramoops as persistent store backend
[ 0.406296] ramoops: attached 0x200000@0xb0000000, ecc: 0/0
[ 0.421298] cpuidle: using governor menu
[ 0.424510] tegra_smmu 70019000.iommu: Loaded Tegra IOMMU driver
[ 0.426384] vdso: 2 pages (1 code @ ffffff8008f77000, 1 data @ ffffff8009e64000)
[ 0.426427] hw-breakpoint: found 6 breakpoint and 4 watchpoint registers.
[ 0.429681] atomic_pool_init():622: DMA: preallocated 1024 KiB pool for atomic allocations
[ 0.432249] Serial: AMBA PL011 UART driver
[ 0.432777] tegra_powergate_init: DONE
[ 0.432808] DTS File Name: /dvs/git/dirty/git-master_linux/kernel/kernel-4.9/arch/arm64/boot/dts/…/…/…/…/…/…/hardware/nvidia/platform/t210/batuu/kernel-dts/tegra210-p3448-0003-p3542-0000.dts
[ 0.432843] DTB Build time: Feb 19 2021 08:42:41
[ 0.434978] Tegra reboot handler registered.
[ 0.439499] iommu: Adding device tegra-carveouts to group 0
[ 0.439640] platform tegra-carveouts: domain=ffffffc078bed018 allocates as[0]=ffffffc0784540a8
[ 0.440003] iommu: Adding device smmu_test to group 1
[ 0.440066] platform smmu_test: domain=ffffffc078bed258 allocates as[0]=ffffffc078454110
[ 0.440880] mc: mapped MMIO address: 0xffffff800802e000 → 0x70019000
[ 0.440954] mc: mapped MMIO address: 0xffffff8008065000 → 0x7001c000
[ 0.441025] mc: mapped MMIO address: 0xffffff8008079000 → 0x7001d000
[ 0.441046] nv-tegra-mc 70019000.mc: No mssnvlink node
[ 0.441075] mc-err: mcerr ops are set to t21x
[ 0.451443] iommu: Adding device 70090000.xusb to group 2
[ 0.451744] iommu: Adding device 70006000.serial to group 3
[ 0.451819] platform 70006000.serial: domain=ffffffc078b27918 allocates as[0]=ffffffc078454178
[ 0.452259] iommu: Adding device 70006040.serial to group 4
[ 0.452536] iommu: Adding device 70006200.serial to group 5
[ 0.452749] iommu: Adding device sound to group 6
[ 0.452808] platform sound: domain=ffffffc078b27e58 allocates as[0]=ffffffc0784541e0
[ 0.453405] iommu: Adding device 7000d400.spi to group 7
[ 0.453678] iommu: Adding device 7000d600.spi to group 8
[ 0.453998] iommu: Adding device 70410000.spi to group 9
[ 0.454324] iommu: Adding device 50000000.host1x to group 10
[ 0.454610] iommu: Adding device 54080000.vi to group 11
[ 0.455002] iommu: Adding device 54600000.isp to group 12
[ 0.455275] iommu: Adding device 54680000.isp to group 13
[ 0.455580] iommu: Adding device tegradc.0 to group 14
[ 0.455642] platform tegradc.0: domain=ffffffc0784f2d98 allocates as[0]=ffffffc078454248
[ 0.456030] iommu: Adding device 54340000.vic to group 15
[ 0.456247] iommu: Adding device 544c0000.nvenc to group 16
[ 0.456492] iommu: Adding device 54500000.tsec to group 17
[ 0.456704] iommu: Adding device 54100000.tsecb to group 18
[ 0.456911] iommu: Adding device 54480000.nvdec to group 19
[ 0.457120] iommu: Adding device 54380000.nvjpg to group 20
[ 0.457863] iommu: Adding device 546c0000.i2c to group 21
[ 0.458207] iommu: Adding device 57000000.gpu to group 22
[ 0.458270] platform 57000000.gpu: domain=ffffffc078554c18 allocates as[0]=ffffffc0784542b0
[ 0.458330] platform 57000000.gpu: domain=ffffffc078554c18 allocates as[1]=ffffffc078454318
[ 0.458405] platform 57000000.gpu: domain=ffffffc078554c18 allocates as[2]=ffffffc078454380
[ 0.458458] platform 57000000.gpu: domain=ffffffc078554c18 allocates as[3]=ffffffc0784543e8
[ 0.459326] tegra-pmc 7000e400.pmc: i2c-thermtrip node not found, emergency thermal reset disabled.
[ 0.459364] tegra-pmc 7000e400.pmc: scratch reg offset dts data not present
[ 0.459391] tegra-pmc: ### PMC reset source: TEGRA_POWER_ON_RESET
[ 0.459409] tegra-pmc: ### PMC reset level: TEGRA_RESET_LEVEL_WARM
[ 0.459426] tegra-pmc: ### PMC reset status reg: 0x0
[ 0.509337] padctrl padctrl.0: Pad control driver tegra-pmc-padctrl registered
[ 0.509371] tegra-pmc: Clear bootloader IO dpd settings
[ 0.509406] tegra-pmc 7000e400.pmc: IO padctrl driver initialized
[ 0.509490] tegra-pmc 7000e400.pmc: PMC: Successfully configure bootrom reset commands
[ 0.509784] iommu: Adding device 70012000.se to group 23
[ 0.510573] iommu: Adding device 7000c000.i2c to group 24
[ 0.510877] iommu: Adding device 7000c400.i2c to group 25
[ 0.511142] iommu: Adding device 7000c500.i2c to group 26
[ 0.511406] iommu: Adding device 7000c700.i2c to group 27
[ 0.511671] iommu: Adding device 7000d000.i2c to group 28
[ 0.511931] iommu: Adding device 7000d100.i2c to group 29
[ 0.512250] iommu: Adding device sdhci-tegra.0 to group 30
[ 0.512314] platform sdhci-tegra.0: domain=ffffffc07856be58 allocates as[0]=ffffffc078454450
[ 0.513144] iommu: Adding device 700d0000.xudc to group 31
[ 0.516288] vdd-ac-bat: 5000 mV
[ 0.516683] vdd-5v0-sys: 5000 mV
[ 0.517636] vdd-5v0-hdmi: supplied by vdd-5v0-sys
[ 0.517694] vdd-5v0-hdmi: 5000 mV
[ 0.518085] vdd-1v8-sys: 1800 mV
[ 0.518512] vdd-fan: supplied by vdd-5v0-sys
[ 0.518585] vdd-fan: 5000 mV
[ 0.519000] vdd-usb-vbus: supplied by vdd-5v0-sys
[ 0.519049] vdd-usb-vbus: 5000 mV
[ 0.519596] vdd-usb-vbus2: 5000 mV
[ 0.554261] HugeTLB registered 2 MB page size, pre-allocated 0 pages
[ 0.556645] gpio gpiochip0: gpio-line-names specifies 240 line names but there are 256 lines on the chip
[ 0.557842] GPIO line 151 (camera-control-output-low) hogged as output/low
[ 0.557880] GPIO line 152 (camera-control-output-low) hogged as output/low
[ 0.557929] GPIO line 6 (system-suspend-gpio) hogged as output/high
[ 0.558307] gpiochip_setup_dev: registered GPIOs 0 to 255 on device: gpiochip0 (tegra-gpio)
[ 0.566207] eventlib_kernel: keventlib is initialized, test id: 0
[ 0.566576] SCSI subsystem initialized
[ 0.567075] usbcore: registered new interface driver usbfs
[ 0.567145] usbcore: registered new interface driver hub
[ 0.567229] usbcore: registered new device driver usb
[ 0.571085] max77620 4-003c: PMIC Version OTP:0x35 and ES:0x8
[ 0.577293] vdd-core: 600 <–> 1162 mV at 1125 mV
[ 0.577466] random: fast init done
[ 0.578341] vdd-ddr-1v1: Bringing 1125000uV into 1150000-1150000uV
[ 0.581184] vdd-ddr-1v1: 1150 mV
[ 0.585216] vdd-pre-reg-1v35: 1350 mV
[ 0.589170] vdd-1v8: 1800 mV
[ 0.593167] avdd-sys-1v2: 1200 mV
[ 0.597169] vdd-pex-1v0: 1050 mV
[ 0.597846] vddio-sdmmc-ap: 1800 <–> 3300 mV at 3300 mV
[ 0.598394] max77620-ldo3: at 3100 mV
[ 0.601169] vdd-rtc: 850 <–> 1100 mV at 1000 mV
[ 0.601741] max77620-ldo5: at 3100 mV
[ 0.602288] max77620-ldo6: at 2800 mV
[ 0.605168] avdd-1v05-pll: 1050 mV
[ 0.609168] avdd-io-hdmi-dp: 1050 mV
[ 0.611816] GPIO line 505 (spmic-default-output-high) hogged as output/high
[ 0.612105] gpiochip_setup_dev: registered GPIOs 504 to 511 on device: gpiochip1 (max77620-gpio)
[ 0.612413] max77620 4-003c: max77620 probe successful
[ 0.615056] media: Linux media interface: v0.10
[ 0.615127] Linux video capture interface: v2.00
[ 0.616076] pps_core: LinuxPPS API ver. 1 registered
[ 0.616099] pps_core: Software ver. 5.3.6 - Copyright 2005-2007 Rodolfo Giometti giometti@linux.it
[ 0.616143] PTP clock support registered
[ 0.619389] tegra210-emc 7001b000.external-memory-controller: validated EMC DFS table
[ 0.620252] Advanced Linux Sound Architecture Driver Initialized.
[ 0.620925] Bluetooth: Core ver 2.22
[ 0.620989] NET: Registered protocol family 31
[ 0.621008] Bluetooth: HCI device and connection manager initialized
[ 0.621038] Bluetooth: HCI socket layer initialized
[ 0.621059] Bluetooth: L2CAP socket layer initialized
[ 0.621095] Bluetooth: SCO socket layer initialized
[ 0.622879] tegra210_dvfs: no clock found for sdmmc2_ddr
[ 0.622917] tegra210_dvfs: no clock found for sdmmc4_ddr
[ 0.622979] tegra210_dvfs: no clock found for sdmmc1_ddr
[ 0.623006] tegra210_dvfs: no clock found for sdmmc3_ddr
[ 0.626596] tegra_dvfs: Unable to get vdd-cpu rail for step info, defering probe
[ 0.627894] vdd-3v3-sys: supplied by vdd-5v0-sys
[ 0.627982] vdd-3v3-sys: 3300 mV
[ 0.628278] vdd-1v8-sys: supplied by vdd-3v3-sys
[ 0.633461] vdd-usb-vbus2: supplied by vdd-3v3-sys
[ 0.633956] vdd-3v3-sd: supplied by vdd-3v3-sys
[ 0.634009] vdd-3v3-sd: 3300 mV
[ 0.635092] avdd-io-edp-1v05: supplied by avdd-1v05-pll
[ 0.635144] avdd-io-edp-1v05: 1050 mV
[ 0.635607] vdd-usb-hub-en: supplied by vdd-1v8-sys
[ 0.635660] vdd-usb-hub-en: 5000 mV
[ 0.637088] camchar: rtcpu character device driver loaded
[ 0.637992] extcon-gpio-states extcon:extcon@1: Cable state:0, cable id:0
[ 0.639321] clocksource: Switched to clocksource arch_sys_counter
[ 0.679150] VFS: Disk quotas dquot_6.6.0
[ 0.679365] VFS: Dquot-cache hash table entries: 512 (order 0, 4096 bytes)
[ 0.679867] nvmap_heap_init: nvmap_heap_init: created heap block cache
[ 0.680274] nvmap: nvmap_select_cache_ops() nvmap cache ops set to set/ways
[ 0.680308] nvmap_page_pool_init: Total RAM pages: 502953
[ 0.680325] nvmap_page_pool_init: nvmap page pool size: 62869 pages (245 MB)
[ 0.680452] nvmap_background_zero_thread: PP zeroing thread starting.
[ 0.680701] misc nvmap: iram :dma coherent mem declare 0x0000000040001000,258048
[ 0.680900] misc nvmap: created heap iram base 0x0000000040001000 size (252KiB)
[ 0.689943] thermal thermal_zone0: Registering thermal zone thermal_zone0 for type AO-therm
[ 0.690497] thermal thermal_zone1: Registering thermal zone thermal_zone1 for type CPU-therm
[ 0.690902] thermal thermal_zone2: Registering thermal zone thermal_zone2 for type GPU-therm
[ 0.691216] thermal thermal_zone3: Registering thermal zone thermal_zone3 for type PLL-therm
[ 0.691467] thermal thermal_zone4: Registering thermal zone thermal_zone4 for type PMIC-Die
[ 0.691765] pre_t19x_iso_plat_init(): iso emc max clk=1600000KHz
[ 0.691786] pre_t19x_iso_plat_init(): max_iso_bw=11520000KB
[ 0.692239] NET: Registered protocol family 2
[ 0.693223] TCP established hash table entries: 16384 (order: 5, 131072 bytes)
[ 0.693358] TCP bind hash table entries: 16384 (order: 6, 262144 bytes)
[ 0.693620] TCP: Hash tables configured (established 16384 bind 16384)
[ 0.693776] UDP hash table entries: 1024 (order: 3, 32768 bytes)
[ 0.693837] UDP-Lite hash table entries: 1024 (order: 3, 32768 bytes)
[ 0.694199] NET: Registered protocol family 1
[ 0.694911] RPC: Registered named UNIX socket transport module.
[ 0.694935] RPC: Registered udp transport module.
[ 0.694951] RPC: Registered tcp transport module.
[ 0.694966] RPC: Registered tcp NFSv4.1 backchannel transport module.
[ 0.695250] Trying to unpack rootfs image as initramfs…
[ 0.997745] Freeing initrd memory: 6992K
[ 1.007792] host1x 50000000.host1x: initialized
[ 1.009589] hw perfevents: enabled with armv8_pmuv3 PMU driver, 7 counters available
[ 1.012803] audit: initializing netlink subsys (disabled)
[ 1.012900] audit: type=2000 audit(0.855:1): initialized
[ 1.013628] workingset: timestamp_bits=46 max_order=19 bucket_order=0
[ 1.023360] squashfs: version 4.0 (2009/01/31) Phillip Lougher
[ 1.024850] ntfs: driver 2.1.32 [Flags: R/W].
[ 1.025670] 9p: Installing v9fs 9p2000 file system support
[ 1.029027] Block layer SCSI generic (bsg) driver version 0.4 loaded (major 240)
[ 1.029189] io scheduler noop registered
[ 1.029490] io scheduler cfq registered (default)
[ 1.032199] gic 702f9000.agic: GIC IRQ controller registered
[ 1.035163] iommu: Adding device 702ef000.adsp to group 32
[ 1.044458] iommu: Adding device aconnect@702c0000:adsp_audio to group 33
[ 1.044629] tegra-aconnect aconnect@702c0000: Tegra ACONNECT bus registered
[ 1.045247] tegra-xusb-padctl 7009f000.xusb_padctl: TEGRA_FUSE_SKU_CALIB_0 = 0x91c8412
[ 1.045275] tegra-xusb-padctl 7009f000.xusb_padctl: TEGRA_FUSE_USB_CALIB_EXT_0 = 0x4
[ 1.046928] tegra-xusb-padctl 7009f000.xusb_padctl: dev = phy-usb2.0, lane = usb2-0, function = xusb
[ 1.047054] tegra-xusb-padctl 7009f000.xusb_padctl: dev = phy-usb2.1, lane = usb2-1, function = xusb
[ 1.047165] tegra-xusb-padctl 7009f000.xusb_padctl: dev = phy-usb2.2, lane = usb2-2, function = xusb
[ 1.047445] tegra-xusb-padctl 7009f000.xusb_padctl: dev = phy-pcie.3, lane = pcie-0, function = pcie-x1
[ 1.047575] tegra-xusb-padctl 7009f000.xusb_padctl: dev = phy-pcie.4, lane = pcie-1, function = pcie-x4
[ 1.047695] tegra-xusb-padctl 7009f000.xusb_padctl: dev = phy-pcie.5, lane = pcie-2, function = pcie-x4
[ 1.047807] tegra-xusb-padctl 7009f000.xusb_padctl: dev = phy-pcie.6, lane = pcie-3, function = pcie-x4
[ 1.047916] tegra-xusb-padctl 7009f000.xusb_padctl: dev = phy-pcie.7, lane = pcie-4, function = pcie-x4
[ 1.048024] tegra-xusb-padctl 7009f000.xusb_padctl: dev = phy-pcie.8, lane = pcie-5, function = xusb
[ 1.048125] tegra-xusb-padctl 7009f000.xusb_padctl: dev = phy-pcie.9, lane = pcie-6, function = xusb
[ 1.055139] tegra-pwm 7000a000.pwm: PWM clk cannot sleep in ops
[ 1.056945] tegra-dfll-pwm 70110000.pwm: DFLL pwm-rate: 12800000
[ 1.058855] tegra-pcie 1003000.pcie: 4x1, 1x1 configuration
[ 1.058918] tegra-pcie 1003000.pcie: PHY get deferred: -517
[ 1.058937] tegra-pcie 1003000.pcie: failed to get PHYs: -517
[ 1.060370] tegra_camera_platform tegra-camera-platform: tegra_camera_probe:camera_platform_driver probe
[ 1.060620] misc tegra_camera_ctrl: tegra_camera_isomgr_register isp_iso_bw=1500000, vi_iso_bw=750000, max_bw=1500000
[ 1.060863] Adding domain tsec-pd to PM domain host1x-pd
[ 1.063790] tsec 54500000.tsec: initialized
[ 1.065204] tsec 54100000.tsecb: initialized
[ 1.065915] Adding domain nvdec-pd to PM domain host1x-pd
[ 1.069640] nvdec 54480000.nvdec: initialized
[ 1.070735] Adding domain vic03-pd to PM domain host1x-pd
[ 1.070933] Adding domain msenc-pd to PM domain host1x-pd
[ 1.071104] Adding domain nvjpg-pd to PM domain host1x-pd
[ 1.075308] falcon 54340000.vic: initialized
[ 1.076592] falcon 544c0000.nvenc: initialized
[ 1.077930] falcon 54380000.nvjpg: initialized
[ 1.082271] tegra_cec 70015000.tegra_cec: dt=1 start=0x70015000 end=0x70015FFF irq=95
[ 1.082351] tegra_cec 70015000.tegra_cec: Enable clock result: 0.
[ 1.082390] tegradc tegradc.0: disp0 connected to head0->/host1x/sor1
[ 1.082399] tegra_cec 70015000.tegra_cec: tegra_cec_init started
[ 1.082515] display board info: id 0x0, fab 0x0
[ 1.082588] generic_infoframe_type: 0x87
[ 1.082681] tegra_cec 70015000.tegra_cec: cec_add_sysfs ret=0
[ 1.082702] tegra_cec 70015000.tegra_cec: probed
[ 1.082746] tegradc tegradc.0: DT parsed successfully
[ 1.082812] tegradc tegradc.0: Display dc.ffffff800ab80000 registered with id=0
[ 1.090044] tegra-apbdma 60020000.dma: Tegra20 APB DMA driver register 32 channels
[ 1.095300] tegradc tegradc.0: probed
[ 1.095384] tegra-adma 702e2000.adma: Tegra210 ADMA driver registered 22 channels
[ 1.096208] Console: switching to colour frame buffer device 80x30
[ 1.096221] tegra-fuse-burn 7000f800.efuse:efuse-burn: shutdown limit check disabled
[ 1.096225] tegra-fuse-burn 7000f800.efuse:efuse-burn: Fuse burn driver initialized
[ 1.096275] tegradc tegradc.0: fb registered
[ 1.096693] kfuse 7000fc00.kfuse: initialized
[ 1.097686] tegra-pmc-iopower pmc-iopower: Regulator supply iopower-dbg-supply not available
[ 1.098515] tegra-pmc-iopower pmc-iopower: NO_IOPOWER setting 0x0
[ 1.099493] tegra-dfll-pwm 70110000.pwm: DFLL_PWM regulator is available now
[ 1.099522] vdd-cpu: 708 <–> 1322 mV at 708 mV
[ 1.099905] pwm-regulator pwm_regulators:pwm-regulator@0: PWM regulator registration passed
[ 1.101226] vdd-gpu: applied init 1000000uV constraint
[ 1.101245] vdd-gpu: 708 <–> 1323 mV at 997 mV
[ 1.101634] pwm-regulator pwm_regulators:pwm-regulator@1: PWM regulator registration passed
[ 1.105269] Serial: 8250/16550 driver, 4 ports, IRQ sharing disabled
[ 1.105385] No Device Node present for smmu client: serial8250 !!
[ 1.105404] platform serial8250: No iommus property found in DT node, got swgids from fixup(101004000)
[ 1.105453] iommu: Adding device serial8250 to group 34
[ 1.107782] console [ttyS0] disabled
[ 1.107869] 70006000.serial: ttyS0 at MMIO 0x70006000 (irq = 63, base_baud = 25500000) is a Tegra
[ 2.110780] tegra_cec 70015000.tegra_cec: Can’t find physical addresse.
[ 2.110786] tegra_cec 70015000.tegra_cec: tegra_cec_init Done.
[ 3.324910] console [ttyS0] enabled
[ 3.329463] 70006040.serial: ttyTHS1 at MMIO 0x70006040 (irq = 64, base_baud = 0) is a TEGRA_UART
[ 3.338692] serial-tegra 70006200.serial: RX in PIO mode
[ 3.344124] 70006200.serial: ttyTHS2 at MMIO 0x70006200 (irq = 65, base_baud = 0) is a TEGRA_UART
[ 3.354015] [drm] Initialized
[ 3.367398] brd: module loaded
[ 3.375895] loop: module loaded
[ 3.379163] tegra_profiler: version: 1.143, samples/io: 48/28
[ 3.385061] tegra_profiler: auth: init
[ 3.390182] THERMAL EST: found 2 subdevs
[ 3.394146] THERMAL EST num_resources: 0
[ 3.398081] [THERMAL EST subdev 0]
[ 3.401524] [THERMAL EST subdev 1]
[ 3.405389] thermal thermal_zone5: Registering thermal zone thermal_zone5 for type thermal-fan-est
[ 3.414359] THERMAL EST: thz register success.
[ 3.418950] THERMAL EST: end of probe, return err: 0
[ 3.425085] sd: No Scsi addr parsed to reserve index
[ 3.430129] hisi_sas: driver version v1.6
[ 3.438755] tegra-qspi 70410000.spi: Prod settings list not found
[ 3.446043] qspi_mtd spi32766.0: MX25U3235F (4096 Kbytes)
[ 3.451475] qspi_mtd spi32766.0: mtd .name = spi32766.0, .size = 0x400000 (4MiB) .erasesize = 0x00001000 (4KiB) .numeraseregions = 0
[ 3.466391] libphy: Fixed MDIO Bus: probed
[ 3.471692] tun: Universal TUN/TAP device driver, 1.6
[ 3.476766] tun: (C) 1999-2004 Max Krasnyansky maxk@qualcomm.com
[ 3.483953] e1000e: Intel(R) PRO/1000 Network Driver - 3.2.6-k
[ 3.489808] e1000e: Copyright(c) 1999 - 2015 Intel Corporation.
[ 3.495791] igb: Intel(R) Gigabit Ethernet Network Driver - version 5.4.0-k
[ 3.502757] igb: Copyright (c) 2007-2014 Intel Corporation.
[ 3.508395] igbvf: Intel(R) Gigabit Virtual Function Network Driver - version 2.4.0-k
[ 3.516230] igbvf: Copyright (c) 2009 - 2012 Intel Corporation.
[ 3.522204] Intel(R) 10GbE PCI Express Linux Network Driver - version 4.6.4
[ 3.529172] Copyright(c) 1999 - 2017 Intel Corporation.
[ 3.535501] PPP generic driver version 2.4.2
[ 3.539976] PPP BSD Compression module registered
[ 3.544695] PPP Deflate Compression module registered
[ 3.549794] PPP MPPE Compression module registered
[ 3.554595] NET: Registered protocol family 24
[ 3.559118] usbcore: registered new interface driver r8152
[ 3.564655] usbcore: registered new interface driver asix
[ 3.570111] usbcore: registered new interface driver ax88179_178a
[ 3.576247] usbcore: registered new interface driver cdc_ether
[ 3.582126] usbcore: registered new interface driver net1080
[ 3.587824] usbcore: registered new interface driver cdc_subset
[ 3.593787] usbcore: registered new interface driver zaurus
[ 3.599422] usbcore: registered new interface driver cdc_ncm
[ 3.605243] VFIO - User Level meta-driver version: 0.3
[ 3.611566] ehci_hcd: USB 2.0 ‘Enhanced’ Host Controller (EHCI) Driver
[ 3.618121] ehci-pci: EHCI PCI platform driver
[ 3.622618] ohci_hcd: USB 1.1 ‘Open’ Host Controller (OHCI) Driver
[ 3.628813] ohci-pci: OHCI PCI platform driver
[ 3.633307] ohci-platform: OHCI generic platform driver
[ 3.640206] usbcore: registered new interface driver uas
[ 3.645596] usbcore: registered new interface driver usb-storage
[ 3.651713] usbcore: registered new interface driver usbserial
[ 3.661153] mousedev: PS/2 mouse device common for all mice
[ 3.666825] usbcore: registered new interface driver xpad
[ 3.803308] max77686-rtc max77620-rtc: rtc core: registered max77620-rtc as rtc0
[ 3.813110] rtc rtc1: alarm rtc device
[ 3.816896] tegra_rtc 7000e000.rtc: rtc core: registered 7000e000.rtc as rtc1
[ 3.824068] tegra_rtc 7000e000.rtc: Tegra internal Real Time Clock
[ 3.830780] i2c /dev entries driver
[ 3.836166] imx219 6-0010: tegracam sensor driver:imx219_v2.0.6
[ 3.865438] tegra-vii2c 546c0000.i2c: no acknowledge from address 0x10
[ 3.872051] imx219 6-0010: imx219_board_setup: error during i2c read probe (-121)
[ 3.879655] imx219 6-0010: board setup failed
[ 3.884091] imx219: probe of 6-0010 failed with error -121
[ 3.890771] max77620-power max77620-power: Event recorder REG_NVERC : 0x0
[ 3.900042] tegra_soctherm 700e2000.soctherm: pllx_offset tz:0 max:14, min:2
[ 3.907133] tegra_soctherm 700e2000.soctherm: pllx_offset tz:2 max:8, min:4
[ 3.914547] tegra_soctherm 700e2000.soctherm: soctherm: trip temperature -2147483647 forced to -127000
[ 3.923886] tegra_soctherm 700e2000.soctherm: thermtrip: will shut down when cpu reaches 102500 mC
[ 3.932863] tegra_soctherm 700e2000.soctherm: throttrip: will throttle when cpu reaches 100500 mC
[ 3.941894] tegra_soctherm 700e2000.soctherm: soctherm: trip temperature -2147483647 forced to -127000
[ 3.951221] tegra_soctherm 700e2000.soctherm: thermtrip: will shut down when gpu reaches 103000 mC
[ 3.960188] tegra_soctherm 700e2000.soctherm: throttrip: will throttle when gpu reaches 101000 mC
[ 3.969219] tegra_soctherm 700e2000.soctherm: soctherm: trip temperature -2147483647 forced to -127000
[ 3.978537] tegra_soctherm 700e2000.soctherm: thermtrip: will shut down when pll reaches 127000 mC
[ 3.987505] tegra_soctherm 700e2000.soctherm: throttrip: pll: missing hot temperature
[ 3.995555] tegra_soctherm 700e2000.soctherm: failed to register sensor: -19
[ 4.003413] tegra_aotag tegra-aotag: Registering sensor 0
[ 4.008912] tegra_aotag tegra-aotag: Bound to TZ : ID 0
[ 4.014157] tegra_aotag tegra-aotag: Probe done [SUCCESS]:0
[ 4.020634] tegra_soctherm 700e2000.soctherm: soctherm: trip temperature -2147483647 forced to -127000
[ 4.029974] tegra_dfll_action dfll-cdev-cap: Tegra DFLL ‘cap cooling device’ registered
[ 4.038198] tegra_dfll_action dfll-cdev-floor: Tegra DFLL ‘floor cooling device’ registered
[ 4.046954] parse_throttle_dt_data: Num cap clks = 6
[ 4.051935] parse_throttle_dt_data: clk=cclk_g type=2
[ 4.057012] parse_throttle_dt_data: clk=gpu type=4
[ 4.061836] parse_throttle_dt_data: clk=cap.throttle.c2bus type=0
[ 4.067962] parse_throttle_dt_data: clk=cap.throttle.c3bus type=0
[ 4.074085] parse_throttle_dt_data: clk=cap.throttle.sclk type=0
[ 4.080102] parse_throttle_dt_data: clk=emc type=3
[ 4.085288] tegra_soctherm 700e2000.soctherm: soctherm: trip temperature -2147483647 forced to -127000
[ 4.094716] tegra_soctherm 700e2000.soctherm: soctherm: trip temperature -2147483647 forced to -127000
[ 4.104174] tegra_throttle_probe: probe successful. #cdevs=4
[ 4.110567] FAN dev name: pwm-fan
[ 4.113972] FAN:gpio request success.
[ 4.117715] pwm_fan_driver pwm-fan: cap state:7, cap pwm:255
[ 4.123673] pwm_fan_driver pwm-fan: got pwm for fan. polarity is normal
[ 4.130463] pwm_fan_driver pwm-fan: fan tach request irq success
[ 4.136485] pwm_fan_driver pwm-fan: tach period: 1000
[ 4.141645] pwm_fan_driver pwm-fan: index 0: pwm=0, rpm=0, rru=40, rrd=40, state:2
[ 4.149221] pwm_fan_driver pwm-fan: index 1: pwm=80, rpm=1000, rru=2, rrd=2, state:2
[ 4.156979] pwm_fan_driver pwm-fan: index 2: pwm=120, rpm=2000, rru=1, rrd=1, state:2
[ 4.164814] pwm_fan_driver pwm-fan: index 3: pwm=160, rpm=3000, rru=1, rrd=1, state:2
[ 4.172650] pwm_fan_driver pwm-fan: index 4: pwm=255, rpm=4000, rru=1, rrd=1, state:3
[ 4.180483] pwm_fan_driver pwm-fan: index 5: pwm=255, rpm=5000, rru=1, rrd=1, state:3
[ 4.188320] pwm_fan_driver pwm-fan: index 6: pwm=255, rpm=6000, rru=1, rrd=1, state:3
[ 4.196154] pwm_fan_driver pwm-fan: index 7: pwm=255, rpm=7000, rru=1, rrd=1, state:4
[ 4.203990] pwm_fan_driver pwm-fan: index 8: pwm=255, rpm=10000, rru=1, rrd=1, state:4
[ 4.211912] pwm_fan_driver pwm-fan: index 9: pwm=255, rpm=11000, rru=1, rrd=1, state:4
[ 4.222522] device-mapper: uevent: version 1.0.3
[ 4.227640] device-mapper: ioctl: 4.35.0-ioctl (2016-06-23) initialised: dm-devel@redhat.com
[ 4.241705] tegra210-cpufreq cpufreq: probe()…completed
[ 4.247901] sdhci: Secure Digital Host Controller Interface driver
[ 4.254082] sdhci: Copyright(c) Pierre Ossman
[ 4.258436] sdhci-pltfm: SDHCI platform and OF driver helper
[ 4.264564] sdhci-tegra sdhci-tegra.0: Got CD GPIO
[ 4.269734] sdhci-tegra sdhci-tegra.0: Client registration for eMC Successful
[ 4.276992] sdhci-tegra sdhci-tegra.0: wakeup init done, cdirq 298
[ 4.287803] tegra-se 70012000.se: tegra_se_probe: complete
[ 4.293786] hidraw: raw HID events driver (C) Jiri Kosina
[ 4.300495] usbcore: registered new interface driver usbhid
[ 4.306080] usbhid: USB HID core driver
[ 4.310873] tegra21x_actmon 6000c800.actmon: in actmon_register()…
[ 4.317422] tegra21x_actmon 6000c800.actmon: initialization Completed for the device mc_all
[ 4.327637] nvpmodel: initialized successfully
[ 4.331583] mmc0: SDHCI controller on sdhci-tegra.0 [sdhci-tegra.0] using ADMA 64-bit with 64 bit addr
[ 4.342477] usbcore: registered new interface driver snd-usb-audio
[ 4.348735] No Device Node present for smmu client: snd-soc-dummy !!
[ 4.355104] platform snd-soc-dummy: No iommus property found in DT node, got swgids from fixup(101004000)
[ 4.365854] iommu: Adding device snd-soc-dummy to group 35
[ 4.372771] input: tegra-hda HDMI/DP,pcm=3 as /devices/70030000.hda/sound/card0/input0
[ 4.393780] OPE platform probe
[ 4.396984] OPE platform probe successful
[ 4.401265] OPE platform probe
[ 4.404416] OPE platform probe successful
[ 4.433428] tegra-asoc: sound: ADMAIF1 <-> ADMAIF1 mapping ok
[ 4.439376] tegra-asoc: sound: ADMAIF2 <-> ADMAIF2 mapping ok
[ 4.445264] tegra-asoc: sound: ADMAIF3 <-> ADMAIF3 mapping ok
[ 4.451155] tegra-asoc: sound: ADMAIF4 <-> ADMAIF4 mapping ok
[ 4.457066] tegra-asoc: sound: ADMAIF5 <-> ADMAIF5 mapping ok
[ 4.462950] tegra-asoc: sound: ADMAIF6 <-> ADMAIF6 mapping ok
[ 4.468833] tegra-asoc: sound: ADMAIF7 <-> ADMAIF7 mapping ok
[ 4.474716] tegra-asoc: sound: ADMAIF8 <-> ADMAIF8 mapping ok
[ 4.480617] tegra-asoc: sound: ADMAIF9 <-> ADMAIF9 mapping ok
[ 4.486498] tegra-asoc: sound: ADMAIF10 <-> ADMAIF10 mapping ok
[ 4.504333] u32 classifier
[ 4.507040] Actions configured
[ 4.510516] Initializing XFRM netlink socket
[ 4.515509] NET: Registered protocol family 10
[ 4.520660] NET: Registered protocol family 17
[ 4.525147] NET: Registered protocol family 15
[ 4.529677] bridge: filtering via arp/ip/ip6tables is no longer available by default. Update your scripts to load br_netfilter if you need this.
[ 4.542783] Bluetooth: RFCOMM socket layer initialized
[ 4.547940] Bluetooth: RFCOMM ver 1.11
[ 4.551703] Bluetooth: HIDP (Human Interface Emulation) ver 1.2
[ 4.557658] Bluetooth: HIDP socket layer initialized
[ 4.562648] 9pnet: Installing 9P2000 support
[ 4.566959] Key type dns_resolver registered
[ 4.572297] Registered cp15_barrier emulation handler
[ 4.577434] Registered setend emulation handler
[ 4.583228] registered taskstats version 1
[ 4.587869] Adding domain ve2-pd to PM domain host1x-pd
[ 4.593363] Adding domain ve-pd to PM domain host1x-pd
[ 4.600801] isp 54600000.isp: initialized
[ 4.605851] isp 54680000.isp: initialized
[ 4.620200] last reset is due to power on reset
[ 4.624757] KERNEL: PMC reset status reg: 0x0
[ 4.629179] BL: PMC reset status reg: 0x0
[ 4.633200] BL: PMIC poweroff Event Recorder: 0x40
[ 4.638666] vdd-usb-vbus-en: supplied by vdd-5v0-sys
[ 4.643669] vdd-usb-vbus-en: 5000 mV
[ 4.648560] clk_cbus_recalc_rate: no gbus parent
[ 4.653199] clk_cbus_round_rate: no gbus parent
[ 4.657758] clk_cbus_round_rate: no gbus parent
[ 4.662301] clk_cbus_recalc_rate: no gbus parent
[ 4.667030] clk_cbus_recalc_rate: no gbus parent
[ 4.671665] clk_cbus_round_rate: no gbus parent
[ 4.676213] clk_cbus_round_rate: no gbus parent
[ 4.680772] clk_cbus_recalc_rate: no gbus parent
[ 4.685422] tegra_dvfs: GPU-cap: registered
[ 4.689674] tegra dvfs: vdd-cpu: nominal 1168mV, offset 708000uV, step 19200uV, scaling enabled
[ 4.698398] tegra dvfs: vdd-core: nominal 1125mV, offset 600000uV, step 12500uV, scaling enabled
[ 4.707186] tegra dvfs: vdd-gpu: nominal 1088mV, offset 708000uV, step 10000uV, scaling enabled
[ 4.717380] tegra_dvfs: vdd-gpu-vts: registered
[ 4.722070] tegra-xusb-padctl 7009f000.xusb_padctl: TEGRA_FUSE_SKU_CALIB_0 = 0x91c8412
[ 4.729996] tegra-xusb-padctl 7009f000.xusb_padctl: TEGRA_FUSE_USB_CALIB_EXT_0 = 0x4
[ 4.738494] tegra-xusb-padctl 7009f000.xusb_padctl: dev = phy-usb2.0, lane = usb2-0, function = xusb
[ 4.747694] tegra-xusb-padctl 7009f000.xusb_padctl: dev = phy-usb2.1, lane = usb2-1, function = xusb
[ 4.756924] tegra-xusb-padctl 7009f000.xusb_padctl: dev = phy-usb2.2, lane = usb2-2, function = xusb
[ 4.766162] tegra-xusb-padctl 7009f000.xusb_padctl: dev = phy-pcie.3, lane = pcie-0, function = pcie-x1
[ 4.775617] tegra-xusb-padctl 7009f000.xusb_padctl: dev = phy-pcie.4, lane = pcie-1, function = pcie-x4
[ 4.785097] tegra-xusb-padctl 7009f000.xusb_padctl: dev = phy-pcie.5, lane = pcie-2, function = pcie-x4
[ 4.794550] tegra-xusb-padctl 7009f000.xusb_padctl: dev = phy-pcie.6, lane = pcie-3, function = pcie-x4
[ 4.804027] tegra-xusb-padctl 7009f000.xusb_padctl: dev = phy-pcie.7, lane = pcie-4, function = pcie-x4
[ 4.813478] tegra-xusb-padctl 7009f000.xusb_padctl: dev = phy-pcie.8, lane = pcie-5, function = xusb
[ 4.822697] tegra-xusb-padctl 7009f000.xusb_padctl: dev = phy-pcie.9, lane = pcie-6, function = xusb
[ 4.823677] mmc0: hw tuning done …
[ 4.823726] mmc0: new ultra high speed SDR104 SDHC card at address e624
[ 4.828200] mmcblk0: mmc0:e624 SD32G 29.7 GiB
[ 4.848021] tegra-pcie 1003000.pcie: 4x1, 1x1 configuration
[ 4.854935] mmcblk0: p1
[ 4.855712] tegra-xusb 70090000.xusb: USB2 port 0 has OTG_CAP
[ 4.855841] tegra-pcie 1003000.pcie: PCIE: Enable power rails
[ 4.856482] tegra-pcie 1003000.pcie: probing port 0, using 4 lanes
[ 4.856497] tegra-xusb-padctl 7009f000.xusb_padctl: enabled OTG on UTMI pad 0
[ 4.857522] tegra-xusb 70090000.xusb: extcon 0: ffffffc07867b400 id
[ 4.858556] tegra-pcie 1003000.pcie: probing port 1, using 1 lanes
[ 4.859056] tegra-xudc-new 700d0000.xudc: device count: 1
[ 4.859835] tegra-xudc-new 700d0000.xudc: USB charger detection disabled
[ 4.859841] tegra-xudc-new 700d0000.xudc: vbus state: 0
[ 4.860331] tegra-xudc-new 700d0000.xudc: entering ELPG
[ 4.860729] tegra-xudc-new 700d0000.xudc: entering ELPG done
[ 4.860909] tegra-xusb 70090000.xusb: Firmware timestamp: 2019-10-17 15:58:59 UTC, Version: 50.25 release
[ 4.860934] tegra-xusb 70090000.xusb: xHCI Host Controller
[ 4.860946] tegra-xusb 70090000.xusb: new USB bus registered, assigned bus number 1
[ 4.861662] tegra-xusb 70090000.xusb: hcc params 0x0184f525 hci version 0x100 quirks 0x00050010
[ 4.861688] tegra-xusb 70090000.xusb: irq 61, io mem 0x70090000
[ 4.861787] usb usb1: New USB device found, idVendor=1d6b, idProduct=0002
[ 4.861791] usb usb1: New USB device strings: Mfr=3, Product=2, SerialNumber=1
[ 4.861794] usb usb1: Product: xHCI Host Controller
[ 4.861796] usb usb1: Manufacturer: Linux 4.9.201-tegra xhci-hcd
[ 4.861799] usb usb1: SerialNumber: 70090000.xusb
[ 4.861921] tegra_core_action core_dvfs_cdev_floor: Tegra CORE DVFS ‘floor cooling device’ registered
[ 4.862583] tegra_core_action core_dvfs_cdev_cap: Tegra CORE DVFS ‘cap cooling device’ registered
[ 4.862750] hub 1-0:1.0: USB hub found
[ 4.862774] hub 1-0:1.0: 5 ports detected
[ 4.863085] input: gpio-keys as /devices/gpio-keys/input/input1
[ 4.863115] tegra-xusb 70090000.xusb: xHCI Host Controller
[ 4.863125] tegra-xusb 70090000.xusb: new USB bus registered, assigned bus number 2
[ 4.863175] usb usb2: We don’t know the algorithms for LPM for this host, disabling LPM.
[ 4.863236] usb usb2: New USB device found, idVendor=1d6b, idProduct=0003
[ 4.863239] usb usb2: New USB device strings: Mfr=3, Product=2, SerialNumber=1
[ 4.863242] usb usb2: Product: xHCI Host Controller
[ 4.863245] usb usb2: Manufacturer: Linux 4.9.201-tegra xhci-hcd
[ 4.863247] usb usb2: SerialNumber: 70090000.xusb
[ 4.863668] hub 2-0:1.0: USB hub found
[ 4.863690] hub 2-0:1.0: 4 ports detected
[ 4.864200] tegra-xusb 70090000.xusb: Upgrade port 0 to USB3.0
[ 4.864204] tegra-xusb 70090000.xusb: Upgrade port 1 to USB3.0
[ 4.900155] tegra_rtc 7000e000.rtc: setting system clock to 2000-01-01 01:00:14 UTC (946688414)
[ 4.901256] vi 54080000.vi: vi_probe: ++
[ 4.904458] vi 54080000.vi: initialized
[ 4.906487] vi 54080000.vi: subdev nvcsi–1 bound
[ 4.906731] mmcblk mmc0:e624: Card claimed for testing.
[ 4.907388] Disable partitions left on by BL
[ 4.907390] disb
[ 4.907430] bwmgr: missing cdev-type property
[ 4.907522] tegra_soctherm 700e2000.soctherm: soctherm: trip temperature -2147483647 forced to -127000
[ 4.907528] DRAM derating cdev registered.
[ 4.908494] ALSA device list:
[ 4.908497] #0: tegra-hda at 0x70038000 irq 81
[ 4.908499] #1: tegra-snd-t210ref-mobile-rt565x
[ 4.967378] tegra-xusb-padctl 7009f000.xusb_padctl: power on UTMI pads 2
[ 4.975502] usb usb2: usb_suspend_both: status 0
[ 5.168812] Freeing unused kernel memory: 8576K
[ 5.187354] usb 1-3: new high-speed USB device number 2 using tegra-xusb
[ 5.197451] Root device found: mmcblk0p1
[ 5.202837] Found dev node: /dev/mmcblk0p1
[ 5.211741] usb 1-3: New USB device found, idVendor=1a40, idProduct=0801
[ 5.218534] usb 1-3: New USB device strings: Mfr=0, Product=1, SerialNumber=0
[ 5.225703] usb 1-3: Product: USB 2.0 Hub
[ 5.230535] hub 1-3:1.0: USB hub found
[ 5.234397] hub 1-3:1.0: 4 ports detected
[ 5.312970] tegra-pcie 1003000.pcie: link 0 down, retrying
[ 5.543345] usb 1-3.2: new low-speed USB device number 3 using tegra-xusb
[ 5.570347] EXT4-fs (mmcblk0p1): recovery complete
[ 5.575996] usb 1-3.2: New USB device found, idVendor=093a, idProduct=2521
[ 5.582946] usb 1-3.2: New USB device strings: Mfr=0, Product=2, SerialNumber=0
[ 5.590312] usb 1-3.2: Product: USB OPTICAL MOUSE
[ 5.590420] EXT4-fs (mmcblk0p1): mounted filesystem with ordered data mode. Opts: (null)
[ 5.592465] Rootfs mounted over mmcblk0p1
[ 5.611943] input: USB OPTICAL MOUSE as /devices/70090000.xusb/usb1/1-3/1-3.2/1-3.2:1.0/0003:093A:2521.0001/input/input2
[ 5.623181] hid-generic 0003:093A:2521.0001: input,hidraw0: USB HID v1.11 Mouse [USB OPTICAL MOUSE] on usb-70090000.xusb-3.2/input0
[ 5.635841] Switching from initrd to actual rootfs
[ 5.773348] tegra-pcie 1003000.pcie: link 0 down, retrying
[ 5.797063] systemd[1]: System time before build time, advancing clock.
[ 5.831704] cgroup: cgroup2: unknown option “nsdelegate”
[ 5.852439] systemd[1]: Configuration file /etc/systemd/system.conf is marked executable. Please remove executable permission bits. Proceeding anyway.
[ 5.865985] systemd[1]: Configuration file /etc/systemd/system.conf is marked world-writable. Please remove world writability permission bits. Proceeding anyway.
[ 5.871327] usb 1-3.1: new low-speed USB device number 4 using tegra-xusb
[ 5.888317] systemd[1]: systemd 237 running in system mode. (+PAM +AUDIT +SELINUX +IMA +APPARMOR +SMACK +SYSVINIT +UTMP +LIBCRYPTSETUP +GCRYPT +GNUTLS +ACL +XZ +LZ4 +SECCOMP +BLKID +ELFUTILS +KMOD -IDN2 +IDN -PCRE2 default-hierarchy=hybrid)
[ 5.909986] usb 1-3.1: New USB device found, idVendor=1a2c, idProduct=0c21
[ 5.910457] systemd[1]: Detected architecture arm64.
[ 5.921854] usb 1-3.1: New USB device strings: Mfr=1, Product=2, SerialNumber=0
[ 5.929169] usb 1-3.1: Product: USB Keyboard
[ 5.933452] usb 1-3.1: Manufacturer: USB
[ 5.941166] input: USB USB Keyboard as /devices/70090000.xusb/usb1/1-3/1-3.1/1-3.1:1.0/0003:1A2C:0C21.0002/input/input3
[ 5.956116] systemd[1]: Set hostname to <localhost.localdomain>.
[ 6.011748] hid-generic 0003:1A2C:0C21.0002: input,hidraw1: USB HID v1.10 Keyboard [USB USB Keyboard] on usb-70090000.xusb-3.1/input0
[ 6.028143] input: USB USB Keyboard as /devices/70090000.xusb/usb1/1-3/1-3.1/1-3.1:1.1/0003:1A2C:0C21.0003/input/input4
[ 6.077940] systemd[1]: Configuration file /lib/systemd/system/system.slice is marked executable. Please remove executable permission bits. Proceeding anyway.
[ 6.092141] systemd[1]: Configuration file /lib/systemd/system/system.slice is marked world-writable. Please remove world writability permission bits. Proceeding anyway.
[ 6.108899] hid-generic 0003:1A2C:0C21.0003: input,hidraw2: USB HID v1.10 Mouse [USB USB Keyboard] on usb-70090000.xusb-3.1/input1
[ 6.120974] systemd[1]: Configuration file /lib/systemd/system/slices.target is marked executable. Please remove executable permission bits. Proceeding anyway.
[ 6.135235] systemd[1]: Configuration file /lib/systemd/system/slices.target is marked world-writable. Please remove world writability permission bits. Proceeding anyway.
[ 6.151231] systemd[1]: Configuration file /lib/systemd/system/shutdown.target is marked executable. Please remove executable permission bits. Proceeding anyway.
[ 6.165664] systemd[1]: Configuration file /lib/systemd/system/shutdown.target is marked world-writable. Please remove world writability permission bits. Proceeding anyway.
[ 6.182019] systemd[1]: Configuration file /lib/systemd/system/graphical.target is marked executable. Please remove executable permission bits. Proceeding anyway.
[ 6.273569] tegra-pcie 1003000.pcie: link 0 down, retrying
[ 6.281098] tegra-pcie 1003000.pcie: link 0 down, ignoring
[ 6.330552] random: systemd: uninitialized urandom read (16 bytes read)
[ 6.339230] random: systemd: uninitialized urandom read (16 bytes read)
[ 6.348114] random: systemd: uninitialized urandom read (16 bytes read)
[ 6.391684] tegra-pcie 1003000.pcie: PCI host bridge to bus 0000:00
[ 6.398093] pci_bus 0000:00: root bus resource [io 0x0000-0xffff]
[ 6.404346] pci_bus 0000:00: root bus resource [mem 0x13000000-0x1fffffff]
[ 6.404351] pci_bus 0000:00: root bus resource [mem 0x20000000-0x3fffffff pref]
[ 6.404356] pci_bus 0000:00: root bus resource [bus 00-ff]
[ 6.404614] pci 0000:00:02.0: bridge configuration invalid ([bus 00-00]), reconfiguring
[ 6.414087] systemd-journald[1971]: Configuration file /etc/systemd/journald.conf is marked executable. Please remove executable permission bits. Proceeding anyway.
[ 6.414099] systemd-journald[1971]: Configuration file /etc/systemd/journald.conf is marked world-writable. Please remove world writability permission bits. Proceeding anyway.
[ 6.415454] pci 0000:00:02.0: BAR 14: assigned [mem 0x13000000-0x130fffff]
[ 6.415458] pci 0000:00:02.0: BAR 13: assigned [io 0x1000-0x1fff]
[ 6.415464] pci 0000:01:00.0: BAR 4: assigned [mem 0x13000000-0x13003fff 64bit]
[ 6.415481] pci 0000:01:00.0: BAR 2: assigned [mem 0x13004000-0x13004fff 64bit]
[ 6.415497] pci 0000:01:00.0: BAR 0: assigned [io 0x1000-0x10ff]
[ 6.415504] pci 0000:00:02.0: PCI bridge to [bus 01]
[ 6.415507] pci 0000:00:02.0: bridge window [io 0x1000-0x1fff]
[ 6.415512] pci 0000:00:02.0: bridge window [mem 0x13000000-0x130fffff]
[ 6.415798] pcieport 0000:00:02.0: Signaling PME through PCIe PME interrupt
[ 6.415801] pci 0000:01:00.0: Signaling PME through PCIe PME interrupt
[ 6.416095] r8168 0000:01:00.0: enabling device (0000 → 0003)
[ 6.416111] r8168 Gigabit Ethernet driver 8.045.08-NAPI loaded
[ 6.430823] r8168 0000:01:00.0 (unnamed net_device) (uninitialized): Invalid ethernet address 00:00:00:00:00:00, trying device tree node
[ 6.430887] r8168 0000:01:00.0 (unnamed net_device) (uninitialized): Found valid ethernet address 48:b0:2d:2e:db:33 from device tree
[ 6.431386] r8168: This product is covered by one or more of the following patents: US6,570,884, US6,115,776, and US6,327,625.
[ 6.431401] r8168 Copyright (C) 2017 Realtek NIC software team nicfae@realtek.com
[ 6.431401] This program comes with ABSOLUTELY NO WARRANTY; for details, please see http://www.gnu.org/licenses/.
[ 6.431401] This is free software, and you are welcome to redistribute it under certain conditions; see http://www.gnu.org/licenses/.

Ubuntu 18.04.5 LTS localhost.localdomain ttyS0

localhost login:

device still not detected as tty and hdmi no signal

Hi,

This does not looks like the first boo up log. Our sdkmanager won’t provide any default user account.

If you see this from UART in your first boot up, it means someone has already configured the user account.

Ubuntu 18.04.5 LTS localhost.localdomain ttyS0
localhost login:

Normally, you should see the uart stops at some lines as: “Waiting for user to finish the configuration…” If this is the first boot.

If you didn’t do anything but the uart directly goes into current situaion, please remove the whole Linux_for_Tegra and let sdkmanager download it again.

Also, next time you dump the dmesg from device, you can plug in the display, so that I can check why display is not working.

And you didn’t provide us the dmesg on your host. We need to check why usb connection between device and host is not launched.

Also, below error should not happen. If you didn’t touch those settings on your side, I would say probably host environment issue…

sdk manager failing

Log

14:32:31.953 - info: SDK Manager started running at: 2021-05-17 14:32:31.951
14:32:31.954 - info: SDK Manager log file name: sdkm-2021-05-17-14-32-31.log
14:32:31.955 - info: SDK Manager client version: 1.5.0
14:32:31.955 - info: SDK Manager is running in GUI mode
14:32:36.577 - info: Current DB Version: 14
14:32:37.975 - warn: Registering a callback with no name for event: System settings table changed after getting machineInfo
14:32:38.216 - info: User agent for http requests: SDKM/1.5.0.7774 (ubuntu1804)
14:32:38.454 - warn: Registering a callback with no name for event: Session started
14:32:38.686 - warn: Registering a callback with no name for event: Session started
14:32:38.686 - warn: Registering a callback with no name for event: Report component install/uninstall error messages
14:32:38.686 - warn: Registering a callback with no name for event: Report component install/uninstall error code/type
14:32:38.687 - info: downloadMetrics.reset
14:32:38.688 - warn: Registering a callback with no name for event: Session started
14:32:38.688 - warn: Registering a callback with no name for event: Session resumed
14:32:38.688 - warn: Registering a callback with no name for event: Session started
14:32:38.688 - warn: Registering a callback with no name for event: Session ended
14:32:38.689 - warn: Registering a callback with no name for event: File init download status
14:32:38.689 - warn: Registering a callback with no name for event: File pending download
14:32:38.689 - warn: Registering a callback with no name for event: File started downloading
14:32:38.689 - warn: Registering a callback with no name for event: File finished downloading
14:32:38.689 - warn: Registering a callback with no name for event: File checksum verifying
14:32:38.689 - warn: Registering a callback with no name for event: Component init status
14:32:38.689 - warn: Registering a callback with no name for event: Component started action
14:32:38.689 - warn: Registering a callback with no name for event: Component finished pausing download
14:32:38.689 - warn: Registering a callback with no name for event: Component finished resuming download
14:32:38.689 - warn: Registering a callback with no name for event: Component finished action
14:32:38.690 - warn: Registering a callback with no name for event: Session started
14:32:38.690 - warn: Registering a callback with no name for event: Component finished action
14:32:38.709 - warn: Registering a callback with no name for event: Active bundle loaded
14:32:38.710 - warn: Registering a callback with no name for event: Component finished action
14:32:38.711 - info: Forking worker process
14:32:38.727 - info: Initializing the download service
14:32:38.751 - info: Download service pid is: 2077
14:32:38.757 - warn: Registering a callback with no name for event: File download in progress
14:32:38.758 - warn: Registering a callback with no name for event: File finished downloading
14:32:38.758 - warn: Registering a callback with no name for event: Session started
14:32:38.759 - warn: Registering a callback with no name for event: File download in progress
14:32:38.759 - warn: Registering a callback with no name for event: File finished downloading
14:32:38.759 - warn: Registering a callback with no name for event: File reset downloaded size
14:32:38.759 - warn: Registering a callback with no name for event: File download size updated
14:32:38.759 - warn: Registering a callback with no name for event: Component init status
14:32:38.759 - warn: Registering a callback with no name for event: Component started action
14:32:38.759 - warn: Registering a callback with no name for event: Component progress for action
14:32:38.759 - warn: Registering a callback with no name for event: Component finished action
14:32:38.760 - info: Download manager can use up to 2 download threads per file
14:32:38.760 - warn: Registering a callback with no name for event: Session started
14:32:38.982 - info: create .sdkm.bashrc under /home/ass/.nvsdkm/.sdkm.bashrc
14:32:38.992 - info: installMetrics.reset
14:32:38.992 - warn: Registering a callback with no name for event: Session started
14:32:38.992 - info: uninstallMetrics.reset
14:32:38.993 - warn: Registering a callback with no name for event: Active bundle loaded
14:32:38.995 - warn: Registering a callback with no name for event: Active bundle loaded
14:32:38.995 - warn: Registering a callback with no name for event: Component finished action
14:32:38.995 - warn: Registering a callback with no name for event: File finished downloading
14:32:38.995 - warn: Registering a callback with no name for event: Component finished downloading
14:32:38.995 - warn: Registering a callback with no name for event: Session started
14:32:38.995 - warn: Registering a callback with no name for event: Session resumed
14:32:38.995 - warn: Registering a callback with no name for event: Session paused
14:32:38.995 - warn: Registering a callback with no name for event: Session complete when pausing
14:32:41.471 - warn: Registering a callback with no name for event: File started downloading
14:32:41.471 - warn: Registering a callback with no name for event: File download in progress
14:32:41.471 - warn: Registering a callback with no name for event: File checksum verifying
14:32:41.471 - warn: Registering a callback with no name for event: File finished downloading
14:32:42.033 - warn: Registering a callback with no name for event: Active bundle loaded
14:32:42.066 - warn: Registering a callback with no name for event: Terminal output
14:32:42.066 - warn: Registering a callback with no name for event: Login progress
14:32:42.066 - warn: Registering a callback with no name for event: undefined
14:32:42.066 - warn: Registering a callback with no name for event: Component download in progress
14:32:42.066 - warn: Registering a callback with no name for event: Component progress for action
14:32:42.066 - warn: Registering a callback with no name for event: Component started action
14:32:42.066 - warn: Registering a callback with no name for event: File started downloading
14:32:42.066 - warn: Registering a callback with no name for event: Component init status
14:32:42.066 - warn: Registering a callback with no name for event: Component finished pausing download
14:32:42.066 - warn: Registering a callback with no name for event: Component finished resuming download
14:32:42.066 - warn: Registering a callback with no name for event: Component finished downloading
14:32:42.066 - warn: Registering a callback with no name for event: Group finished downloading
14:32:42.066 - warn: Registering a callback with no name for event: Component finished action
14:32:42.067 - warn: Registering a callback with no name for event: Session paused
14:32:42.067 - warn: Registering a callback with no name for event: Session resumed
14:32:42.074 - info: Logger level is set to: info
14:32:42.779 - warn: Registering a callback with no name for event: Login progress
14:32:42.779 - warn: Registering a callback with no name for event: CLI Abort
14:32:42.930 - info: Front-end main function (startMain) was called
14:32:43.106 - info: Creating auto update task
14:32:43.159 - info: Host OS: ubuntu1804
14:32:44.679 - info: packageJson: /opt/nvidia/sdkmanager/resources/app/package.json
14:32:44.725 - info: [Download Service]:Download service is initializing
Download service was initialized
Got heartbeat request

14:32:44.726 - info: [Download Service] Download service is alive
14:32:45.210 - info: Application configuration is:
{
mainRepoURL: ‘https://developer.download.nvidia.com/sdkmanager/sdkm-config/main/sdkml1_repo.json’,
PIDServer: ‘P’,
DevZoneServer: ‘P’,
StarfleetServer: ‘P’
}
14:32:45.299 - info: trying to autologin with already signed in user
14:32:46.803 - info: token has not yet expired, validating with starfleet
14:32:46.804 - info: Logging in…
14:32:46.806 - info: Event: Login Progress: Authenticating with NVIDIA server…
14:32:46.819 - info: manifest: {“name”:“sdkmanager”,“releaseVersion”:“1.5.0”,“releaseRevision”:“0”,“releaseBuild”:“7774”,“release”:false,“chrome”:“78.0.3904.113”}
14:32:46.819 - info: Telemetry parameters are: title: SDK Manager 1.5.0.7774 version: 1.5.0 dev: 0 internal: false
14:32:46.830 - info: Telemetry: allow = Disallow. isGDPRAllowed=false
14:32:46.881 - info: mainRepoUrl: https://developer.download.nvidia.com/sdkmanager/sdkm-config/main/sdkml1_repo.json
14:32:46.884 - info: logging in with l1 url: https://developer.download.nvidia.com/sdkmanager/sdkm-config/main/sdkml1_repo.json
14:32:46.912 - error: Failed to call https://login.nvidia.com/token?grant_type=urn:ietf:params:oauth:grant-type:client_token&client_id=_gWkp8NvPxc7svfRKyXJ4IseQyYupLhWJiMxyPy0gm4&client_token=bVEmKa5n39WtwgrHPH_wsKKV5u213d0JUL3qEyhZzCKrRTq-2jMXku0VO4GeUlneefoX7xlPOwDlYC7lsdUhxQ&sub=Dvpl7IyiM7w1MT85GGXRPxxX9luuzrHtWO9L9Mv_fj8. Error: RequestError: getaddrinfo ENOTFOUND login.nvidia.com.
14:32:46.912 - error: Failed to get id token
14:32:46.912 - error: tokenValidation failed for server starfleet. Error: token_rejected
14:32:47.020 - info: autoLogin failed: token_rejected
14:32:47.145 - info: Create timing task for auto update successfully.
14:32:54.096 - info: download folder does not exist /media/ass/WD/Users/proed/Desktop/tegra
14:32:59.742 - info: download folder does not exist /media/ass/WD/Users/proed/Desktop/tegra
14:33:22.324 - info: Logging in with offline login method…
14:33:24.332 - info: Logging in an offline user
14:33:28.883 - info: Event: Login Progress: Loading and processing available products…
14:33:30.885 - info: Event: Login Complete: Succeeded
14:33:30.886 - info: Retrieving Data…
14:33:30.886 - info: Processing Data…
14:33:33.753 - info: Checking for GDPR allow. gdprAllow: Disallow. client version: 1.5.0.7774. Last seen client: 1.5.0.7774
14:33:33.854 - info: LastSeenSDKMClientVersion is set to 1.5.0.7774
14:33:33.856 - info: mainRepoUrl: https://developer.download.nvidia.com/sdkmanager/sdkm-config/main/sdkml1_repo.json
14:33:33.859 - info: Loading data from server: l3folder. Url: /media/ass/WD/Users/proed/Desktop/tegra
14:33:33.985 - info: Initial product lines number before validation: 1
14:33:33.986 - info:
14:33:33.986 - info: validating release: JetPack 4.5.1
14:33:33.986 - info: Validate l3 url successfully
14:33:33.987 - info: Event: Login Progress: Loading and processing available products…
14:33:34.314 - info: Selecting Jetson product
14:33:34.318 - info: step1 load in ms: 458.8050000000003
14:33:34.393 - info: cleaning the group map
14:33:34.393 - info: BundleData constructMap
14:33:35.838 - info: Release notes warning: no title was specified for JetPack 4.5.1.
14:33:35.838 - info: Release notes warning: no title was specified for JetPack 4.5.1.
14:33:38.332 - info: Release notes warning: no title was specified for JetPack 4.5.1.
14:33:38.333 - info: Release notes warning: no title was specified for JetPack 4.5.1.
14:33:42.747 - info: Event: Step3 load started
14:33:42.747 - info: initializeGroups. User selections: Product: Jetson Version: 4.5.1 selectedHW: target selectedTargetCategoryId: JETSON_NANO_TARGETS selectedOS: Linux
14:33:56.518 - info: loading l3 data from repo url:
[
‘/media/ass/WD/Users/proed/Desktop/tegra/sdkml3_jetpack_l4t_451.json’
]
14:33:56.525 - info: EulaFolder: /opt/nvidia/sdkmanager/Eula/
14:33:56.583 - info: cleaning the group map
14:33:56.584 - info: BundleData constructMap
14:33:56.585 - warn: comp NV_L4T_DRIVERS_T186_COMP filtered out, due to supported targetIDs [JETSON_TX2_TARGETS], not include JETSON_NANO_TARGETS
14:33:56.586 - warn: comp NV_L4T_DRIVERS_T194_COMP filtered out, due to supported targetIDs [JETSON_AGX_XAVIER_TARGETS,JETSON_XAVIER_NX_TARGETS], not include JETSON_NANO_TARGETS
14:33:56.586 - warn: comp NV_L4T_FILE_SYSTEM_AND_OS_T186_COMP filtered out, due to invalid dependencies: [NV_L4T_DRIVERS_T186_COMP 32.5]
14:33:56.587 - warn: comp NV_L4T_FILE_SYSTEM_AND_OS_T194_COMP filtered out, due to invalid dependencies: [NV_L4T_DRIVERS_T194_COMP 32.5]
14:33:56.589 - warn: comp NV_L4T_FLASH_XAVIER_WITH_OS_IMAGE_COMP filtered out, due to invalid dependencies: [NV_L4T_FILE_SYSTEM_AND_OS_T194_COMP 32.5]
14:33:56.589 - warn: comp NV_L4T_FLASH_XAVIER_8GB_WITH_OS_IMAGE_COMP filtered out, due to invalid dependencies: [NV_L4T_FILE_SYSTEM_AND_OS_T194_COMP 32.5]
14:33:56.589 - warn: comp NV_L4T_FLASH_XAVIER_NX_WITH_OS_IMAGE_COMP filtered out, due to invalid dependencies: [NV_L4T_FILE_SYSTEM_AND_OS_T194_COMP 32.5]
14:33:56.590 - warn: comp NV_L4T_FLASH_XAVIER_NX_DEVKIT_WITH_OS_IMAGE_COMP filtered out, due to invalid dependencies: [NV_L4T_FILE_SYSTEM_AND_OS_T194_COMP 32.5]
14:33:56.590 - warn: comp NV_L4T_FLASH_TX2_WITH_OS_IMAGE_COMP filtered out, due to invalid dependencies: [NV_L4T_FILE_SYSTEM_AND_OS_T186_COMP 32.5]
14:33:56.590 - warn: comp NV_L4T_FLASH_TX2I_WITH_OS_IMAGE_COMP filtered out, due to invalid dependencies: [NV_L4T_FILE_SYSTEM_AND_OS_T186_COMP 32.5]
14:33:56.590 - warn: comp NV_L4T_FLASH_TX2_4GB_WITH_OS_IMAGE_COMP filtered out, due to invalid dependencies: [NV_L4T_FILE_SYSTEM_AND_OS_T186_COMP 32.5]
14:33:56.590 - warn: comp NV_L4T_FLASH_TX2_NX_WITH_OS_IMAGE_COMP filtered out, due to invalid dependencies: [NV_L4T_FILE_SYSTEM_AND_OS_T186_COMP 32.5]
14:33:56.591 - warn: comp NV_L4T_FLASH_TX1_WITH_OS_IMAGE_COMP filtered out, due to supported targetIDs [JETSON_TX1_TARGETS], not include JETSON_NANO_TARGETS
14:33:56.594 - warn: comp NV_L4T_TENSORRT_DLA_TARGET_POST_INSTALL_COMP filtered out, due to supported targetIDs [JETSON_AGX_XAVIER_TARGETS,JETSON_XAVIER_NX_TARGETS], not include JETSON_NANO_TARGETS
14:33:56.598 - warn: comp NV_L4T_MULTIMEDIA_API_TARGET_POST_INSTALL_T186_COMP filtered out, due to supported targetIDs [JETSON_TX2_TARGETS], not include JETSON_NANO_TARGETS
14:33:56.599 - warn: comp NV_L4T_MULTIMEDIA_API_TARGET_POST_INSTALL_T194_COMP filtered out, due to invalid dependencies: [NV_L4T_TENSORRT_DLA_TARGET_POST_INSTALL_COMP 7.1]
14:33:56.601 - info: Event: Active bundle loaded: Jetson - 4.5.1 - JETSON_NANO_TARGETS
14:33:56.602 - info: InstallProxy is initializing
14:33:56.602 - warn: installProxy initialization: did not get expected details from engine. Expected {product title, target os, and edition}. Got {title: JetPack 4.5.1, OS: Linux, edition: }
14:33:56.602 - info: looking for install adapter from /opt/nvidia/sdkmanager/resources/app/output/installUtils
14:33:56.603 - info: Install proxy initialized successfully
14:33:56.928 - info: Event: NV_L4T_DRIVERS_T210_COMP@JETSON_NANO_TARGETS - init status is: installed
14:33:56.929 - info: Event: NV_L4T_FILE_SYSTEM_AND_OS_T210_COMP@JETSON_NANO_TARGETS - init status is: pending_download
14:33:56.929 - info: Event: NV_DEVICE_MODE_SETUP_IMAGE_COMP@JETSON_NANO_TARGETS - init status is: pending_install
14:33:56.930 - info: Event: NV_L4T_FLASH_NANO_DEVKIT_WITH_OS_IMAGE_COMP@JETSON_NANO_TARGETS - init status is: pending_install
14:33:56.930 - info: Event: NV_L4T_FLASH_NANO_2GB_DEVKIT_WITH_OS_IMAGE_COMP@JETSON_NANO_TARGETS - init status is: pending_install
14:33:56.930 - info: Event: NV_L4T_FLASH_NANO_WITH_OS_IMAGE_COMP@JETSON_NANO_TARGETS - init status is: pending_install
14:33:56.931 - info: Event: NV_DEVICE_MODE_SETUP_TARGET_COMP@JETSON_NANO_TARGETS - init status is: pending_install
14:33:56.931 - info: Event: NV_DATETIME_SETUP_TARGET_COMP@JETSON_NANO_TARGETS - init status is: pending_install
14:33:56.931 - info: Event: NV_L4T_CUDA_TARGET_POST_INSTALL_COMP@JETSON_NANO_TARGETS - init status is: pending_download
14:33:56.931 - info: Event: NV_L4T_CUDNN_TARGET_POST_INSTALL_COMP@JETSON_NANO_TARGETS - init status is: pending_download
14:33:56.931 - info: Event: NV_L4T_TENSORRT_NODLA_TARGET_POST_INSTALL_COMP@JETSON_NANO_TARGETS - init status is: pending_download
14:33:56.931 - info: Event: NV_L4T_OPENCV_TARGET_POST_INSTALL_COMP@JETSON_NANO_TARGETS - init status is: pending_download
14:33:56.932 - info: Event: NV_L4T_VISIONWORKS_TARGET_POST_INSTALL_COMP@JETSON_NANO_TARGETS - init status is: pending_download
14:33:56.932 - info: Event: NV_L4T_VPI_TARGET_POST_INSTALL_COMP@JETSON_NANO_TARGETS - init status is: pending_download
14:33:56.932 - info: Event: NV_L4T_DOCKER_TARGET_POST_INSTALL_COMP@JETSON_NANO_TARGETS - init status is: pending_download
14:33:56.932 - info: Event: NV_L4T_MULTIMEDIA_API_TARGET_POST_INSTALL_T210_COMP@JETSON_NANO_TARGETS - init status is: pending_download
14:33:56.932 - info: Event: NV_L4T_NVIDIA_NSIGHT_SYSTEMS_TARGET_POST_INSTALL_COMP@JETSON_NANO_TARGETS - init status is: pending_download
14:33:56.941 - info: Setting AdditionalSDKSelection with value:
14:33:56.943 - error: Trying to set a custom dimension: AdditionalSDKSelection - cd13, . Visitor is not initialized.
14:33:56.943 - info: Session initial status: install percent: 80. (17 out of 1)
14:33:56.969 - info: initializeGroups ended successfully. Duration: 00:00:14
14:33:56.969 - info: Event: Step3 load complete: Succeeded
14:33:57.097 - info: stdout: Querying the install status of ‘CUDA Cross Compile Package on Host’ (NV_CUDA_CROSS_HOST_COMP)
exec_command: dpkg-query -W -f=’${db:Status-abbrev} ${Version}’ cuda-cross-aarch64-10-2
Host Deb package NV_CUDA_CROSS_HOST_COMP cuda-repo-cross-aarch64-10-2-local-10.2.89_1.0-1_all.deb installed successfully.

14:33:57.099 - info: stdout: Querying the install status of ‘VisionWorks on Host’ (NV_VISIONWORKS_HOST_COMP)
exec_command: dpkg-query -W -f=’${db:Status-abbrev} ${Version}’ libvisionworks
exec_command: dpkg-query -W -f=’${db:Status-abbrev} ${Version}’ libvisionworks-dev
exec_command: dpkg-query -W -f=’${db:Status-abbrev} ${Version}’ libvisionworks-samples
Host Deb package NV_VISIONWORKS_HOST_COMP libvisionworks-repo_1.6.0.501_amd64.deb installed successfully.
exec_command: dpkg-query -W -f=’${db:Status-abbrev} ${Version}’ libvisionworks-sfm
exec_command: dpkg-query -W -f=’${db:Status-abbrev} ${Version}’ libvisionworks-sfm-dev
Host Deb package NV_VISIONWORKS_HOST_COMP libvisionworks-sfm-repo_0.90.4.501_amd64.deb installed successfully.
exec_command: dpkg-query -W -f=’${db:Status-abbrev} ${Version}’ libvisionworks-tracking
exec_command: dpkg-query -W -f=’${db:Status-abbrev} ${Version}’ libvisionworks-tracking-dev
Host Deb package NV_VISIONWORKS_HOST_COMP libvisionworks-tracking-repo_0.88.2.501_amd64.deb installed successfully.

14:33:57.100 - info: stdout: Querying the install status of ‘NVIDIA Nsight Systems’ (NV_L4T_NVIDIA_NSIGHT_SYSTEMS_HOST_COMP)
exec_command: dpkg-query -W -f=’${db:Status-abbrev} ${Version}’ nsight-systems-2020.5.3
Host Deb package NV_L4T_NVIDIA_NSIGHT_SYSTEMS_HOST_COMP NsightSystems-linux-public-2020.5.3.17-0256620.deb installed successfully.

14:33:57.114 - info: stdout: Querying the install status of ‘VPI Cross Compile Package on Host’ (NV_VPI_CROSS_HOST_COMP)
exec_command: dpkg-query -W -f=’${db:Status-abbrev} ${Version}’ vpi1-cross-aarch64-l4t
Host Deb package NV_VPI_CROSS_HOST_COMP vpi-cross-aarch64-l4t-1.0.15-x86_64-linux.deb installed successfully.

14:33:57.118 - info: stdout: Querying the install status of ‘NVIDIA Nsight Graphics’ (NV_L4T_NVIDIA_NSIGHT_GRAPHICS_HOST_COMP)
exec_command: dpkg-query -W -f=’${db:Status-abbrev} ${Version}’ nsight-graphics-for-embeddedlinux-2020.5.1
Host Deb package NV_L4T_NVIDIA_NSIGHT_GRAPHICS_HOST_COMP NVIDIA_Nsight_Graphics_L4T_Public_2020.5.20329.deb installed successfully.

14:33:57.119 - info: stdout: Querying the install status of ‘VPI on Host’ (NV_VPI_HOST_COMP)
exec_command: dpkg-query -W -f=’${db:Status-abbrev} ${Version}’ libnvvpi1
Host Deb package NV_VPI_HOST_COMP vpi-lib-1.0.15-cuda10-x86_64-linux.deb installed successfully.
exec_command: dpkg-query -W -f=’${db:Status-abbrev} ${Version}’ vpi1-dev
Host Deb package NV_VPI_HOST_COMP vpi-dev-1.0.15-cuda10-x86_64-linux.deb installed successfully.
exec_command: dpkg-query -W -f=’${db:Status-abbrev} ${Version}’ vpi1-samples
Host Deb package NV_VPI_HOST_COMP vpi-samples-1.0.15-cuda10-x86_64-linux.deb installed successfully.

14:33:57.121 - info: stdout: Querying the install status of ‘CUDA on Host’ (NV_CUDA_HOST_COMP)
exec_command: dpkg-query -W -f=’${db:Status-abbrev} ${Version}’ cuda-toolkit-10-2
Host Deb package NV_CUDA_HOST_COMP cuda-repo-ubuntu1804-10-2-local-10.2.89-440.40_1.0-1_amd64.deb installed successfully.

14:33:57.123 - info: Component: NV_CUDA_HOST_COMP version: 10.2 for bundle: JetPack_4.5.1_Linux is installed
14:33:57.123 - info: Component: NV_CUDA_CROSS_HOST_COMP version: 10.2 for bundle: JetPack_4.5.1_Linux is installed
14:33:57.127 - info: Component: NV_VISIONWORKS_HOST_COMP version: 1.6 for bundle: JetPack_4.5.1_Linux is installed
14:33:57.127 - info: Component: NV_VPI_HOST_COMP version: 1.0 for bundle: JetPack_4.5.1_Linux is installed
14:33:57.128 - info: Component: NV_VPI_CROSS_HOST_COMP version: 1.0 for bundle: JetPack_4.5.1_Linux is installed
14:33:57.128 - info: Component: NV_L4T_NVIDIA_NSIGHT_GRAPHICS_HOST_COMP version: 2020.5 for bundle: JetPack_4.5.1_Linux is installed
14:33:57.128 - info: Component: NV_L4T_NVIDIA_NSIGHT_SYSTEMS_HOST_COMP version: 2020.5 for bundle: JetPack_4.5.1_Linux is installed
14:33:57.143 - info: cleaning the group map
14:33:57.143 - info: BundleData constructMap
14:33:57.145 - warn: comp NV_L4T_DRIVERS_T186_COMP filtered out, due to supported targetIDs [JETSON_TX2_TARGETS], not include JETSON_NANO_2GB_DEVKIT
14:33:57.145 - warn: comp NV_L4T_DRIVERS_T194_COMP filtered out, due to supported targetIDs [JETSON_AGX_XAVIER_TARGETS,JETSON_XAVIER_NX_TARGETS], not include JETSON_NANO_2GB_DEVKIT
14:33:57.146 - warn: comp NV_L4T_FILE_SYSTEM_AND_OS_T186_COMP filtered out, due to invalid dependencies: [NV_L4T_DRIVERS_T186_COMP 32.5]
14:33:57.147 - warn: comp NV_L4T_FILE_SYSTEM_AND_OS_T194_COMP filtered out, due to invalid dependencies: [NV_L4T_DRIVERS_T194_COMP 32.5]
14:33:57.148 - warn: comp NV_L4T_FLASH_XAVIER_WITH_OS_IMAGE_COMP filtered out, due to invalid dependencies: [NV_L4T_FILE_SYSTEM_AND_OS_T194_COMP 32.5]
14:33:57.148 - warn: comp NV_L4T_FLASH_XAVIER_8GB_WITH_OS_IMAGE_COMP filtered out, due to invalid dependencies: [NV_L4T_FILE_SYSTEM_AND_OS_T194_COMP 32.5]
14:33:57.149 - warn: comp NV_L4T_FLASH_XAVIER_NX_WITH_OS_IMAGE_COMP filtered out, due to invalid dependencies: [NV_L4T_FILE_SYSTEM_AND_OS_T194_COMP 32.5]
14:33:57.149 - warn: comp NV_L4T_FLASH_XAVIER_NX_DEVKIT_WITH_OS_IMAGE_COMP filtered out, due to invalid dependencies: [NV_L4T_FILE_SYSTEM_AND_OS_T194_COMP 32.5]
14:33:57.149 - warn: comp NV_L4T_FLASH_TX2_WITH_OS_IMAGE_COMP filtered out, due to invalid dependencies: [NV_L4T_FILE_SYSTEM_AND_OS_T186_COMP 32.5]
14:33:57.149 - warn: comp NV_L4T_FLASH_TX2I_WITH_OS_IMAGE_COMP filtered out, due to invalid dependencies: [NV_L4T_FILE_SYSTEM_AND_OS_T186_COMP 32.5]
14:33:57.149 - warn: comp NV_L4T_FLASH_TX2_4GB_WITH_OS_IMAGE_COMP filtered out, due to invalid dependencies: [NV_L4T_FILE_SYSTEM_AND_OS_T186_COMP 32.5]
14:33:57.150 - warn: comp NV_L4T_FLASH_TX2_NX_WITH_OS_IMAGE_COMP filtered out, due to invalid dependencies: [NV_L4T_FILE_SYSTEM_AND_OS_T186_COMP 32.5]
14:33:57.150 - warn: comp NV_L4T_FLASH_TX1_WITH_OS_IMAGE_COMP filtered out, due to supported targetIDs [JETSON_TX1_TARGETS], not include JETSON_NANO_2GB_DEVKIT
14:33:57.150 - warn: comp NV_L4T_FLASH_NANO_DEVKIT_WITH_OS_IMAGE_COMP filtered out, due to supported targetIDs [JETSON_NANO_TARGETS], not include JETSON_NANO_2GB_DEVKIT
14:33:57.151 - warn: comp NV_L4T_FLASH_NANO_WITH_OS_IMAGE_COMP filtered out, due to supported targetIDs [JETSON_NANO_TARGETS], not include JETSON_NANO_2GB_DEVKIT
14:33:57.154 - warn: comp NV_L4T_TENSORRT_DLA_TARGET_POST_INSTALL_COMP filtered out, due to supported targetIDs [JETSON_AGX_XAVIER_TARGETS,JETSON_XAVIER_NX_TARGETS], not include JETSON_NANO_2GB_DEVKIT
14:33:57.158 - warn: comp NV_L4T_MULTIMEDIA_API_TARGET_POST_INSTALL_T186_COMP filtered out, due to supported targetIDs [JETSON_TX2_TARGETS], not include JETSON_NANO_2GB_DEVKIT
14:33:57.158 - warn: comp NV_L4T_MULTIMEDIA_API_TARGET_POST_INSTALL_T194_COMP filtered out, due to invalid dependencies: [NV_L4T_TENSORRT_DLA_TARGET_POST_INSTALL_COMP 7.1]
14:33:57.167 - info: cleaning the group map
14:33:57.168 - info: BundleData constructMap
14:33:57.171 - warn: comp NV_L4T_DRIVERS_T186_COMP filtered out, due to supported targetIDs [JETSON_TX2_TARGETS], not include JETSON_NANO_TARGETS
14:33:57.171 - warn: comp NV_L4T_DRIVERS_T194_COMP filtered out, due to supported targetIDs [JETSON_AGX_XAVIER_TARGETS,JETSON_XAVIER_NX_TARGETS], not include JETSON_NANO_TARGETS
14:33:57.172 - warn: comp NV_L4T_FILE_SYSTEM_AND_OS_T186_COMP filtered out, due to invalid dependencies: [NV_L4T_DRIVERS_T186_COMP 32.5]
14:33:57.172 - warn: comp NV_L4T_FILE_SYSTEM_AND_OS_T194_COMP filtered out, due to invalid dependencies: [NV_L4T_DRIVERS_T194_COMP 32.5]
14:33:57.173 - warn: comp NV_L4T_FLASH_XAVIER_WITH_OS_IMAGE_COMP filtered out, due to invalid dependencies: [NV_L4T_FILE_SYSTEM_AND_OS_T194_COMP 32.5]
14:33:57.173 - warn: comp NV_L4T_FLASH_XAVIER_8GB_WITH_OS_IMAGE_COMP filtered out, due to invalid dependencies: [NV_L4T_FILE_SYSTEM_AND_OS_T194_COMP 32.5]
14:33:57.173 - warn: comp NV_L4T_FLASH_XAVIER_NX_WITH_OS_IMAGE_COMP filtered out, due to invalid dependencies: [NV_L4T_FILE_SYSTEM_AND_OS_T194_COMP 32.5]
14:33:57.173 - warn: comp NV_L4T_FLASH_XAVIER_NX_DEVKIT_WITH_OS_IMAGE_COMP filtered out, due to invalid dependencies: [NV_L4T_FILE_SYSTEM_AND_OS_T194_COMP 32.5]
14:33:57.173 - warn: comp NV_L4T_FLASH_TX2_WITH_OS_IMAGE_COMP filtered out, due to invalid dependencies: [NV_L4T_FILE_SYSTEM_AND_OS_T186_COMP 32.5]
14:33:57.173 - warn: comp NV_L4T_FLASH_TX2I_WITH_OS_IMAGE_COMP filtered out, due to invalid dependencies: [NV_L4T_FILE_SYSTEM_AND_OS_T186_COMP 32.5]
14:33:57.173 - warn: comp NV_L4T_FLASH_TX2_4GB_WITH_OS_IMAGE_COMP filtered out, due to invalid dependencies: [NV_L4T_FILE_SYSTEM_AND_OS_T186_COMP 32.5]
14:33:57.173 - warn: comp NV_L4T_FLASH_TX2_NX_WITH_OS_IMAGE_COMP filtered out, due to invalid dependencies: [NV_L4T_FILE_SYSTEM_AND_OS_T186_COMP 32.5]
14:33:57.174 - warn: comp NV_L4T_FLASH_TX1_WITH_OS_IMAGE_COMP filtered out, due to supported targetIDs [JETSON_TX1_TARGETS], not include JETSON_NANO_TARGETS
14:33:57.176 - warn: comp NV_L4T_TENSORRT_DLA_TARGET_POST_INSTALL_COMP filtered out, due to supported targetIDs [JETSON_AGX_XAVIER_TARGETS,JETSON_XAVIER_NX_TARGETS], not include JETSON_NANO_TARGETS
14:33:57.179 - warn: comp NV_L4T_MULTIMEDIA_API_TARGET_POST_INSTALL_T186_COMP filtered out, due to supported targetIDs [JETSON_TX2_TARGETS], not include JETSON_NANO_TARGETS
14:33:57.179 - warn: comp NV_L4T_MULTIMEDIA_API_TARGET_POST_INSTALL_T194_COMP filtered out, due to invalid dependencies: [NV_L4T_TENSORRT_DLA_TARGET_POST_INSTALL_COMP 7.1]
14:33:57.222 - warn: no hostOperatingSystemsSupportFor in json
14:33:57.228 - info: Checking for update with mainRepoURL: https://developer.download.nvidia.com/sdkmanager/sdkm-config/main/sdkml1_repo.json
14:33:58.345 - error: sdkml1_repo.json download failed with error ENOTFOUND, request url: https://developer.download.nvidia.com/sdkmanager/sdkm-config/main/sdkml1_repo.json
14:33:58.346 - warn: cannot get SDK Manager update information with updater failed to download https://developer.download.nvidia.com/sdkmanager/sdkm-config/main/sdkml1_repo.json with error: Error: getaddrinfo ENOTFOUND developer.download.nvidia.com
14:33:58.346 - info: packageJson: /opt/nvidia/sdkmanager/resources/app/package.json
14:34:12.862 - info:

********************** Running install for bundle JetPack_4.5.1_Linux_for_Jetson_Nano_modules time: 17-May-2021-14.34:12 **********************
14:34:14.128 - info: 2.3GB disk space is required for download
14:34:14.224 - info: 40.32GB disk space is required for install
14:34:14.225 - info: 42.62GB disk space is required for both download and install
14:34:14.240 - error:
{
message: ‘path /media/ass/WD/Users/proed/Desktop/tegra: available 28.76GB less than required 42.62GB’,
stack: ‘Error: path /media/ass/WD/Users/proed/Desktop/tegra: available 28.76GB less than required 42.62GB\n’ +
’ at file:///opt/nvidia/sdkmanager/resources/app/output/dist/electron/renderer.js:1507:4347’
}
14:34:16.367 - info: check if sudo prompt required
14:34:16.477 - warn: check failed: Command failed: sudo -k; sudo -n true
sudo: a password is required

14:34:21.871 - info: verify sudo password succeeded
14:34:21.895 - info: Event: Session started: JetPack 4.5.1 Linux for Jetson Nano modules - install
14:34:21.896 - info: downloadMetrics.reset
14:34:21.897 - info: Dependency detected: “NV_L4T_FILE_SYSTEM_AND_OS_T210_COMP@JETSON_NANO_TARGETS” → “NV_L4T_DRIVERS_T210_COMP@JETSON_NANO_TARGETS” (“File System and OS” → “Drivers for Jetson”)
14:34:21.897 - info: Group dependency detected: “NV_DEVICE_MODE_SETUP_IMAGE_COMP@JETSON_NANO_TARGETS” → “NV_JETPACK_L4T_IMAGE_SETUP_TARGET_GROUP@JETSON_NANO_TARGETS” (“Device Mode Host Setup in Flash” → “Jetson OS image”)
14:34:21.898 - info: Dependency detected: “NV_DEVICE_MODE_SETUP_IMAGE_COMP@JETSON_NANO_TARGETS” → “NV_L4T_DRIVERS_T210_COMP@JETSON_NANO_TARGETS” (“Device Mode Host Setup in Flash” → “Drivers for Jetson”) of group “NV_JETPACK_L4T_IMAGE_SETUP_TARGET_GROUP@JETSON_NANO_TARGETS” (“Jetson OS image”)
14:34:21.898 - info: Dependency detected: “NV_DEVICE_MODE_SETUP_IMAGE_COMP@JETSON_NANO_TARGETS” → “NV_L4T_FILE_SYSTEM_AND_OS_T210_COMP@JETSON_NANO_TARGETS” (“Device Mode Host Setup in Flash” → “File System and OS”) of group “NV_JETPACK_L4T_IMAGE_SETUP_TARGET_GROUP@JETSON_NANO_TARGETS” (“Jetson OS image”)
14:34:21.898 - info: Dependency detected: “NV_L4T_FLASH_NANO_DEVKIT_WITH_OS_IMAGE_COMP@JETSON_NANO_TARGETS” → “NV_L4T_FILE_SYSTEM_AND_OS_T210_COMP@JETSON_NANO_TARGETS” (“Flash Jetson Nano (Devkit)” → “File System and OS”)
14:34:21.899 - info: Dependency detected: “NV_L4T_FLASH_NANO_DEVKIT_WITH_OS_IMAGE_COMP@JETSON_NANO_TARGETS” → “NV_DEVICE_MODE_SETUP_IMAGE_COMP@JETSON_NANO_TARGETS” (“Flash Jetson Nano (Devkit)” → “Device Mode Host Setup in Flash”)
14:34:21.899 - info: Dependency detected: “NV_L4T_FLASH_NANO_2GB_DEVKIT_WITH_OS_IMAGE_COMP@JETSON_NANO_TARGETS” → “NV_L4T_FILE_SYSTEM_AND_OS_T210_COMP@JETSON_NANO_TARGETS” (“Flash Jetson Nano 2GB (Devkit)” → “File System and OS”)
14:34:21.899 - info: Dependency detected: “NV_L4T_FLASH_NANO_2GB_DEVKIT_WITH_OS_IMAGE_COMP@JETSON_NANO_TARGETS” → “NV_DEVICE_MODE_SETUP_IMAGE_COMP@JETSON_NANO_TARGETS” (“Flash Jetson Nano 2GB (Devkit)” → “Device Mode Host Setup in Flash”)
14:34:21.899 - info: Dependency detected: “NV_L4T_FLASH_NANO_WITH_OS_IMAGE_COMP@JETSON_NANO_TARGETS” → “NV_L4T_FILE_SYSTEM_AND_OS_T210_COMP@JETSON_NANO_TARGETS” (“Flash Jetson Nano” → “File System and OS”)
14:34:21.899 - info: Dependency detected: “NV_L4T_FLASH_NANO_WITH_OS_IMAGE_COMP@JETSON_NANO_TARGETS” → “NV_DEVICE_MODE_SETUP_IMAGE_COMP@JETSON_NANO_TARGETS” (“Flash Jetson Nano” → “Device Mode Host Setup in Flash”)
14:34:21.901 - info: OS: host - seqential install order: NV_L4T_DRIVERS_T210_COMP, NV_L4T_FILE_SYSTEM_AND_OS_T210_COMP
14:34:21.901 - info: OS: host - concurrent install order: NV_DEVICE_MODE_SETUP_IMAGE_COMP, NV_L4T_FLASH_NANO_DEVKIT_WITH_OS_IMAGE_COMP, NV_L4T_FLASH_NANO_2GB_DEVKIT_WITH_OS_IMAGE_COMP, NV_L4T_FLASH_NANO_WITH_OS_IMAGE_COMP
14:34:21.902 - info: Event: NV_L4T_DRIVERS_T210_COMP@JETSON_NANO_TARGETS - component finished downloading
14:34:21.904 - info: Event: NV_L4T_DRIVERS_T210_COMP@JETSON_NANO_TARGETS - install ended
14:34:21.905 - info: Summary: NV_L4T_DRIVERS_T210_COMP@JETSON_NANO_TARGETS: Install completed successfully.
14:34:21.938 - info: Destorying eula view. eula warning timer is null: true
14:34:23.397 - info: Drivers for Jetson up-to-date
14:34:23.398 - info: Download manager can use up to 2 download threads per file
14:34:23.399 - info: Event: System settings DB changed
14:34:24.514 - info: number of download processes set to 3
14:34:24.514 - info: Download manager can download up to 3 files concurrently
14:34:24.514 - info: Event: NV_L4T_DRIVERS_T210_COMP@JETSON_NANO_TARGETS - Jetson-210_Linux_R32.5.1_aarch64.tbz2 - started downloading
14:34:24.515 - info: Event: NV_L4T_DRIVERS_T210_COMP@JETSON_NANO_TARGETS - Jetson-210_Linux_R32.5.1_aarch64.tbz2 - finished downloading
14:34:24.516 - info: download duration for component NV_L4T_DRIVERS_T210_COMP@JETSON_NANO_TARGETS: 0.000s
14:34:24.550 - info: NV_L4T_FILE_SYSTEM_AND_OS_T210_COMP@JETSON_NANO_TARGETS: verifying checksum of /media/ass/WD/Users/proed/Desktop/tegra/Tegra_Linux_Sample-Root-Filesystem_R32.5.1_aarch64.tbz2
14:34:24.550 - info: skip checksum verification for /media/ass/WD/Users/proed/Desktop/tegra/Tegra_Linux_Sample-Root-Filesystem_R32.5.1_aarch64.tbz2, checksum option is: yes
14:34:24.557 - info: NV_L4T_FILE_SYSTEM_AND_OS_T210_COMP@JETSON_NANO_TARGETS: Found file /media/ass/WD/Users/proed/Desktop/tegra/Tegra_Linux_Sample-Root-Filesystem_R32.5.1_aarch64.tbz2 with correct checksum, skip downloading.
14:34:24.560 - info: Event: NV_L4T_FILE_SYSTEM_AND_OS_T210_COMP@JETSON_NANO_TARGETS - Tegra_Linux_Sample-Root-Filesystem_R32.5.1_aarch64.tbz2 - finished downloading
14:34:24.560 - info: Event: NV_L4T_FILE_SYSTEM_AND_OS_T210_COMP@JETSON_NANO_TARGETS - component finished downloading
14:34:24.561 - info: download duration for component NV_L4T_FILE_SYSTEM_AND_OS_T210_COMP@JETSON_NANO_TARGETS: 0.000s
14:34:24.561 - info: Event: NV_JETPACK_L4T_IMAGE_SETUP_TARGET_GROUP@JETSON_NANO_TARGETS - finished downloading
14:34:26.006 - info: All required files were downloaded
14:34:26.040 - info: memInfo [total: 3.84GB, free: 1.47GB, available: 2.26GB]
14:34:26.041 - info: Event: NV_L4T_FILE_SYSTEM_AND_OS_T210_COMP@JETSON_NANO_TARGETS - install started
14:34:26.043 - info: install timeout for NV_L4T_FILE_SYSTEM_AND_OS_T210_COMP: 728s
14:34:26.068 - info: cmd finished success SDKM_END_CODE_SUCCESS_b29c8cd9-8e2e-4aac-bb5c-3836446e1e6f
14:34:26.068 - info: command finished successfully
14:34:26.100 - info: NV_L4T_FILE_SYSTEM_AND_OS_T210_COMP@JETSON_NANO_TARGETS: [host] [ Disk Avail:8.97 GB ]
14:34:26.100 - info: NV_L4T_FILE_SYSTEM_AND_OS_T210_COMP@JETSON_NANO_TARGETS: Installing component ‘File System and OS’ (NV_L4T_FILE_SYSTEM_AND_OS_T210_COMP)
14:34:26.101 - info: NV_L4T_FILE_SYSTEM_AND_OS_T210_COMP@JETSON_NANO_TARGETS: NV_L4T_FILE_SYSTEM_AND_OS_T210_COMP include 1 package
14:34:26.105 - info: NV_L4T_FILE_SYSTEM_AND_OS_T210_COMP@JETSON_NANO_TARGETS: change working directory to /media/ass/WD/nvtmp/JetPack_4.5.1_Linux_JETSON_NANO_TARGETS/Linux_for_Tegra/rootfs/
14:34:26.106 - info: NV_L4T_FILE_SYSTEM_AND_OS_T210_COMP@JETSON_NANO_TARGETS: [ Package PreInstall Started ]
14:34:26.106 - info: NV_L4T_FILE_SYSTEM_AND_OS_T210_COMP@JETSON_NANO_TARGETS: current working directory is /media/ass/WD/nvtmp/JetPack_4.5.1_Linux_JETSON_NANO_TARGETS/Linux_for_Tegra/rootfs
14:34:26.106 - info: NV_L4T_FILE_SYSTEM_AND_OS_T210_COMP@JETSON_NANO_TARGETS: exec_command [host]:
14:34:26.106 - info: NV_L4T_FILE_SYSTEM_AND_OS_T210_COMP@JETSON_NANO_TARGETS: **********************
14:34:26.106 - info: NV_L4T_FILE_SYSTEM_AND_OS_T210_COMP@JETSON_NANO_TARGETS: #!/bin/bash
14:34:26.107 - info: NV_L4T_FILE_SYSTEM_AND_OS_T210_COMP@JETSON_NANO_TARGETS: set -e
14:34:26.107 - info: NV_L4T_FILE_SYSTEM_AND_OS_T210_COMP@JETSON_NANO_TARGETS:
14:34:26.107 - info: NV_L4T_FILE_SYSTEM_AND_OS_T210_COMP@JETSON_NANO_TARGETS: function safe_apt_install {
14:34:26.107 - info: NV_L4T_FILE_SYSTEM_AND_OS_T210_COMP@JETSON_NANO_TARGETS: echo “*begin $1, $2”
14:34:26.107 - info: NV_L4T_FILE_SYSTEM_AND_OS_T210_COMP@JETSON_NANO_TARGETS: tmp_log=/tmp/jetpack_dpkg_log.txt
14:34:26.108 - info: NV_L4T_FILE_SYSTEM_AND_OS_T210_COMP@JETSON_NANO_TARGETS: sudo rm -f $tmp_log
14:34:26.108 - info: NV_L4T_FILE_SYSTEM_AND_OS_T210_COMP@JETSON_NANO_TARGETS: set +e; $1 2>$tmp_log; CMD_STATUS=${PIPESTATUS[0]}; set -e
14:34:26.108 - info: NV_L4T_FILE_SYSTEM_AND_OS_T210_COMP@JETSON_NANO_TARGETS: while [ ${CMD_STATUS} -ne 0 ]; do
14:34:26.108 - info: NV_L4T_FILE_SYSTEM_AND_OS_T210_COMP@JETSON_NANO_TARGETS: cat $tmp_log >&2
14:34:26.108 - info: NV_L4T_FILE_SYSTEM_AND_OS_T210_COMP@JETSON_NANO_TARGETS: if grep -q -e “is locked by another process” -e “E: Could not get lock /var/” -e “Could not open lock” $tmp_log; then
14:34:26.108 - info: NV_L4T_FILE_SYSTEM_AND_OS_T210_COMP@JETSON_NANO_TARGETS: sudo rm -f $tmp_log
14:34:26.109 - info: NV_L4T_FILE_SYSTEM_AND_OS_T210_COMP@JETSON_NANO_TARGETS: set +e; $1 2>$tmp_log; CMD_STATUS=${PIPESTATUS[0]}; set -e
14:34:26.109 - info: NV_L4T_FILE_SYSTEM_AND_OS_T210_COMP@JETSON_NANO_TARGETS: echo “Waiting $2 seconds for apt to be available”; sleep ${2}
14:34:26.109 - info: NV_L4T_FILE_SYSTEM_AND_OS_T210_COMP@JETSON_NANO_TARGETS: else
14:34:26.109 - info: NV_L4T_FILE_SYSTEM_AND_OS_T210_COMP@JETSON_NANO_TARGETS: echo “Unhandled error when running $1” 1>&2; exit 1
14:34:26.109 - info: NV_L4T_FILE_SYSTEM_AND_OS_T210_COMP@JETSON_NANO_TARGETS: fi
14:34:26.109 - info: NV_L4T_FILE_SYSTEM_AND_OS_T210_COMP@JETSON_NANO_TARGETS: done
14:34:26.110 - info: NV_L4T_FILE_SYSTEM_AND_OS_T210_COMP@JETSON_NANO_TARGETS: }
14:34:26.110 - info: NV_L4T_FILE_SYSTEM_AND_OS_T210_COMP@JETSON_NANO_TARGETS: safe_apt_install " sudo apt-get install -y qemu-user-static " 5
14:34:26.110 - info: NV_L4T_FILE_SYSTEM_AND_OS_T210_COMP@JETSON_NANO_TARGETS: # Per bug 200502536 #35
14:34:26.110 - info: NV_L4T_FILE_SYSTEM_AND_OS_T210_COMP@JETSON_NANO_TARGETS: safe_apt_install " sudo apt-get install -y python " 5
14:34:26.110 - info: NV_L4T_FILE_SYSTEM_AND_OS_T210_COMP@JETSON_NANO_TARGETS: **********************
14:34:26.110 - info: NV_L4T_FILE_SYSTEM_AND_OS_T210_COMP@JETSON_NANO_TARGETS: exec_command: /tmp/tmp_NV_L4T_FILE_SYSTEM_AND_OS_T210_COMP.sh
14:34:26.116 - info: NV_L4T_FILE_SYSTEM_AND_OS_T210_COMP@JETSON_NANO_TARGETS: *begin sudo apt-get install -y qemu-user-static , 5
14:34:26.118 - info: NV_L4T_FILE_SYSTEM_AND_OS_T210_COMP@JETSON_NANO_TARGETS: [host] [sudo] password for ass:
14:34:26.122 - info: [HOST PASSWORD]
14:34:26.126 - info: NV_L4T_FILE_SYSTEM_AND_OS_T210_COMP@JETSON_NANO_TARGETS:
14:34:26.248 - info: NV_L4T_FILE_SYSTEM_AND_OS_T210_COMP@JETSON_NANO_TARGETS: Reading package lists…
14:34:26.717 - info: NV_L4T_FILE_SYSTEM_AND_OS_T210_COMP@JETSON_NANO_TARGETS: Building dependency tree…
14:34:26.722 - info: NV_L4T_FILE_SYSTEM_AND_OS_T210_COMP@JETSON_NANO_TARGETS: Reading state information…
14:34:27.316 - info: NV_L4T_FILE_SYSTEM_AND_OS_T210_COMP@JETSON_NANO_TARGETS: qemu-user-static is already the newest version (1:2.11+dfsg-1ubuntu7.36).
14:34:27.317 - info: NV_L4T_FILE_SYSTEM_AND_OS_T210_COMP@JETSON_NANO_TARGETS: The following packages were automatically installed and are no longer required:
14:34:27.322 - info: NV_L4T_FILE_SYSTEM_AND_OS_T210_COMP@JETSON_NANO_TARGETS: fonts-liberation2 fonts-opensymbol gir1.2-gudev-1.0 gir1.2-udisks-2.0
14:34:27.326 - info: NV_L4T_FILE_SYSTEM_AND_OS_T210_COMP@JETSON_NANO_TARGETS: grilo-plugins-0.3-base gstreamer1.0-gtk3 libboost-date-time1.65.1
14:34:27.327 - info: NV_L4T_FILE_SYSTEM_AND_OS_T210_COMP@JETSON_NANO_TARGETS: libboost-filesystem1.65.1 libboost-iostreams1.65.1 libboost-locale1.65.1
14:34:27.327 - info: NV_L4T_FILE_SYSTEM_AND_OS_T210_COMP@JETSON_NANO_TARGETS: libcdr-0.1-1 libclucene-contribs1v5 libclucene-core1v5 libcmis-0.5-5v5
14:34:27.327 - info: NV_L4T_FILE_SYSTEM_AND_OS_T210_COMP@JETSON_NANO_TARGETS: libcolamd2 libdazzle-1.0-0 libe-book-0.1-1 libedataserverui-1.2-2 libeot0
14:34:27.327 - info: NV_L4T_FILE_SYSTEM_AND_OS_T210_COMP@JETSON_NANO_TARGETS: libepubgen-0.1-1 libetonyek-0.1-1 libevent-2.1-6 libexiv2-14
14:34:27.327 - info: NV_L4T_FILE_SYSTEM_AND_OS_T210_COMP@JETSON_NANO_TARGETS: libfreerdp-client2-2 libfreerdp2-2 libgc1c2 libgee-0.8-2 libgexiv2-2
14:34:27.329 - info: NV_L4T_FILE_SYSTEM_AND_OS_T210_COMP@JETSON_NANO_TARGETS: libgom-1.0-0 libgpgmepp6 libgpod-common libgpod4 liblangtag-common
14:34:27.329 - info: NV_L4T_FILE_SYSTEM_AND_OS_T210_COMP@JETSON_NANO_TARGETS: liblangtag1 liblirc-client0 liblua5.3-0 libmediaart-2.0-0 libmspub-0.1-1
14:34:27.330 - info: NV_L4T_FILE_SYSTEM_AND_OS_T210_COMP@JETSON_NANO_TARGETS: libodfgen-0.1-1 libqqwing2v5 libraw16 librevenge-0.0-0 libsgutils2-2
14:34:27.330 - info: NV_L4T_FILE_SYSTEM_AND_OS_T210_COMP@JETSON_NANO_TARGETS: libssh-4 libsuitesparseconfig5 libvncclient1 libwinpr2-2 libxapian30
14:34:27.330 - info: NV_L4T_FILE_SYSTEM_AND_OS_T210_COMP@JETSON_NANO_TARGETS: libxmlsec1 libxmlsec1-nss lp-solve media-player-info python3-mako
14:34:27.330 - info: NV_L4T_FILE_SYSTEM_AND_OS_T210_COMP@JETSON_NANO_TARGETS: python3-markupsafe syslinux syslinux-common syslinux-legacy
14:34:27.332 - info: NV_L4T_FILE_SYSTEM_AND_OS_T210_COMP@JETSON_NANO_TARGETS: usb-creator-common
14:34:27.332 - info: NV_L4T_FILE_SYSTEM_AND_OS_T210_COMP@JETSON_NANO_TARGETS: Use ‘sudo apt autoremove’ to remove them.
14:34:27.483 - info: NV_L4T_FILE_SYSTEM_AND_OS_T210_COMP@JETSON_NANO_TARGETS: 0 upgraded, 0 newly installed, 0 to remove and 244 not upgraded.
14:34:27.488 - info: NV_L4T_FILE_SYSTEM_AND_OS_T210_COMP@JETSON_NANO_TARGETS: *begin sudo apt-get install -y python , 5
14:34:27.606 - info: NV_L4T_FILE_SYSTEM_AND_OS_T210_COMP@JETSON_NANO_TARGETS: Reading package lists…
14:34:28.082 - info: NV_L4T_FILE_SYSTEM_AND_OS_T210_COMP@JETSON_NANO_TARGETS: Building dependency tree…
14:34:28.109 - info: NV_L4T_FILE_SYSTEM_AND_OS_T210_COMP@JETSON_NANO_TARGETS: Reading state information…
14:34:28.691 - info: NV_L4T_FILE_SYSTEM_AND_OS_T210_COMP@JETSON_NANO_TARGETS: python is already the newest version (2.7.15~rc1-1).
14:34:28.692 - info: NV_L4T_FILE_SYSTEM_AND_OS_T210_COMP@JETSON_NANO_TARGETS: The following packages were automatically installed and are no longer required:
14:34:28.702 - info: NV_L4T_FILE_SYSTEM_AND_OS_T210_COMP@JETSON_NANO_TARGETS: fonts-liberation2 fonts-opensymbol gir1.2-gudev-1.0 gir1.2-udisks-2.0
14:34:28.703 - info: NV_L4T_FILE_SYSTEM_AND_OS_T210_COMP@JETSON_NANO_TARGETS: grilo-plugins-0.3-base gstreamer1.0-gtk3 libboost-date-time1.65.1
14:34:28.703 - info: NV_L4T_FILE_SYSTEM_AND_OS_T210_COMP@JETSON_NANO_TARGETS: libboost-filesystem1.65.1 libboost-iostreams1.65.1 libboost-locale1.65.1
14:34:28.703 - info: NV_L4T_FILE_SYSTEM_AND_OS_T210_COMP@JETSON_NANO_TARGETS: libcdr-0.1-1 libclucene-contribs1v5 libclucene-core1v5 libcmis-0.5-5v5
14:34:28.703 - info: NV_L4T_FILE_SYSTEM_AND_OS_T210_COMP@JETSON_NANO_TARGETS: libcolamd2 libdazzle-1.0-0 libe-book-0.1-1 libedataserverui-1.2-2 libeot0
14:34:28.703 - info: NV_L4T_FILE_SYSTEM_AND_OS_T210_COMP@JETSON_NANO_TARGETS: libepubgen-0.1-1 libetonyek-0.1-1 libevent-2.1-6 libexiv2-14
14:34:28.704 - info: NV_L4T_FILE_SYSTEM_AND_OS_T210_COMP@JETSON_NANO_TARGETS: libfreerdp-client2-2 libfreerdp2-2 libgc1c2 libgee-0.8-2 libgexiv2-2
14:34:28.704 - info: NV_L4T_FILE_SYSTEM_AND_OS_T210_COMP@JETSON_NANO_TARGETS: libgom-1.0-0 libgpgmepp6 libgpod-common libgpod4 liblangtag-common
14:34:28.704 - info: NV_L4T_FILE_SYSTEM_AND_OS_T210_COMP@JETSON_NANO_TARGETS: liblangtag1 liblirc-client0 liblua5.3-0 libmediaart-2.0-0 libmspub-0.1-1
14:34:28.704 - info: NV_L4T_FILE_SYSTEM_AND_OS_T210_COMP@JETSON_NANO_TARGETS: libodfgen-0.1-1 libqqwing2v5 libraw16 librevenge-0.0-0 libsgutils2-2
14:34:28.704 - info: NV_L4T_FILE_SYSTEM_AND_OS_T210_COMP@JETSON_NANO_TARGETS: libssh-4 libsuitesparseconfig5 libvncclient1 libwinpr2-2 libxapian30
14:34:28.704 - info: NV_L4T_FILE_SYSTEM_AND_OS_T210_COMP@JETSON_NANO_TARGETS: libxmlsec1 libxmlsec1-nss lp-solve media-player-info python3-mako
14:34:28.705 - info: NV_L4T_FILE_SYSTEM_AND_OS_T210_COMP@JETSON_NANO_TARGETS: python3-markupsafe syslinux syslinux-common syslinux-legacy
14:34:28.705 - info: NV_L4T_FILE_SYSTEM_AND_OS_T210_COMP@JETSON_NANO_TARGETS: usb-creator-common
14:34:28.705 - info: NV_L4T_FILE_SYSTEM_AND_OS_T210_COMP@JETSON_NANO_TARGETS: Use ‘sudo apt autoremove’ to remove them.
14:34:28.864 - info: NV_L4T_FILE_SYSTEM_AND_OS_T210_COMP@JETSON_NANO_TARGETS: 0 upgraded, 0 newly installed, 0 to remove and 244 not upgraded.
14:34:28.871 - info: NV_L4T_FILE_SYSTEM_AND_OS_T210_COMP@JETSON_NANO_TARGETS: [ Package PreInstall Finished Successfully ]
14:34:28.871 - info: NV_L4T_FILE_SYSTEM_AND_OS_T210_COMP@JETSON_NANO_TARGETS: [ Package Install Started ]
14:34:28.872 - info: NV_L4T_FILE_SYSTEM_AND_OS_T210_COMP@JETSON_NANO_TARGETS: current working directory is /media/ass/WD/nvtmp/JetPack_4.5.1_Linux_JETSON_NANO_TARGETS/Linux_for_Tegra/rootfs
14:34:28.872 - info: NV_L4T_FILE_SYSTEM_AND_OS_T210_COMP@JETSON_NANO_TARGETS: exec_command [host]:
14:34:28.872 - info: NV_L4T_FILE_SYSTEM_AND_OS_T210_COMP@JETSON_NANO_TARGETS: **********************
14:34:28.872 - info: NV_L4T_FILE_SYSTEM_AND_OS_T210_COMP@JETSON_NANO_TARGETS: #!/bin/bash
14:34:28.872 - info: NV_L4T_FILE_SYSTEM_AND_OS_T210_COMP@JETSON_NANO_TARGETS: set -e
14:34:28.872 - info: NV_L4T_FILE_SYSTEM_AND_OS_T210_COMP@JETSON_NANO_TARGETS: sudo tar xpf /media/ass/WD/Users/proed/Desktop/tegra/Tegra_Linux_Sample-Root-Filesystem_R32.5.1_aarch64.tbz2
14:34:28.872 - info: NV_L4T_FILE_SYSTEM_AND_OS_T210_COMP@JETSON_NANO_TARGETS: cd …
14:34:28.873 - info: NV_L4T_FILE_SYSTEM_AND_OS_T210_COMP@JETSON_NANO_TARGETS: sudo ./apply_binaries.sh
14:34:28.873 - info: NV_L4T_FILE_SYSTEM_AND_OS_T210_COMP@JETSON_NANO_TARGETS: sudo mkdir -p rootfs/opt/nvidia/deb_repos
14:34:28.873 - info: NV_L4T_FILE_SYSTEM_AND_OS_T210_COMP@JETSON_NANO_TARGETS: echo ‘fix DNS service’
14:34:28.873 - info: NV_L4T_FILE_SYSTEM_AND_OS_T210_COMP@JETSON_NANO_TARGETS: pushd rootfs
14:34:28.873 - info: NV_L4T_FILE_SYSTEM_AND_OS_T210_COMP@JETSON_NANO_TARGETS: sudo install --owner=root --group=root /usr/bin/qemu-aarch64-static usr/bin
14:34:28.873 - info: NV_L4T_FILE_SYSTEM_AND_OS_T210_COMP@JETSON_NANO_TARGETS: sudo chroot . dpkg -P dnsmasq
14:34:28.874 - info: NV_L4T_FILE_SYSTEM_AND_OS_T210_COMP@JETSON_NANO_TARGETS: sudo rm -f usr/bin/qemu-aarch64-static
14:34:28.874 - info: NV_L4T_FILE_SYSTEM_AND_OS_T210_COMP@JETSON_NANO_TARGETS: popd
14:34:28.874 - info: NV_L4T_FILE_SYSTEM_AND_OS_T210_COMP@JETSON_NANO_TARGETS: **********************
14:34:28.874 - info: NV_L4T_FILE_SYSTEM_AND_OS_T210_COMP@JETSON_NANO_TARGETS: exec_command: /tmp/tmp_NV_L4T_FILE_SYSTEM_AND_OS_T210_COMP.sh
14:47:53.255 - info: NV_L4T_FILE_SYSTEM_AND_OS_T210_COMP@JETSON_NANO_TARGETS: Using rootfs directory of: /media/ass/WD/nvtmp/JetPack_4.5.1_Linux_JETSON_NANO_TARGETS/Linux_for_Tegra/rootfs
14:47:53.275 - info: NV_L4T_FILE_SYSTEM_AND_OS_T210_COMP@JETSON_NANO_TARGETS: ||||||||||||||||||||||| ERROR |||||||||||||||||||||||
14:47:53.276 - info: NV_L4T_FILE_SYSTEM_AND_OS_T210_COMP@JETSON_NANO_TARGETS: -----------------------------------------------------
14:47:53.276 - info: NV_L4T_FILE_SYSTEM_AND_OS_T210_COMP@JETSON_NANO_TARGETS: 1. The root filesystem, provided with this package,
14:47:53.276 - info: NV_L4T_FILE_SYSTEM_AND_OS_T210_COMP@JETSON_NANO_TARGETS: has to be extracted to this directory:
14:47:53.277 - info: NV_L4T_FILE_SYSTEM_AND_OS_T210_COMP@JETSON_NANO_TARGETS: /media/ass/WD/nvtmp/JetPack_4.5.1_Linux_JETSON_NANO_TARGETS/Linux_for_Tegra/rootfs
14:47:53.277 - info: NV_L4T_FILE_SYSTEM_AND_OS_T210_COMP@JETSON_NANO_TARGETS: -----------------------------------------------------
14:47:53.277 - info: NV_L4T_FILE_SYSTEM_AND_OS_T210_COMP@JETSON_NANO_TARGETS: 2. The root filesystem, provided with this package,
14:47:53.278 - info: NV_L4T_FILE_SYSTEM_AND_OS_T210_COMP@JETSON_NANO_TARGETS: has to be extracted with ‘sudo’ to this directory:
14:47:53.279 - info: NV_L4T_FILE_SYSTEM_AND_OS_T210_COMP@JETSON_NANO_TARGETS: /media/ass/WD/nvtmp/JetPack_4.5.1_Linux_JETSON_NANO_TARGETS/Linux_for_Tegra/rootfs
14:47:53.279 - info: NV_L4T_FILE_SYSTEM_AND_OS_T210_COMP@JETSON_NANO_TARGETS: -----------------------------------------------------
14:47:53.279 - info: NV_L4T_FILE_SYSTEM_AND_OS_T210_COMP@JETSON_NANO_TARGETS: Consult the Development Guide for instructions on
14:47:53.279 - info: NV_L4T_FILE_SYSTEM_AND_OS_T210_COMP@JETSON_NANO_TARGETS: extracting and flashing your device.
14:47:53.279 - info: NV_L4T_FILE_SYSTEM_AND_OS_T210_COMP@JETSON_NANO_TARGETS: |||||||||||||||||||||||||||||||||||||||||||||||||||||
14:47:53.289 - info: NV_L4T_FILE_SYSTEM_AND_OS_T210_COMP@JETSON_NANO_TARGETS: [ Package Install Finished with Error ]
14:47:53.289 - info: NV_L4T_FILE_SYSTEM_AND_OS_T210_COMP@JETSON_NANO_TARGETS: [host] [ 112.00 KB used. Disk Avail: 8.97 GB ]
14:47:53.289 - info: NV_L4T_FILE_SYSTEM_AND_OS_T210_COMP@JETSON_NANO_TARGETS: [ NV_L4T_FILE_SYSTEM_AND_OS_T210_COMP Install took 13m27s ]
14:47:53.290 - error: NV_L4T_FILE_SYSTEM_AND_OS_T210_COMP@JETSON_NANO_TARGETS: [error]: : [exec_command]: /bin/bash -c /tmp/tmp_NV_L4T_FILE_SYSTEM_AND_OS_T210_COMP.sh; [error]:
14:47:53.290 - info: Event: NV_L4T_FILE_SYSTEM_AND_OS_T210_COMP@JETSON_NANO_TARGETS - error is: [error]: : [exec_command]: /bin/bash -c /tmp/tmp_NV_L4T_FILE_SYSTEM_AND_OS_T210_COMP.sh; [error]:
14:47:53.291 - info: NV_L4T_FILE_SYSTEM_AND_OS_T210_COMP@JETSON_NANO_TARGETS:
14:47:53.292 - error: cmd finished failure SDKM_END_CODE_FAILURE_86a643db-c575-4f79-938c-61580fb061fd_11
14:47:53.292 - error: command error code: 11
14:47:53.292 - info: Event: NV_L4T_FILE_SYSTEM_AND_OS_T210_COMP@JETSON_NANO_TARGETS - error code is: 1011
14:47:53.292 - error: NV_L4T_FILE_SYSTEM_AND_OS_T210_COMP@JETSON_NANO_TARGETS: command terminated with error
14:47:53.293 - info: Event: NV_L4T_FILE_SYSTEM_AND_OS_T210_COMP@JETSON_NANO_TARGETS - error is: command terminated with error
14:47:53.316 - info: Event: NV_L4T_FILE_SYSTEM_AND_OS_T210_COMP@JETSON_NANO_TARGETS - install ended - failure
14:47:53.317 - error: Session first failure occurred while Installing. Root cause component: NV_L4T_FILE_SYSTEM_AND_OS_T210_COMP@JETSON_NANO_TARGETS. Root cause error code: (1011: Failed to execute commands with GenericInstaller)
14:47:53.320 - info: Summary: NV_L4T_FILE_SYSTEM_AND_OS_T210_COMP@JETSON_NANO_TARGETS: Installation failed.
14:47:53.322 - info: Event: NV_L4T_FLASH_NANO_DEVKIT_WITH_OS_IMAGE_COMP@JETSON_NANO_TARGETS - error is: Flash Jetson Nano (Devkit) Skipped. Due to its dependencies fail to install: File System and OS
14:47:53.323 - info: Event: NV_L4T_FLASH_NANO_DEVKIT_WITH_OS_IMAGE_COMP@JETSON_NANO_TARGETS - install ended - failure
14:47:53.323 - info: Summary: NV_L4T_FLASH_NANO_DEVKIT_WITH_OS_IMAGE_COMP@JETSON_NANO_TARGETS: Depends on failed component
14:47:53.325 - info: Event: NV_L4T_FLASH_NANO_2GB_DEVKIT_WITH_OS_IMAGE_COMP@JETSON_NANO_TARGETS - error is: Flash Jetson Nano 2GB (Devkit) Skipped. Due to its dependencies fail to install: File System and OS
14:47:53.326 - info: Event: NV_L4T_FLASH_NANO_2GB_DEVKIT_WITH_OS_IMAGE_COMP@JETSON_NANO_TARGETS - install ended - failure
14:47:53.326 - info: Summary: NV_L4T_FLASH_NANO_2GB_DEVKIT_WITH_OS_IMAGE_COMP@JETSON_NANO_TARGETS: Depends on failed component
14:47:53.326 - info: Event: NV_L4T_FLASH_NANO_WITH_OS_IMAGE_COMP@JETSON_NANO_TARGETS - error is: Flash Jetson Nano Skipped. Due to its dependencies fail to install: File System and OS
14:47:53.327 - info: Event: NV_L4T_FLASH_NANO_WITH_OS_IMAGE_COMP@JETSON_NANO_TARGETS - install ended - failure
14:47:53.327 - info: Summary: NV_L4T_FLASH_NANO_WITH_OS_IMAGE_COMP@JETSON_NANO_TARGETS: Depends on failed component
14:47:53.327 - info: Event: NV_DEVICE_MODE_SETUP_IMAGE_COMP@JETSON_NANO_TARGETS - error is: Device Mode Host Setup in Flash Skipped. Due to its dependencies fail to install: File System and OS
14:47:53.328 - info: Event: NV_DEVICE_MODE_SETUP_IMAGE_COMP@JETSON_NANO_TARGETS - install ended - failure
14:47:53.328 - info: Summary: NV_DEVICE_MODE_SETUP_IMAGE_COMP@JETSON_NANO_TARGETS: Depends on failed component
14:47:53.329 - info: Event: NV_L4T_FLASH_NANO_DEVKIT_WITH_OS_IMAGE_COMP@JETSON_NANO_TARGETS - error is: Flash Jetson Nano (Devkit) Skipped. Due to its dependencies fail to install: Device Mode Host Setup in Flash
14:47:53.329 - info: Event: NV_L4T_FLASH_NANO_DEVKIT_WITH_OS_IMAGE_COMP@JETSON_NANO_TARGETS - install ended - failure
14:47:53.329 - info: Summary: NV_L4T_FLASH_NANO_DEVKIT_WITH_OS_IMAGE_COMP@JETSON_NANO_TARGETS: Depends on failed component
14:47:53.330 - info: Stopping all currently running download services
14:47:53.425 - info: Event: NV_L4T_FLASH_NANO_2GB_DEVKIT_WITH_OS_IMAGE_COMP@JETSON_NANO_TARGETS - error is: Flash Jetson Nano 2GB (Devkit) Skipped. Due to its dependencies fail to install: Device Mode Host Setup in Flash
14:47:53.425 - info: Event: NV_L4T_FLASH_NANO_2GB_DEVKIT_WITH_OS_IMAGE_COMP@JETSON_NANO_TARGETS - install ended - failure
14:47:53.425 - info: Summary: NV_L4T_FLASH_NANO_2GB_DEVKIT_WITH_OS_IMAGE_COMP@JETSON_NANO_TARGETS: Depends on failed component
14:47:53.500 - info: Event: NV_L4T_FLASH_NANO_WITH_OS_IMAGE_COMP@JETSON_NANO_TARGETS - error is: Flash Jetson Nano Skipped. Due to its dependencies fail to install: Device Mode Host Setup in Flash
14:47:53.500 - info: Event: NV_L4T_FLASH_NANO_WITH_OS_IMAGE_COMP@JETSON_NANO_TARGETS - install ended - failure
14:47:53.500 - info: Summary: NV_L4T_FLASH_NANO_WITH_OS_IMAGE_COMP@JETSON_NANO_TARGETS: Depends on failed component
14:47:53.729 - info: The overall duration (Download + Install) is 00:13:30

14:47:53.731 - info:
*** Download Summary ***

    - Bundle: JetPack 4.5.1 Linux for Jetson Nano modules
    - Download server: DevZone
    - 0B downloaded of 1.61GB
    - Download started on: Mon May 17 2021 14:34:23 GMT+0300 (Eastern European Summer Time).
    - Download ended on: Mon May 17 2021 14:34:26 GMT+0300 (Eastern European Summer Time).
    - Download duration: 00:00:02.
    - Average total download speed: 0B/s = total downloaded bytes / download duration.
    - Average total bandwidth: 0B/s, average accumulation of all file chunk's speed, downloaded concurrently.
    - Average file chunk's download speed: 0B/s, average of all downloaded file chunk's speed.
    - Max 3 concurrent files using 2 threads.

    Total 2 files:
    - 0 downloaded, 1 cached, 0 failed, 1 skipped

    Details:

None
*** End of Download Summary ***

14:47:53.733 - info:
*** Install summary of 6 components ***

    Install started on: 14:34:26 GMT+0300 (Eastern European Summer Time).

    Install ended on: 14:47:53 GMT+0300 (Eastern European Summer Time).

    Install duration:  00:13:27 .

    Install idle time: 0.000s .

    Real install duration (duration - idle time): 00:13:27 .

    Install 1 components.

        - Up-to-date 1 components.

    Install failed 5 files.

    Install skipped 0 files.

    Install details:
  • NV_L4T_DRIVERS_T210_COMP@JETSON_NANO_TARGETS: Up-to-date.
  • NV_L4T_FILE_SYSTEM_AND_OS_T210_COMP@JETSON_NANO_TARGETS: Failed - 00:13:27 -start: 14:34:26 GMT+0300 (Eastern European Summer Time) - end: 14:47:53 GMT+0300 (Eastern European Summer Time).
  • NV_DEVICE_MODE_SETUP_IMAGE_COMP@JETSON_NANO_TARGETS: Failed - start: none - end: none.
  • NV_L4T_FLASH_NANO_DEVKIT_WITH_OS_IMAGE_COMP@JETSON_NANO_TARGETS: Failed - start: none - end: none.
  • NV_L4T_FLASH_NANO_2GB_DEVKIT_WITH_OS_IMAGE_COMP@JETSON_NANO_TARGETS: Failed - start: none - end: none.
  • NV_L4T_FLASH_NANO_WITH_OS_IMAGE_COMP@JETSON_NANO_TARGETS: Failed - start: none - end: none.

*** End of Install Summary ***

14:47:53.734 - error:
14:47:53.873 - info:

********************** Completed install for bundle JetPack 4.5.1 Linux for Jetson Nano modules time: 17-May-2021-14.47:53 is succeeded: false **********************
14:47:53.873 - info: Event: Session ended: JetPack 4.5.1 Linux for Jetson Nano modules - failure
14:47:53.874 - info: Setting SessionInitialStatus with value: Download: 0. Install: 80
14:47:53.874 - error: Trying to set a custom dimension: SessionInitialStatus - cd12, Download: 0. Install: 80. Visitor is not initialized.
14:47:53.875 - info: target image duration: all (end time - start time): 00:13:27. duration summary: 00:13:27

14:47:53.943 - info: cleaning the group map
14:47:53.943 - info: BundleData constructMap
14:47:54.262 - info: stdout: Querying the install status of ‘CUDA on Host’ (NV_CUDA_HOST_COMP)
exec_command: dpkg-query -W -f=’${db:Status-abbrev} ${Version}’ cuda-toolkit-10-2

14:47:54.266 - info: stdout: Querying the install status of ‘CUDA Cross Compile Package on Host’ (NV_CUDA_CROSS_HOST_COMP)
exec_command: dpkg-query -W -f=’${db:Status-abbrev} ${Version}’ cuda-cross-aarch64-10-2

14:47:54.266 - info: stdout: Querying the install status of ‘VisionWorks on Host’ (NV_VISIONWORKS_HOST_COMP)
exec_command: dpkg-query -W -f=’${db:Status-abbrev} ${Version}’ libvisionworks

14:47:54.270 - info: stdout: Querying the install status of ‘VPI on Host’ (NV_VPI_HOST_COMP)
exec_command: dpkg-query -W -f=’${db:Status-abbrev} ${Version}’ libnvvpi1

14:47:54.271 - info: stdout: Querying the install status of ‘VPI Cross Compile Package on Host’ (NV_VPI_CROSS_HOST_COMP)
exec_command: dpkg-query -W -f=’${db:Status-abbrev} ${Version}’ vpi1-cross-aarch64-l4t

14:47:54.271 - info: stdout: Querying the install status of ‘NVIDIA Nsight Graphics’ (NV_L4T_NVIDIA_NSIGHT_GRAPHICS_HOST_COMP)
exec_command: dpkg-query -W -f=’${db:Status-abbrev} ${Version}’ nsight-graphics-for-embeddedlinux-2020.5.1

14:47:54.271 - info: stdout: Querying the install status of ‘NVIDIA Nsight Systems’ (NV_L4T_NVIDIA_NSIGHT_SYSTEMS_HOST_COMP)
exec_command: dpkg-query -W -f=’${db:Status-abbrev} ${Version}’ nsight-systems-2020.5.3

14:47:54.323 - info: stdout: Host Deb package NV_CUDA_HOST_COMP cuda-repo-ubuntu1804-10-2-local-10.2.89-440.40_1.0-1_amd64.deb installed successfully.

14:47:54.324 - info: stdout: exec_command: dpkg-query -W -f=’${db:Status-abbrev} ${Version}’ libvisionworks-dev

14:47:54.325 - info: Component: NV_CUDA_HOST_COMP version: 10.2 for bundle: JetPack_4.5.1_Linux is installed
14:47:54.342 - info: stdout: Host Deb package NV_CUDA_CROSS_HOST_COMP cuda-repo-cross-aarch64-10-2-local-10.2.89_1.0-1_all.deb installed successfully.

14:47:54.344 - info: stdout: Host Deb package NV_VPI_CROSS_HOST_COMP vpi-cross-aarch64-l4t-1.0.15-x86_64-linux.deb installed successfully.

14:47:54.346 - info: Component: NV_CUDA_CROSS_HOST_COMP version: 10.2 for bundle: JetPack_4.5.1_Linux is installed
14:47:54.348 - info: Component: NV_VPI_CROSS_HOST_COMP version: 1.0 for bundle: JetPack_4.5.1_Linux is installed
14:47:54.353 - info: stdout: Host Deb package NV_VPI_HOST_COMP vpi-lib-1.0.15-cuda10-x86_64-linux.deb installed successfully.
exec_command: dpkg-query -W -f=’${db:Status-abbrev} ${Version}’ vpi1-dev

14:47:54.447 - info: stdout: Host Deb package NV_L4T_NVIDIA_NSIGHT_GRAPHICS_HOST_COMP NVIDIA_Nsight_Graphics_L4T_Public_2020.5.20329.deb installed successfully.

14:47:54.447 - info: Component: NV_L4T_NVIDIA_NSIGHT_GRAPHICS_HOST_COMP version: 2020.5 for bundle: JetPack_4.5.1_Linux is installed
14:47:54.458 - info: stdout: exec_command: dpkg-query -W -f=’${db:Status-abbrev} ${Version}’ libvisionworks-samples

14:47:54.478 - info: stdout: Host Deb package NV_L4T_NVIDIA_NSIGHT_SYSTEMS_HOST_COMP NsightSystems-linux-public-2020.5.3.17-0256620.deb installed successfully.

14:47:54.478 - info: Component: NV_L4T_NVIDIA_NSIGHT_SYSTEMS_HOST_COMP version: 2020.5 for bundle: JetPack_4.5.1_Linux is installed
14:47:54.487 - info: stdout: Host Deb package NV_VPI_HOST_COMP vpi-dev-1.0.15-cuda10-x86_64-linux.deb installed successfully.
exec_command: dpkg-query -W -f=’${db:Status-abbrev} ${Version}’ vpi1-samples

14:47:54.521 - info: stdout: Host Deb package NV_VISIONWORKS_HOST_COMP libvisionworks-repo_1.6.0.501_amd64.deb installed successfully.
exec_command: dpkg-query -W -f=’${db:Status-abbrev} ${Version}’ libvisionworks-sfm

14:47:54.531 - info: stdout: Host Deb package NV_VPI_HOST_COMP vpi-samples-1.0.15-cuda10-x86_64-linux.deb installed successfully.

14:47:54.531 - info: Component: NV_VPI_HOST_COMP version: 1.0 for bundle: JetPack_4.5.1_Linux is installed
14:47:54.561 - info: stdout: exec_command: dpkg-query -W -f=’${db:Status-abbrev} ${Version}’ libvisionworks-sfm-dev

14:47:54.602 - info: stdout: Host Deb package NV_VISIONWORKS_HOST_COMP libvisionworks-sfm-repo_0.90.4.501_amd64.deb installed successfully.
exec_command: dpkg-query -W -f=’${db:Status-abbrev} ${Version}’ libvisionworks-tracking

14:47:54.642 - info: stdout: exec_command: dpkg-query -W -f=’${db:Status-abbrev} ${Version}’ libvisionworks-tracking-dev

14:47:54.681 - info: stdout: Host Deb package NV_VISIONWORKS_HOST_COMP libvisionworks-tracking-repo_0.88.2.501_amd64.deb installed successfully.

14:47:54.681 - info: Component: NV_VISIONWORKS_HOST_COMP version: 1.6 for bundle: JetPack_4.5.1_Linux is installed
14:47:54.698 - info: cleaning the group map
14:47:54.698 - info: BundleData constructMap
14:47:54.699 - warn: comp NV_L4T_DRIVERS_T186_COMP filtered out, due to supported targetIDs [JETSON_TX2_TARGETS], not include JETSON_NANO_2GB_DEVKIT
14:47:54.699 - warn: comp NV_L4T_DRIVERS_T194_COMP filtered out, due to supported targetIDs [JETSON_AGX_XAVIER_TARGETS,JETSON_XAVIER_NX_TARGETS], not include JETSON_NANO_2GB_DEVKIT
14:47:54.700 - warn: comp NV_L4T_FILE_SYSTEM_AND_OS_T186_COMP filtered out, due to invalid dependencies: [NV_L4T_DRIVERS_T186_COMP 32.5]
14:47:54.700 - warn: comp NV_L4T_FILE_SYSTEM_AND_OS_T194_COMP filtered out, due to invalid dependencies: [NV_L4T_DRIVERS_T194_COMP 32.5]
14:47:54.701 - warn: comp NV_L4T_FLASH_XAVIER_WITH_OS_IMAGE_COMP filtered out, due to invalid dependencies: [NV_L4T_FILE_SYSTEM_AND_OS_T194_COMP 32.5]
14:47:54.701 - warn: comp NV_L4T_FLASH_XAVIER_8GB_WITH_OS_IMAGE_COMP filtered out, due to invalid dependencies: [NV_L4T_FILE_SYSTEM_AND_OS_T194_COMP 32.5]
14:47:54.701 - warn: comp NV_L4T_FLASH_XAVIER_NX_WITH_OS_IMAGE_COMP filtered out, due to invalid dependencies: [NV_L4T_FILE_SYSTEM_AND_OS_T194_COMP 32.5]
14:47:54.702 - warn: comp NV_L4T_FLASH_XAVIER_NX_DEVKIT_WITH_OS_IMAGE_COMP filtered out, due to invalid dependencies: [NV_L4T_FILE_SYSTEM_AND_OS_T194_COMP 32.5]
14:47:54.702 - warn: comp NV_L4T_FLASH_TX2_WITH_OS_IMAGE_COMP filtered out, due to invalid dependencies: [NV_L4T_FILE_SYSTEM_AND_OS_T186_COMP 32.5]
14:47:54.702 - warn: comp NV_L4T_FLASH_TX2I_WITH_OS_IMAGE_COMP filtered out, due to invalid dependencies: [NV_L4T_FILE_SYSTEM_AND_OS_T186_COMP 32.5]
14:47:54.702 - warn: comp NV_L4T_FLASH_TX2_4GB_WITH_OS_IMAGE_COMP filtered out, due to invalid dependencies: [NV_L4T_FILE_SYSTEM_AND_OS_T186_COMP 32.5]
14:47:54.702 - warn: comp NV_L4T_FLASH_TX2_NX_WITH_OS_IMAGE_COMP filtered out, due to invalid dependencies: [NV_L4T_FILE_SYSTEM_AND_OS_T186_COMP 32.5]
14:47:54.702 - warn: comp NV_L4T_FLASH_TX1_WITH_OS_IMAGE_COMP filtered out, due to supported targetIDs [JETSON_TX1_TARGETS], not include JETSON_NANO_2GB_DEVKIT
14:47:54.702 - warn: comp NV_L4T_FLASH_NANO_DEVKIT_WITH_OS_IMAGE_COMP filtered out, due to supported targetIDs [JETSON_NANO_TARGETS], not include JETSON_NANO_2GB_DEVKIT
14:47:54.703 - warn: comp NV_L4T_FLASH_NANO_WITH_OS_IMAGE_COMP filtered out, due to supported targetIDs [JETSON_NANO_TARGETS], not include JETSON_NANO_2GB_DEVKIT
14:47:54.705 - warn: comp NV_L4T_TENSORRT_DLA_TARGET_POST_INSTALL_COMP filtered out, due to supported targetIDs [JETSON_AGX_XAVIER_TARGETS,JETSON_XAVIER_NX_TARGETS], not include JETSON_NANO_2GB_DEVKIT
14:47:54.708 - warn: comp NV_L4T_MULTIMEDIA_API_TARGET_POST_INSTALL_T186_COMP filtered out, due to supported targetIDs [JETSON_TX2_TARGETS], not include JETSON_NANO_2GB_DEVKIT
14:47:54.709 - warn: comp NV_L4T_MULTIMEDIA_API_TARGET_POST_INSTALL_T194_COMP filtered out, due to invalid dependencies: [NV_L4T_TENSORRT_DLA_TARGET_POST_INSTALL_COMP 7.1]
14:47:54.717 - info: cleaning the group map
14:47:54.717 - info: BundleData constructMap
14:47:54.718 - warn: comp NV_L4T_DRIVERS_T186_COMP filtered out, due to supported targetIDs [JETSON_TX2_TARGETS], not include JETSON_NANO_TARGETS
14:47:54.718 - warn: comp NV_L4T_DRIVERS_T194_COMP filtered out, due to supported targetIDs [JETSON_AGX_XAVIER_TARGETS,JETSON_XAVIER_NX_TARGETS], not include JETSON_NANO_TARGETS
14:47:54.719 - warn: comp NV_L4T_FILE_SYSTEM_AND_OS_T186_COMP filtered out, due to invalid dependencies: [NV_L4T_DRIVERS_T186_COMP 32.5]
14:47:54.719 - warn: comp NV_L4T_FILE_SYSTEM_AND_OS_T194_COMP filtered out, due to invalid dependencies: [NV_L4T_DRIVERS_T194_COMP 32.5]
14:47:54.719 - warn: comp NV_L4T_FLASH_XAVIER_WITH_OS_IMAGE_COMP filtered out, due to invalid dependencies: [NV_L4T_FILE_SYSTEM_AND_OS_T194_COMP 32.5]
14:47:54.720 - warn: comp NV_L4T_FLASH_XAVIER_8GB_WITH_OS_IMAGE_COMP filtered out, due to invalid dependencies: [NV_L4T_FILE_SYSTEM_AND_OS_T194_COMP 32.5]
14:47:54.720 - warn: comp NV_L4T_FLASH_XAVIER_NX_WITH_OS_IMAGE_COMP filtered out, due to invalid dependencies: [NV_L4T_FILE_SYSTEM_AND_OS_T194_COMP 32.5]
14:47:54.720 - warn: comp NV_L4T_FLASH_XAVIER_NX_DEVKIT_WITH_OS_IMAGE_COMP filtered out, due to invalid dependencies: [NV_L4T_FILE_SYSTEM_AND_OS_T194_COMP 32.5]
14:47:54.720 - warn: comp NV_L4T_FLASH_TX2_WITH_OS_IMAGE_COMP filtered out, due to invalid dependencies: [NV_L4T_FILE_SYSTEM_AND_OS_T186_COMP 32.5]
14:47:54.720 - warn: comp NV_L4T_FLASH_TX2I_WITH_OS_IMAGE_COMP filtered out, due to invalid dependencies: [NV_L4T_FILE_SYSTEM_AND_OS_T186_COMP 32.5]
14:47:54.720 - warn: comp NV_L4T_FLASH_TX2_4GB_WITH_OS_IMAGE_COMP filtered out, due to invalid dependencies: [NV_L4T_FILE_SYSTEM_AND_OS_T186_COMP 32.5]
14:47:54.720 - warn: comp NV_L4T_FLASH_TX2_NX_WITH_OS_IMAGE_COMP filtered out, due to invalid dependencies: [NV_L4T_FILE_SYSTEM_AND_OS_T186_COMP 32.5]
14:47:54.721 - warn: comp NV_L4T_FLASH_TX1_WITH_OS_IMAGE_COMP filtered out, due to supported targetIDs [JETSON_TX1_TARGETS], not include JETSON_NANO_TARGETS
14:47:54.723 - warn: comp NV_L4T_TENSORRT_DLA_TARGET_POST_INSTALL_COMP filtered out, due to supported targetIDs [JETSON_AGX_XAVIER_TARGETS,JETSON_XAVIER_NX_TARGETS], not include JETSON_NANO_TARGETS
14:47:54.725 - warn: comp NV_L4T_MULTIMEDIA_API_TARGET_POST_INSTALL_T186_COMP filtered out, due to supported targetIDs [JETSON_TX2_TARGETS], not include JETSON_NANO_TARGETS
14:47:54.726 - warn: comp NV_L4T_MULTIMEDIA_API_TARGET_POST_INSTALL_T194_COMP filtered out, due to invalid dependencies: [NV_L4T_TENSORRT_DLA_TARGET_POST_INSTALL_COMP 7.1]
14:48:55.258 - info: install timeout for ‘File System and OS’, [Continue]
15:00:27.152 - info: exporting logs from /home/ass/.nvsdkm/logs/JetPack_4.5.1_Linux
15:00:27.769 - info: Exported 13 log files to /media/ass/WD/Users/proed/Desktop/tegra/SDKM_logs_JetPack_4.5.1_Linux_for_Jetson_Nano_modules_2021-05-17_14-34-12.zip

Hi,

What is the disk space remaining on your host?