errors while debugging

i have installed

  1. CUDA 2.2 NVIDIA Notebook Driver for Windows XP 32-bit 185.85 (i have note)
  2. CUDA Toolkit v.2.2
  3. CUDA SDK v.2.2
  4. Visual Studio 2008 Prof ed
  5. CUDA Visual Studio Wizard from sourceforge.net/projects/cudavswizard/
    then i chose file -> new -> project -> visual c++ -> cuda64. after that i tried to debug sample.cu, but i’ve got errors
    here is a log file:

Build Log
Build started: Project: CUDAWinApp1, Configuration: Debug|x64

Command Lines
Creating temporary file “c:\Documents and Settings\Trarex\Рабочий стол\CUDAWinApp1\CUDAWinApp1\x64\Debug\BAT00000940042808.bat” with contents
[
@echo off

“C:\CUDA\bin\nvcc.exe” -ccbin “d:\Program\Programming\VS installed\VC\bin” -I"C:\CUDA\include" -I"C:\Documents and Settings\All Users\Application Data\NVIDIA Corporation\NVIDIA CUDA SDK\common\inc" -O0 -D_DEBUG -D_CONSOLE -arch compute_10 -code sm_10 --host-compilation C++ -g -c -m 64 -o “x64\Debug\sample.obj” -odir “x64\Debug” -ext none -int real “c:\Documents and Settings\Trarex\Рабочий стол\CUDAWinApp1\CUDAWinApp1\sample.cu”

if errorlevel 1 goto VCReportError

goto VCEnd

:VCReportError

echo Project : error PRJ0019: A tool returned an error code from “Compiling…”

exit 1

:VCEnd
]
Creating command line “”“c:\Documents and Settings\Trarex\Рабочий стол\CUDAWinApp1\CUDAWinApp1\x64\Debug\BAT00000940042808.bat”""
Output Window
Compiling…
sample.cu
tmpxft_00000eb4_00000000-3_sample.cudafe1.gpu
c:\cuda\include\texture_fetch_functions.h(71): error: expected a file name
c:\cuda\include\texture_fetch_functions.h(73): error: expected a file name
C:\CUDA\include\common_functions.h(97): error: expected a file name
C:\CUDA\include\common_functions.h(99): error: expected a file name
C:\CUDA\include\common_functions.h(101): error: expected a file name
C:\CUDA\include\common_functions.h(103): error: expected a file name
C:\CUDA\include\common_functions.h(105): error: expected a file name
C:\CUDA\include\common_functions.h(107): error: expected a file name
C:\CUDA\include\common_functions.h(109): error: expected a file name
C:\CUDA\include\common_functions.h(111): error: expected a file name
C:\CUDA\include\common_functions.h(113): error: expected a file name
C:\CUDA\include\common_functions.h(115): error: expected a file name
C:\CUDA\include\common_functions.h(117): error: expected a file name
C:\CUDA\include\common_functions.h(119): error: expected a file name
C:\CUDA\include\common_functions.h(121): error: expected a file name
C:\CUDA\include\common_functions.h(123): error: expected a file name
C:\CUDA\include\common_functions.h(125): error: expected a file name
C:\CUDA\include\common_functions.h(127): error: expected a file name
C:\CUDA\include\common_functions.h(129): error: expected a file name
C:\CUDA\include\common_functions.h(131): error: expected a file name
C:\CUDA\include\common_functions.h(133): error: expected a file name
C:\CUDA\include\common_functions.h(135): error: expected a file name
C:\CUDA\include\common_functions.h(137): error: expected a file name
C:\CUDA\include\common_functions.h(139): error: expected a file name
C:\CUDA\include\common_functions.h(141): error: expected a file name
C:\CUDA\include\common_functions.h(143): error: expected a file name
C:\CUDA\include\common_functions.h(145): error: expected a file name
C:\CUDA\include\common_functions.h(147): error: expected a file name
C:\CUDA\include\common_functions.h(149): error: expected a file name
C:\CUDA\include\common_functions.h(151): error: expected a file name
C:\CUDA\include\common_functions.h(153): error: expected a file name
C:\CUDA\include\common_functions.h(155): error: expected a file name
C:\CUDA\include\common_functions.h(157): error: expected a file name
C:\CUDA\include\common_functions.h(159): error: expected a file name
C:\CUDA\include\common_functions.h(161): error: expected a file name
C:\CUDA\include\common_functions.h(163): error: expected a file name
C:\CUDA\include\common_functions.h(165): error: expected a file name
C:\CUDA\include\common_functions.h(167): error: expected a file name
C:\CUDA\include\common_functions.h(169): error: expected a file name
C:\CUDA\include\common_functions.h(171): error: expected a file name
C:\CUDA\include\common_functions.h(173): error: expected a file name
C:\CUDA\include\common_functions.h(175): error: expected a file name
C:\CUDA\include\common_functions.h(177): error: expected a file name
C:\CUDA\include\common_functions.h(179): error: expected a file name
C:\CUDA\include\common_functions.h(181): error: expected a file name
C:\CUDA\include\common_functions.h(183): error: expected a file name
C:\CUDA\include\common_functions.h(185): error: expected a file name
C:\CUDA\include\common_functions.h(187): error: expected a file name
C:\CUDA\include\common_functions.h(189): error: expected a file name
C:\CUDA\include\common_functions.h(191): error: expected a file name
C:\CUDA\include\common_functions.h(193): error: expected a file name
C:\CUDA\include\common_functions.h(195): error: expected a file name
C:\CUDA\include\common_functions.h(197): error: expected a file name
C:\CUDA\include\common_functions.h(199): error: expected a file name
C:\CUDA\include\common_functions.h(201): error: expected a file name
C:\CUDA\include\common_functions.h(203): error: expected a file name
C:\CUDA\include\common_functions.h(205): error: expected a file name
C:\CUDA\include\common_functions.h(207): error: expected a file name
C:\CUDA\include\common_functions.h(209): error: expected a file name
C:\CUDA\include\common_functions.h(211): error: expected a file name
C:\CUDA\include\common_functions.h(213): error: expected a file name
C:\CUDA\include\common_functions.h(215): error: expected a file name
C:\CUDA\include\common_functions.h(217): error: expected a file name
C:\CUDA\include\common_functions.h(219): error: expected a file name
C:\CUDA\include\common_functions.h(221): error: expected a file name
C:\CUDA\include\common_functions.h(223): error: expected a file name
C:\CUDA\include\common_functions.h(225): error: expected a file name
C:\CUDA\include\common_functions.h(227): error: expected a file name
C:\CUDA\include\common_functions.h(229): error: expected a file name
C:\CUDA\include\common_functions.h(231): error: expected a file name
C:\CUDA\include\common_functions.h(233): error: expected a file name
C:\CUDA\include\common_functions.h(235): error: expected a file name
C:\CUDA\include\common_functions.h(237): error: expected a file name
C:\CUDA\include\common_functions.h(239): error: expected a file name
C:\CUDA\include\common_functions.h(241): error: expected a file name
C:\CUDA\include\common_functions.h(243): error: expected a file name
C:\CUDA\include\common_functions.h(245): error: expected a file name
C:\CUDA\include\common_functions.h(247): error: expected a file name
C:\CUDA\include\common_functions.h(249): error: expected a file name
C:\CUDA\include\common_functions.h(251): error: expected a file name
C:\CUDA\include\common_functions.h(253): error: expected a file name
C:\CUDA\include\common_functions.h(255): error: expected a file name
C:\CUDA\include\common_functions.h(257): error: expected a file name
C:\CUDA\include\common_functions.h(259): error: expected a file name
C:\CUDA\include\common_functions.h(261): error: expected a file name
C:\CUDA\include\common_functions.h(263): error: expected a file name
C:\CUDA\include\common_functions.h(265): error: expected a file name
C:\CUDA\include\common_functions.h(267): error: expected a file name
C:\CUDA\include\common_functions.h(269): error: expected a file name
C:\CUDA\include\common_functions.h(271): error: expected a file name
C:\CUDA\include\common_functions.h(273): error: expected a file name
C:\CUDA\include\common_functions.h(275): error: expected a file name
C:\CUDA\include\common_functions.h(277): error: expected a file name
C:\CUDA\include\common_functions.h(279): error: expected a file name
C:\CUDA\include\common_functions.h(281): error: expected a file name
C:\CUDA\include\common_functions.h(283): error: expected a file name
C:\CUDA\include\common_functions.h(285): error: expected a file name
C:\CUDA\include\common_functions.h(287): error: expected a file name
C:\CUDA\include\common_functions.h(289): error: expected a file name
C:\CUDA\include\common_functions.h(291): error: expected a file name
Error limit reached.
100 errors detected in the compilation of “C:\DOCUME~1\Trarex\LOCALS~1\Temp/tmpxft_00000eb4_00000000-7_sample.cpp2.i”.
Compilation terminated.
Results
Build log was saved at “file://c:\Documents and Settings\Trarex\Рабочий стол\CUDAWinApp1\CUDAWinApp1\x64\Debug\BuildLog.htm”
CUDAWinApp1 - 100 error(s), 0 warning(s)

can someone explain the problem and tell its solution?

sorry for my english