Fc6: kernel weights has count 9633792 but 15138816 was expected

0:00:02.708795183 215 0x2d45780 INFO nvinfer gstnvinfer.cpp:619:gst_nvinfer_logger: NvDsInferContext[UID 2]: Info from NvDsInferContextImpl::buildModel() <nvdsinfer_context_impl.cpp:1716> [UID = 2]: Trying to create engine from model files
ERROR: …/nvdsinfer/nvdsinfer_func_utils.cpp:33 [TRT]: fc6: kernel weights has count 9633792 but 15138816 was expected
ERROR: …/nvdsinfer/nvdsinfer_func_utils.cpp:33 [TRT]: Could not compute dimensions for (Unnamed Layer* 11) [Fully Connected]_output, because the network is not valid.
ERROR: …/nvdsinfer/nvdsinfer_func_utils.cpp:33 [TRT]: Network validation failed.
ERROR: …/nvdsinfer/nvdsinfer_model_builder.cpp:1186 Build engine failed from config file
ERROR: …/nvdsinfer/nvdsinfer_model_builder.cpp:884 failed to build trt engine.
0:00:13.741568889 215 0x2d45780 ERROR nvinfer gstnvinfer.cpp:613:gst_nvinfer_logger: NvDsInferContext[UID 2]: Error in NvDsInferContextImpl::buildModel() <nvdsinfer_context_impl.cpp:1736> [UID = 2]: build engine file failed
0:00:13.744225280 215 0x2d45780 ERROR nvinfer gstnvinfer.cpp:613:gst_nvinfer_logger: NvDsInferContext[UID 2]: Error in NvDsInferContextImpl::generateBackendContext() <nvdsinfer_context_impl.cpp:1822> [UID = 2]: build backend context failed
0:00:13.744238545 215 0x2d45780 ERROR nvinfer gstnvinfer.cpp:613:gst_nvinfer_logger: NvDsInferContext[UID 2]: Error in NvDsInferContextImpl::initialize() <nvdsinfer_context_impl.cpp:1149> [UID = 2]: generate backend failed, check config file settings
0:00:13.744286735 215 0x2d45780 WARN nvinfer gstnvinfer.cpp:812:gst_nvinfer_start: error: Failed to create NvDsInferContext instance
0:00:13.744293087 215 0x2d45780 WARN nvinfer gstnvinfer.cpp:812:gst_nvinfer_start: error: Config file path: dstest2_sgie1_config_gender.txt, NvDsInfer Error: NVDSINFER_CONFIG_FAILED
Error: gst-resource-error-quark: Failed to create NvDsInferContext instance (1): gstnvinfer.cpp(812): gst_nvinfer_start (): /GstPipeline:pipeline0/GstNvInfer:secondary1-nvinference-engine:
Config file path: dstest2_sgie1_config_gender.txt, NvDsInfer Error: NVDSINFER_CONFIG_FAILED

There is no update from you for a period, assuming this is not an issue any more.
Hence we are closing this topic. If need further support, please open a new one.
Thanks

Please provide complete information as applicable to your setup.

• Hardware Platform (Jetson / GPU)
• DeepStream Version
• JetPack Version (valid for Jetson only)
• TensorRT Version
• NVIDIA GPU Driver Version (valid for GPU only)
• Issue Type( questions, new requirements, bugs)
• How to reproduce the issue ? (This is for bugs. Including which sample app is using, the configuration files content, the command line used and other details for reproducing)
• Requirement details( This is for new requirement. Including the module name-for which plugin or for which sample application, the function description)