Help on Monte Carlo Example (SDK) I'm getting several linker errors trying to rebuild the exampl

Hello guys!
I´m new in the GPU programming, and for learning purposes, I’m trying to rebuild a exemple from Nvidia called Monte Carlo Option Pricing. (This example is in the Nvidia GPU computing SDK Browser)
I created a project in VS 2008 Express Edition (Win XP 32) utilizing the CUDA_VS_Wizard_W32.2.2.Beta1 rule, added the headers and lib directories, and inserted the cpp file in the project.
But, when I try to build the project, I get several linker errors:

1>------ Build started: Project: CUDAWinApp2, Configuration: Debug Win32 ------
1>Linking…
1>MonteCarlo.obj : warning LNK4075: ignoring ‘/EDITANDCONTINUE’ due to ‘/INCREMENTAL:NO’ specification
1>MonteCarlo.obj : error LNK2019: unresolved external symbol _MonteCarloCPU referenced in function _main
1>MonteCarlo.obj : error LNK2019: unresolved external symbol _BlackScholesCall referenced in function _main
1>MonteCarlo.obj : error LNK2019: unresolved external symbol _closeMonteCarlo_SM10 referenced in function _main
1>MonteCarlo.obj : error LNK2019: unresolved external symbol _closeMonteCarlo_SM13 referenced in function _main
1>MonteCarlo.obj : error LNK2019: unresolved external symbol _MonteCarlo_SM10 referenced in function _main
1>MonteCarlo.obj : error LNK2019: unresolved external symbol _MonteCarlo_SM13 referenced in function _main
1>MonteCarlo.obj : error LNK2019: unresolved external symbol _initMonteCarlo_SM10 referenced in function _main
1>MonteCarlo.obj : error LNK2019: unresolved external symbol _initMonteCarlo_SM13 referenced in function _main
1>MonteCarlo.obj : error LNK2019: unresolved external symbol _inverseCND_SM10 referenced in function _main
1>MonteCarlo.obj : error LNK2019: unresolved external symbol _inverseCND_SM13 referenced in function _main
1>C:\Documents and Settings\User\Meus documentos\Visual Studio 2008\Projects\CUDAWinApp2\Debug\CUDAWinApp2.exe : fatal error LNK1120: 10 unresolved externals
1>Build log was saved at “file://c:\Documents and Settings\User\Meus documentos\Visual Studio 2008\Projects\CUDAWinApp2\CUDAWinApp2\Debug\BuildLog.htm”
1>CUDAWinApp2 - 11 error(s), 1 warning(s)
========== Build: 0 succeeded, 1 failed, 0 up-to-date, 0 skipped ==========

Anyone could help me solve these errors?

Thanks for your attention.

Michel.