Nsight fails to find external libraries (No such file or directory)

Hello,

We have been trying to bind OpenCV and Boost libaries to our project, we have followed the following instruction https://devtalk.nvidia.com/default/topic/1019937/faq/opencv/
resp. added the directory which includes the libraries to (Build -> Settings -> NVCC Comiler & NVCC Linker) and to (to C/C++ General -> Path and symbols)
Nevertheless we constantly get this error message: fatal error: boost/lambda/lambda.hpp: No such file or directory

C++ Sample-Code

#include <string>

#include <boost/lambda/lambda.hpp>
#include <iostream>
#include <iterator>
#include <algorithm>

int main()
{
    using namespace boost::lambda;
    typedef std::istream_iterator<int> in;

    std::for_each(
        in(std::cin), in(), std::cout << (_1 * 3) << " " );
    //printf("/usr/include/");
}

Error

sudo make -j all 
[  1%] Building CXX object 3rdparty/src/lodepng/CMakeFiles/lodepng-src.dir/src/lodepng.cpp.o
[  2%] Dependencies for /usr/local/driveworks-1.2/samples-lane/build-target/src/stereo/stereo_common/CMakeFiles/dw_samples_stereo_common.dir//gen_utils.cu.o.depend.stamp
[  3%] Dependencies for /usr/local/driveworks-1.2/samples-lane/build-target/src/image/image_common/CMakeFiles/dw_samples_image_common.dir//gen_utils.cu.o.depend.stamp
[  4%] Building C object 3rdparty/src/glfw/3.2-screen/src/CMakeFiles/glfw.dir/input.c.o
[  5%] Building C object 3rdparty/src/glfw/3.2-screen/src/CMakeFiles/glfw.dir/window.c.o
[  6%] Building C object 3rdparty/src/glfw/3.2-screen/src/CMakeFiles/glfw.dir/x11_init.c.o
[  7%] Building C object 3rdparty/src/glfw/3.2-screen/src/CMakeFiles/glfw.dir/x11_window.c.o
[  7%] Building C object 3rdparty/src/glfw/3.2-screen/src/CMakeFiles/glfw.dir/init.c.o
[  8%] Building C object 3rdparty/src/glfw/3.2-screen/src/CMakeFiles/glfw.dir/monitor.c.o
[  8%] Building C object 3rdparty/src/glfw/3.2-screen/src/CMakeFiles/glfw.dir/linux_joystick.c.o
[  8%] Building C object 3rdparty/src/glfw/3.2-screen/src/CMakeFiles/glfw.dir/vulkan.c.o
[  9%] Building C object 3rdparty/src/glfw/3.2-screen/src/CMakeFiles/glfw.dir/xkb_unicode.c.o
[ 10%] Building C object 3rdparty/src/glfw/3.2-screen/src/CMakeFiles/glfw.dir/context.c.o
[ 11%] Building C object 3rdparty/src/glfw/3.2-screen/src/CMakeFiles/glfw.dir/egl_context.c.o
[ 10%] Building C object 3rdparty/src/glfw/3.2-screen/src/CMakeFiles/glfw.dir/posix_tls.c.o
[ 12%] Building C object 3rdparty/src/glfw/3.2-screen/src/CMakeFiles/glfw.dir/glx_context.c.o
[ 13%] Building C object 3rdparty/src/glfw/3.2-screen/src/CMakeFiles/glfw.dir/posix_time.c.o
[ 13%] Building C object 3rdparty/src/glfw/3.2-screen/src/CMakeFiles/glfw.dir/x11_monitor.c.o
[ 13%] Linking C static library libglfw3.a
[ 13%] Built target glfw
[ 13%] Built target update_cuda_deps
[ 14%] Linking CXX static library liblodepng-src.a
[ 14%] Built target lodepng-src
[ 14%] Building CXX object src/framework/CMakeFiles/dw_samples_framework.dir/SampleFramework.cpp.o
[ 15%] Building CXX object src/framework/CMakeFiles/dw_samples_framework.dir/Window.cpp.o
[ 15%] Building CXX object src/framework/CMakeFiles/dw_samples_framework.dir/ProgramArguments.cpp.o
[ 16%] Building CXX object src/framework/CMakeFiles/dw_samples_framework.dir/DriveWorksSample.cpp.o
[ 17%] Building CXX object src/framework/CMakeFiles/dw_samples_framework.dir/Grid.cpp.o
[ 17%] Building CXX object src/framework/CMakeFiles/dw_samples_framework.dir/WindowGLFW.cpp.o
[ 18%] Building CXX object src/framework/CMakeFiles/dw_samples_framework.dir/MathUtils.cpp.o
[ 19%] Building CXX object src/framework/CMakeFiles/dw_samples_framework.dir/MouseView3D.cpp.o
[ 20%] Building CXX object src/framework/CMakeFiles/dw_samples_framework.dir/ProfilerCUDA.cpp.o
[ 20%] Building CXX object src/framework/CMakeFiles/dw_samples_framework.dir/SimpleRenderer.cpp.o
[ 21%] Building CXX object src/framework/CMakeFiles/dw_samples_framework.dir/SimpleCamera.cpp.o
[ 21%] Building CXX object src/framework/CMakeFiles/dw_samples_framework.dir/WindowLinuxEGL.cpp.o
[ 21%] Building CXX object src/framework/CMakeFiles/dw_samples_framework.dir/Log.cpp.o
[ 21%] Building CXX object src/framework/CMakeFiles/dw_samples_framework.dir/ScreenshotHelper.cpp.o
[ 22%] Building CXX object src/framework/CMakeFiles/dw_samples_framework.dir/RenderUtils.cpp.o
[ 23%] Building CXX object src/framework/CMakeFiles/dw_samples_framework.dir/WindowEGL.cpp.o
[ 24%] Building CXX object src/framework/CMakeFiles/dw_samples_framework.dir/SimpleRecordingPlayer.cpp.o
[ 25%] Linking CXX static library libdw_samples_framework.a
[ 25%] Built target dw_samples_framework
[ 26%] Building CXX object src/sensors/info/CMakeFiles/sample_sensors_info.dir/main.cpp.o
[ 28%] Building CXX object src/sensors/imu/CMakeFiles/sample_imu_logger.dir/main.cpp.o
[ 28%] Building NVCC (Device) object src/image/image_common/CMakeFiles/dw_samples_image_common.dir/gen_utils.cu.o
[ 28%] Building NVCC (Device) object src/stereo/stereo_common/CMakeFiles/dw_samples_stereo_common.dir/gen_utils.cu.o
[ 28%] Building CXX object src/sensors/canbus/interpreter/CMakeFiles/sample_canbus_interpreter.dir/interpreter.cpp.o
[ 29%] Building CXX object src/sensors/camera_gmsl_raw/CMakeFiles/sample_camera_gmsl_raw.dir/main.cpp.o
[ 30%] Building CXX object src/sensors/canbus/interpreter/CMakeFiles/sample_canbus_interpreter.dir/main.cpp.o
[ 30%] Building CXX object src/sensors/canbus/logger/CMakeFiles/sample_canbus_logger.dir/main.cpp.o
[ 31%] Building CXX object src/colorcorrection/CMakeFiles/sample_color_correction.dir/main.cpp.o
[ 32%] Building CXX object src/sensors/radar/radar_replay/CMakeFiles/sample_radar_replay.dir/main.cpp.o
[ 33%] Building CXX object src/hello_world/CMakeFiles/sample_hello_world.dir/main.cpp.o
[ 34%] Building CXX object src/rigconfiguration/CMakeFiles/sample_rig_configuration.dir/main.cpp.o
[ 35%] Building CXX object src/laneDetection/CMakeFiles/sample_lane_detection.dir/main.cpp.o
[ 35%] Building CXX object src/sensors/camera_gmsl/CMakeFiles/sample_camera_gmsl.dir/main.cpp.o
[ 35%] Building CXX object src/sensors/lidar/lidar_replay/CMakeFiles/sample_lidar_replay.dir/main.cpp.o
[ 35%] Building CXX object src/drivenet/drivenet/CMakeFiles/sample_drivenet.dir/main.cpp.o
[ 35%] Building CXX object src/sensors/gps/CMakeFiles/sample_gps_logger.dir/main.cpp.o
[ 36%] Building CXX object src/sensors/lidar/lidar_replay/CMakeFiles/sample_lidar_replay.dir/userInput.cpp.o
[ 37%] Building CXX object src/sensors/record/CMakeFiles/sample_record.dir/main.cpp.o
[ 37%] Building CXX object src/renderer/CMakeFiles/sample_renderer.dir/main.cpp.o
[ 37%] Building CXX object src/vehicleio/CMakeFiles/sample_vehicleio.dir/main.cpp.o
[ 38%] Building CXX object src/freespace/CMakeFiles/sample_freespace_detection.dir/main.cpp.o
[ 39%] Building CXX object src/egomotion/CMakeFiles/sample_egomotion.dir/main.cpp.o
[ 40%] Building CXX object src/icp/CMakeFiles/sample_icp.dir/main.cpp.o
[ 41%] Building CXX object src/ipc/CMakeFiles/sample_ipc_socketclientserver.dir/sample_ipc_socketclientserver.cpp.o
[ 41%] Building CXX object src/mapping/occupancy_grid/CMakeFiles/sample_occupancy_grid.dir/main.cpp.o
[ 42%] Building CXX object src/calibration/camera/CMakeFiles/sample_calibration_camera.dir/main.cpp.o
[ 43%] Building CXX object src/dnn/sample_object_tracker/CMakeFiles/sample_object_tracker.dir/main.cpp.o
[ 44%] Building CXX object src/sensors/camera_multiple_gmsl/CMakeFiles/sample_camera_multiple_gmsl.dir/main.cpp.o
[ 45%] Building CXX object src/dataspeedBridge/CMakeFiles/sample_dataspeedBridge.dir/main.cpp.o
[ 46%] Building CXX object src/features/camera_tracker/CMakeFiles/sample_camera_tracker.dir/main.cpp.o
[ 46%] Building CXX object src/sensors/camera_replay/CMakeFiles/sample_camera_replay.dir/main.cpp.o
[ 46%] Building CXX object src/sensors/camera_usb/CMakeFiles/sample_camera_usb.dir/main.cpp.o
[ 47%] Building CXX object src/lidar_accumulator/CMakeFiles/sample_lidar_accumulator.dir/main.cpp.o
[ 48%] Building CXX object src/sensors/camera_seek/CMakeFiles/sample_camera_seek.dir/main.cpp.o
[ 50%] Building CXX object src/drivenet/drivenet_ncameras/CMakeFiles/sample_drivenetNcameras.dir/main.cpp.o
[ 50%] Building CXX object src/rectifier/CMakeFiles/sample_video_rectifier.dir/main.cpp.o
[ 51%] Building CXX object src/render_engine/CMakeFiles/sample_render_engine.dir/main.cpp.o
[ 51%] Building CXX object src/sfm/CMakeFiles/sample_sfm.dir/main.cpp.o
[ 51%] Building CXX object src/maps/maptracker/CMakeFiles/sample_maptracker.dir/__/common/DrivePath.cpp.o
[ 52%] Building CXX object src/calibration/lidar/CMakeFiles/sample_calibration_lidar.dir/main.cpp.o
[ 53%] Building CXX object src/maps/maptracker/CMakeFiles/sample_maptracker.dir/MapTrackerApp.cpp.o
[ 54%] Building CXX object src/calibration/imu/CMakeFiles/sample_calibration_imu.dir/main.cpp.o
[ 55%] Building CXX object src/maps/maptracker/CMakeFiles/sample_maptracker.dir/__/common/MapsAppCommon.cpp.o
[ 55%] Building CXX object src/maps/maptracker/CMakeFiles/sample_maptracker.dir/main.cpp.o
[ 56%] Building CXX object src/maps/maptracker/CMakeFiles/sample_maptracker.dir/__/common/LanePlannerAppCommon.cpp.o
[ 57%] Building CXX object src/template/CMakeFiles/sample_template.dir/main.cpp.o
[ 58%] Building CXX object src/dnn/sample_object_detector/CMakeFiles/sample_object_detector.dir/main.cpp.o
[ 58%] Building CXX object src/cameraBlindness/CMakeFiles/sample_blindness_detection.dir/main.cpp.o
[ 58%] Building CXX object src/features/camera_scaling_tracker/CMakeFiles/sample_camera_scaling_tracker.dir/main.cpp.o
[ 59%] Building CXX object src/maps/mapaccess/CMakeFiles/sample_mapaccess.dir/__/common/MapsAppCommon.cpp.o
[ 60%] Building CXX object src/maps/mapaccess/CMakeFiles/sample_mapaccess.dir/MapsApp.cpp.o
[ 61%] Building CXX object src/maps/mapaccess/CMakeFiles/sample_mapaccess.dir/main.cpp.o
[ 62%] Building CXX object src/maps/laneplanner/CMakeFiles/sample_laneplanner.dir/__/common/LanePlannerAppCommon.cpp.o
[ 63%] Building CXX object src/maps/laneplanner/CMakeFiles/sample_laneplanner.dir/__/common/MapsAppCommon.cpp.o
[ 63%] Building CXX object src/maps/laneplanner/CMakeFiles/sample_laneplanner.dir/__/common/DrivePath.cpp.o
[ 63%] Building CXX object src/maps/mapaccess/CMakeFiles/sample_mapaccess.dir/__/common/DrivePath.cpp.o
[ 64%] Building CXX object src/maps/laneplanner/CMakeFiles/sample_laneplanner.dir/LanePlannerApp.cpp.o
[ 65%] Building CXX object src/maps/mapaccess/CMakeFiles/sample_mapaccess.dir/__/common/LanePlannerAppCommon.cpp.o
[ 66%] Building CXX object src/maps/laneplanner/CMakeFiles/sample_laneplanner.dir/main.cpp.o
/usr/local/driveworks-1.2/samples-lane/src/hello_world/main.cpp:52:35: fatal error: boost/lambda/lambda.hpp: No such file or directory
 #include <boost/lambda/lambda.hpp>
                                   ^
src/hello_world/CMakeFiles/sample_hello_world.dir/build.make:62: recipe for target 'src/hello_world/CMakeFiles/sample_hello_world.dir/main.cpp.o' failed
CMakeFiles/Makefile2:2071: recipe for target 'src/hello_world/CMakeFiles/sample_hello_world.dir/all' failed
compilation terminated.
make[2]: *** [src/hello_world/CMakeFiles/sample_hello_world.dir/main.cpp.o] Error 1
make[1]: *** [src/hello_world/CMakeFiles/sample_hello_world.dir/all] Error 2
make[1]: *** Waiting for unfinished jobs....
/usr/local/driveworks-1.2/samples-lane/src/calibration/camera/main.cpp:60:35: fatal error: boost/lambda/lambda.hpp: No such file or directory
 #include <boost/lambda/lambda.hpp>
                                   ^
compilation terminated.
make[2]: *** [src/calibration/camera/CMakeFiles/sample_calibration_camera.dir/main.cpp.o] Error 1
make[1]: *** [src/calibration/camera/CMakeFiles/sample_calibration_camera.dir/all] Error 2
src/calibration/camera/CMakeFiles/sample_calibration_camera.dir/build.make:62: recipe for target 'src/calibration/camera/CMakeFiles/sample_calibration_camera.dir/main.cpp.o' failed
CMakeFiles/Makefile2:3283: recipe for target 'src/calibration/camera/CMakeFiles/sample_calibration_camera.dir/all' failed
[ 66%] Linking CXX executable sample_rig_configuration
[ 66%] Built target sample_rig_configuration
[ 67%] Linking CXX executable sample_renderer
[ 68%] Linking CXX executable sample_imu_logger
[ 69%] Linking CXX executable sample_sensors_info
[ 70%] Linking CXX executable sample_gps_logger
[ 71%] Linking CXX executable sample_vehicleio
[ 72%] Linking CXX executable sample_canbus_logger
[ 72%] Linking CXX executable sample_ipc_socketclientserver
[ 73%] Linking CXX executable sample_canbus_interpreter
[ 73%] Built target sample_renderer
[ 73%] Built target sample_imu_logger
[ 73%] Built target sample_sensors_info
[ 73%] Linking CXX executable sample_lidar_replay
[ 73%] Built target sample_vehicleio
[ 74%] Linking CXX executable sample_occupancy_grid
[ 74%] Built target sample_ipc_socketclientserver
[ 74%] Built target sample_canbus_logger
[ 74%] Built target sample_canbus_interpreter
[ 74%] Built target sample_gps_logger
[ 74%] Linking CXX executable sample_record
[ 74%] Built target sample_lidar_replay
[ 75%] Linking CXX executable sample_dataspeedBridge
[ 75%] Built target sample_occupancy_grid
[ 75%] Built target sample_record
[ 75%] Built target sample_dataspeedBridge
[ 76%] Linking CXX executable sample_template
[ 76%] Linking CXX static library libdw_samples_image_common.a
[ 76%] Linking CXX executable sample_camera_seek
[ 76%] Linking CXX executable sample_radar_replay
[ 76%] Built target dw_samples_image_common
[ 77%] Linking CXX executable sample_camera_replay
[ 78%] Linking CXX executable sample_camera_multiple_gmsl
[ 79%] Linking CXX executable sample_camera_usb
[ 79%] Linking CXX executable sample_video_rectifier
[ 79%] Linking CXX executable sample_camera_gmsl_raw
[ 79%] Linking CXX executable sample_color_correction
[ 79%] Built target sample_template
[ 79%] Built target sample_camera_seek
[ 80%] Building CXX object src/stereo/stereo_common/CMakeFiles/dw_samples_stereo_common.dir/stereoCommon.cpp.o
[ 81%] Linking CXX executable sample_maptracker
[ 81%] Built target sample_radar_replay
[ 82%] Linking CXX executable sample_camera_scaling_tracker
[ 82%] Built target sample_color_correction
[ 82%] Built target sample_camera_gmsl_raw
[ 82%] Built target sample_camera_multiple_gmsl
[ 83%] Linking CXX executable sample_icp
[ 83%] Built target sample_camera_replay
[ 83%] Built target sample_video_rectifier
[ 83%] Built target sample_camera_usb
[ 84%] Linking CXX executable sample_camera_gmsl
[ 85%] Linking CXX executable sample_freespace_detection
[ 85%] Linking CXX executable sample_object_detector
[ 86%] Linking CXX executable sample_render_engine
[ 86%] Linking CXX executable sample_laneplanner
[ 87%] Linking CXX executable sample_lidar_accumulator
[ 88%] Linking CXX executable sample_blindness_detection
[ 88%] Built target sample_camera_scaling_tracker
[ 88%] Built target sample_maptracker
[ 89%] Linking CXX executable sample_camera_tracker
[ 89%] Linking CXX executable sample_mapaccess
[ 89%] Linking CXX executable sample_calibration_imu
[ 89%] Linking CXX executable sample_lane_detection
[ 89%] Built target sample_camera_gmsl
[ 89%] Built target sample_icp
[ 90%] Linking CXX executable sample_drivenet
[ 90%] Built target sample_freespace_detection
[ 91%] Linking CXX executable sample_calibration_lidar
[ 91%] Built target sample_render_engine
[ 91%] Built target sample_object_detector
[ 91%] Built target sample_camera_tracker
[ 91%] Built target sample_blindness_detection
[ 91%] Built target sample_lidar_accumulator
[ 91%] Built target sample_laneplanner
[ 92%] Linking CXX executable sample_sfm
[ 93%] Linking CXX executable sample_object_tracker
[ 93%] Built target sample_mapaccess
[ 93%] Built target sample_calibration_imu
[ 93%] Linking CXX executable sample_egomotion
[ 93%] Built target sample_calibration_lidar
[ 93%] Built target sample_drivenet
[ 93%] Built target sample_lane_detection
[ 93%] Built target sample_sfm
[ 93%] Built target sample_object_tracker
[ 93%] Built target sample_egomotion
[ 93%] Linking CXX static library libdw_samples_stereo_common.a
[ 93%] Linking CXX executable sample_drivenetNcameras
[ 93%] Built target dw_samples_stereo_common
[ 93%] Built target sample_drivenetNcameras
make: *** [all] Error 2
Makefile:127: recipe for target 'all' failed

Do you know what could be the problem here?

Thank you