SDK make error

make[1]: Entering directory `/home/enpeda/NVIDIA_CUDA_SDK/projects/fastWalshTransform’
/usr/include/bits/stdio2.h(35): error: identifier “__builtin_va_arg_pack” is undefined

/usr/include/bits/stdio2.h(66): error: identifier “__builtin_va_arg_pack” is undefined

/usr/include/bits/stdio2.h(99): error: identifier “__builtin_va_arg_pack” is undefined

/usr/include/bits/stdio2.h(105): error: identifier “__builtin_va_arg_pack” is undefined

/usr/include/bits/stdio2.h(159): error: identifier “__builtin_va_arg_pack” is undefined

/usr/include/bits/stdio2.h(167): error: identifier “__builtin_va_arg_pack” is undefined

/usr/include/bits/stdio2.h(174): error: identifier “__builtin_va_arg_pack” is undefined

/usr/include/bits/stdio2.h(182): error: identifier “__builtin_va_arg_pack” is undefined

8 errors detected in the compilation of “/tmp/tmpxft_00002ca2_00000000-4_fastWalshTransform.cpp1.ii”.
make[1]: *** [obj/release/fastWalshTransform.cu.o] Error 255
make[1]: Leaving directory `/home/enpeda/NVIDIA_CUDA_SDK/projects/fastWalshTransform’
make: *** [projects/fastWalshTransform/Makefile.ph_build] Error 2

somebody said that’s because of the version of gcc…ming is 4.3.2 under ubuntu 8.10…

HELP!!! THANKS!!!

You need to be using CUDA_2.2(beta or later) for this to work. Ubuntu-8.10 is not supported in releases prior to CUDA_2.2.