SDKMANAGER showing error on 'Jetson OS image' when installing Jetpack 4.2

Hello everyone,

As mentioned in topic, I try to install the Jetpack 4.2 in SDKMANAGER but it keep showing me error on ‘Jetson OS image’ (in ‘File System and OS’).

In the beginning I thought maybe it’s because I don’t have enough space In my hard disk so now I install it in external hard disk with enough space.

Any ideas?

Thanks,

Edan

Hello,

P.S

Another thing; when I run this command: “sudo ./flash.sh jetson-tx2 mmcblk0p1” from folder “Linux_for_Tegra” I get the below:

sudo ./flash.sh jetson-tx2 mmcblk0p1
[sudo] password for microgic:
###############################################################################

L4T BSP Information:

Unknown Release

###############################################################################

Target Board Information:

Name: jetson-tx2, Board Family: t186ref, SoC: Tegra 186,

OpMode: production, Boot Authentication: NS,

###############################################################################
./tegraflash.py --chip 0x18 --applet “/media/microgic/00D37E01055ABB6F/Nvidia New/Jetpack4.2/SDKManager Installtion/JetPack_4.2_Linux_P3310/Linux_for_Tegra/bootloader/mb1_recovery_prod.bin” --skipuid --cmd “dump eeprom boardinfo cvm.bin”
Welcome to Tegra Flash
version 1.0.0
Type ? or help for help and q or quit to exit
Use ! to execute system commands

[ 0.0136 ] Generating RCM messages
[ 0.0154 ] tegrarcm_v2 --listrcm rcm_list.xml --chip 0x18 0 --download rcm /media/microgic/00D37E01055ABB6F/Nvidia New/Jetpack4.2/SDKManager Installtion/JetPack_4.2_Linux_P3310/Linux_for_Tegra/bootloader/mb1_recovery_prod.bin 0 0
[ 0.0163 ] RCM 0 is saved as rcm_0.rcm
[ 0.0372 ] RCM 1 is saved as rcm_1.rcm
[ 0.0377 ] List of rcm files are saved in rcm_list.xml
[ 0.0379 ]
[ 0.0379 ] Signing RCM messages
[ 0.0735 ] tegrasign_v2 --key None --list rcm_list.xml --pubkeyhash pub_key.key
[ 0.0836 ] Assuming zero filled SBK key
[ 0.0949 ]
[ 0.0950 ] Copying signature to RCM mesages
[ 0.0961 ] tegrarcm_v2 --chip 0x18 0 --updatesig rcm_list_signed.xml
[ 0.0983 ]
[ 0.0984 ] Boot Rom communication
[ 0.0993 ] tegrarcm_v2 --chip 0x18 0 --rcm rcm_list_signed.xml --skipuid
[ 0.1002 ] RCM version 0X180001
[ 0.1012 ] Boot Rom communication completed
[ 1.1079 ]
[ 2.1134 ] tegrarcm_v2 --isapplet
[ 2.1166 ] Applet version 01.00.0000
[ 2.1192 ]
[ 2.1207 ] Retrieving EEPROM data
[ 2.1209 ] tegrarcm_v2 --oem platformdetails eeprom cvm /media/microgic/00D37E01055ABB6F/Nvidia New/Jetpack4.2/SDKManager Installtion/JetPack_4.2_Linux_P3310/Linux_for_Tegra/bootloader/cvm.bin
[ 2.1221 ] Applet version 01.00.0000
[ 2.1246 ] Saved platform info in /media/microgic/00D37E01055ABB6F/Nvidia New/Jetpack4.2/SDKManager Installtion/JetPack_4.2_Linux_P3310/Linux_for_Tegra/bootloader/cvm.bin
[ 2.1993 ]
Board ID(3310) version(D01) sku(1000) revision(B.0)
./flash.sh: line 373: New/Jetpack4.2/SDKManager: No such file or directory
./flash.sh: line 373: New/Jetpack4.2/SDKManager: No such file or directory
./flash.sh: line 373: New/Jetpack4.2/SDKManager: No such file or directory
./flash.sh: line 327: New/Jetpack4.2/SDKManager: No such file or directory
./flash.sh: line 373: New/Jetpack4.2/SDKManager: No such file or directory
./flash.sh: line 327: New/Jetpack4.2/SDKManager: No such file or directory
./flash.sh: line 327: New/Jetpack4.2/SDKManager: No such file or directory
./flash.sh: line 327: New/Jetpack4.2/SDKManager: No such file or directory
./flash.sh: line 327: New/Jetpack4.2/SDKManager: No such file or directory
./flash.sh: line 359: New/Jetpack4.2/SDKManager: No such file or directory
./flash.sh: line 359: New/Jetpack4.2/SDKManager: No such file or directory
./flash.sh: line 359: New/Jetpack4.2/SDKManager: No such file or directory
./flash.sh: line 359: New/Jetpack4.2/SDKManager: No such file or directory
./flash.sh: line 359: New/Jetpack4.2/SDKManager: No such file or directory
./flash.sh: line 359: New/Jetpack4.2/SDKManager: No such file or directory
./flash.sh: line 359: New/Jetpack4.2/SDKManager: No such file or directory
./flash.sh: line 359: New/Jetpack4.2/SDKManager: No such file or directory
./flash.sh: line 350: New/Jetpack4.2/SDKManager: No such file or directory
./flash.sh: line 359: New/Jetpack4.2/SDKManager: No such file or directory
./flash.sh: line 359: New/Jetpack4.2/SDKManager: No such file or directory
./flash.sh: line 359: New/Jetpack4.2/SDKManager: No such file or directory
./flash.sh: line 359: New/Jetpack4.2/SDKManager: No such file or directory
./flash.sh: line 350: New/Jetpack4.2/SDKManager: No such file or directory
./flash.sh: line 350: New/Jetpack4.2/SDKManager: No such file or directory
./flash.sh: line 350: New/Jetpack4.2/SDKManager: No such file or directory
./flash.sh: line 350: New/Jetpack4.2/SDKManager: No such file or directory
./flash.sh: line 347: New/Jetpack4.2/SDKManager: No such file or directory
./flash.sh: line 347: New/Jetpack4.2/SDKManager: No such file or directory
./flash.sh: line 347: New/Jetpack4.2/SDKManager: No such file or directory
./flash.sh: line 347: New/Jetpack4.2/SDKManager: No such file or directory
./flash.sh: line 347: New/Jetpack4.2/SDKManager: No such file or directory
./flash.sh: line 347: New/Jetpack4.2/SDKManager: No such file or directory
./flash.sh: line 347: New/Jetpack4.2/SDKManager: No such file or directory
./flash.sh: line 347: New/Jetpack4.2/SDKManager: No such file or directory
./flash.sh: line 347: New/Jetpack4.2/SDKManager: No such file or directory
./flash.sh: line 347: New/Jetpack4.2/SDKManager: No such file or directory
./flash.sh: line 347: New/Jetpack4.2/SDKManager: No such file or directory
./flash.sh: line 347: New/Jetpack4.2/SDKManager: No such file or directory
./flash.sh: line 347: New/Jetpack4.2/SDKManager: No such file or directory
./flash.sh: line 347: New/Jetpack4.2/SDKManager: No such file or directory
./flash.sh: line 359: New/Jetpack4.2/SDKManager: No such file or directory
./flash.sh: line 350: New/Jetpack4.2/SDKManager: No such file or directory
./flash.sh: line 347: New/Jetpack4.2/SDKManager: No such file or directory
./flash.sh: line 456: [: too many arguments
copying bootloader(bootloader/nvtboot_cpu.bin)… cp: target ‘Installtion/JetPack_4.2_Linux_P3310/Linux_for_Tegra/bootloader/nvtboot_cpu.bin’ is not a directory
failed.

Hi zadok.itai,

Looks your image doesn’t download success.
Please try remove below folder and run sdkmanager to download again.

sudo rm -R /home/<username>/nvidia/nvidia_sdk/JetPack_4.2_Linux_P3310/

Hello Carolyuu,

For some reason I can’t install the ‘Jetson OS’ (TARGET COMPONENTS), this us what it shows me:

2019-09-16 12:10:26.506 - info: 85d4b821a2c1b7eb640e4728d978b89d /media/microgic/22B7632E7AAC4DD8/TX2/Jetson_OS/Tegra_Linux_Sample-Root-Filesystem_R32.1.0_aarch64.tbz2

2019-09-16 12:10:26.506 - info: download /media/microgic/22B7632E7AAC4DD8/TX2/Jetson_OS/Tegra_Linux_Sample-Root-Filesystem_R32.1.0_aarch64.tbz2 successfully, checksum is correct
2019-09-16 12:10:26.509 - info: download ‘File System and OS’ success
2019-09-16 12:10:26.510 - info: Download for all files is complete
2019-09-16 12:10:26.544 - info: memInfo [total: 7.68GB, free: 123.4MB, available: 5.27GB]
2019-09-16 12:10:26.545 - info: Start to install ‘File System and OS’
2019-09-16 12:10:26.548 - info: estimated install timeout for NV_L4T_FILE_SYSTEM_AND_OS_TX2_COMP: 608s
2019-09-16 12:10:26.561 - info: [INPUT] “unset PS1 && unset PROMPT_COMMAND && stty -echo && export LC_ALL=en_US.UTF-8 LANG=en_US.UTF-8 LANGUAGE=en_US.UTF-8 SUDO_PROMPT=’[host] [sudo] password for %u: ’ && unalias sudo || true && echo SDKM_END_CODE_SUCCESS_2ebd35f0-3100-4e6d-9daf-5b97ac25ce6e || echo SDKM_END_CODE_FAILURE_2ebd35f0-3100-4e6d-9daf-5b97ac25ce6e_?\r" 2019-09-16 12:10:26.620 - info: [INPUT] "cd '/media/microgic/22B7632E7AAC4DD8/TX2/JetPack_4.2_Linux_P3310' ; '/opt/nvidia/sdkmanager/resources/app/output/installUtils/adapter' -a='install' -c='eyJpZCI6Ik5WX0w0VF9GSUxFX1NZU1RFTV9BTkRfT1NfVFgyX0NPTVAiLCJuYW1lIjoiRmlsZSBTeXN0ZW0gYW5kIE9TIiwiZGVzY3JpcHRpb24iOiJGaWxlIFN5c3RlbSIsImNvbXBUeXBlIjoidGFyZ2V0X2ltYWdlIiwiaXNWaXNpYmxlIjp0cnVlLCJsaWNlbnNlSWQiOiJOVl9KRVRQQUNLX09TX0VVTEEiLCJpc0RldGVjdGFibGVJbnN0YWxsIjpmYWxzZSwiaXNJbnN0YWxsUGF0aEN1c3RvbWl6YWJsZSI6dHJ1ZSwidmVyc2lvbiI6IjMyLjEiLCJvcGVyYXRpbmdTeXN0ZW1zIjpbInVidW50dTE2MDQiLCJ1YnVudHUxODA0Il0sImluc3RhbGxTaXplTUIiOjMyODQsImRvd25sb2FkRmlsZXMiOlt7InVybCI6IlAzMzEwL1RlZ3JhX0xpbnV4X1NhbXBsZS1Sb290LUZpbGVzeXN0ZW1fUjMyLjEuMF9hYXJjaDY0LnRiejIiLCJmaWxlTmFtZSI6IlRlZ3JhX0xpbnV4X1NhbXBsZS1Sb290LUZpbGVzeXN0ZW1fUjMyLjEuMF9hYXJjaDY0LnRiejIiLCJzaXplIjoxMjIxMDYzNDAwLCJjaGVja3N1bSI6Ijg1ZDRiODIxYTJjMWI3ZWI2NDBlNDcyOGQ5NzhiODlkIiwiY2hlY2tzdW1UeXBlIjoibWQ1IiwiaW5zdGFsbFBhcmFtZXRlcnMiOnsiaW5zdGFsbFR5cGUiOiJjbWQiLCJhZGRpdGlvbmFsUGFyYW1ldGVycyI6eyJpbnN0YWxsRGlyIjoie3tUQVJHRVRfUk9PVH19L3t7QlVORExFX1RJVExFfX1fe3tCT0FSRF9JRH19L0xpbnV4X2Zvcl9UZWdyYS9yb290ZnMvIiwiaW5zdGFsbENvbW1hbmRzIjpbeyJleGVjQmFzaCI6WyJzdWRvIHRhciB4cGYge3tGSUxFX1BBVEh9fSIsImNkIC4uIiwic3VkbyAuL2FwcGx5X2JpbmFyaWVzLnNoIiwic3VkbyBta2RpciAtcCByb290ZnMvb3B0L252aWRpYS9kZWJfcmVwb3MiXX1dfX0sImNhY2hlZFVybCI6Imh0dHBzOi8vZGV2ZWxvcGVyLm52aWRpYS5jb20vYXNzZXRzL2VtYmVkZGVkL3NlY3VyZS90b29scy9maWxlcy9qZXRwYWNrLXNka3MvamV0cGFjay00LjIvSkVUUEFDS180Ml9iMTU4L1AzMzEwL1RlZ3JhX0xpbnV4X1NhbXBsZS1Sb290LUZpbGVzeXN0ZW1fUjMyLjEuMF9hYXJjaDY0LnRiejIiLCJjdXJyZW50RG93bmxvYWRlZFVybCI6Imh0dHBzOi8vZGV2ZWxvcGVyLm52aWRpYS5jb20vYXNzZXRzL2VtYmVkZGVkL3NlY3VyZS90b29scy9maWxlcy9qZXRwYWNrLXNka3MvamV0cGFjay00LjIvSkVUUEFDS180Ml9iMTU4L1AzMzEwL1RlZ3JhX0xpbnV4X1NhbXBsZS1Sb290LUZpbGVzeXN0ZW1fUjMyLjEuMF9hYXJjaDY0LnRiejIifV0sInRhcmdldElkcyI6WyJQMzMxMCIsIlAzNDg5LTAwMDAiXSwiZGVwZW5kZW5jaWVzIjpbeyJpZCI6Ik5WX0w0VF9EUklWRVJTX1RYMl9DT01QIiwib3BlcmF0b3IiOiI9PSIsInZlciI6IjMyLjEiLCJfaWQiOiJOVl9MNFRfRFJJVkVSU19UWDJfQ09NUEBQMzMxMCJ9XSwiZXh0ZXJuYWxfZGVwZW5kZW5jaWVzIjpbXSwidGFyZ2V0SUQiOiJQMzMxMCIsIl9pZCI6Ik5WX0w0VF9GSUxFX1NZU1RFTV9BTkRfT1NfVFgyX0NPTVBAUDMzMTAiLCJwYXJlbnRJRCI6Ik5WX0pFVFBBQ0tfTDRUX0lNQUdFX1NFVFVQX1RBUkdFVF9HUk9VUCIsIl9wYXJlbnRJRCI6Ik5WX0pFVFBBQ0tfTDRUX0lNQUdFX1NFVFVQX1RBUkdFVF9HUk9VUEBQMzMxMCIsImluc3RhbGxTdGF0dXMiOiJub25lIiwiYWN0aW9uIjoxLCJkb3dubG9hZEVycm9ycyI6W10sImV4ZWMiOiIvbWVkaWEvbWljcm9naWMvMjJCNzYzMkU3QUFDNEREOC9UWDIvSmV0c29uX09TL1RlZ3JhX0xpbnV4X1NhbXBsZS1Sb290LUZpbGVzeXN0ZW1fUjMyLjEuMF9hYXJjaDY0LnRiejIiLCJidW5kbGVUaXRsZSI6IkpldFBhY2tfNC4yX0xpbnV4IiwiaW5zdGFsbFBhdGgiOiIvbWVkaWEvbWljcm9naWMvMjJCNzYzMkU3QUFDNEREOC9UWDIvSmV0UGFja180LjJfTGludXhfUDMzMTAiLCJpbnN0YWxsUm9vdCI6Ii9tZWRpYS9taWNyb2dpYy8yMkI3NjMyRTdBQUM0REQ4L1RYMiIsImJvYXJkSUQiOiJQMzMxMCIsInRhcmdldEFjY2Vzc0luZm8iOnsidXNlciI6IiIsInBhc3N3b3JkIjoiIiwiaG9zdCI6IjE5Mi4xNjguNTUuMSIsInBvcnQiOiIyMiJ9LCJpc0RyeVJ1biI6ZmFsc2V9' -i='NV_L4T_FILE_SYSTEM_AND_OS_TX2_COMP' -v='32.1' -l='/media/microgic/22B7632E7AAC4DD8/TX2/JetPack_4.2_Linux_P3310' -L='/home/microgic/.nvsdkm/logs/JetPack_4.2_Linux' -p='19530' -t='P3310' -e='/media/microgic/22B7632E7AAC4DD8/TX2/Jetson_OS/Tegra_Linux_Sample-Root-Filesystem_R32.1.0_aarch64.tbz2' && echo SDKM_END_CODE_SUCCESS_6fdd1fd7-3ac2-4857-a3e9-d07d330df368 || echo SDKM_END_CODE_FAILURE_6fdd1fd7-3ac2-4857-a3e9-d07d330df368_?\r”
2019-09-16 12:10:26.627 - info: [ Disk Avail:26.09 GB ]
2019-09-16 12:10:26.627 - info: Using GenericInstaller to Install NV_L4T_FILE_SYSTEM_AND_OS_TX2_COMP
2019-09-16 12:10:26.628 - info: NV_L4T_FILE_SYSTEM_AND_OS_TX2_COMP include 1 package
2019-09-16 12:10:26.628 - info: change working directory to /media/microgic/22B7632E7AAC4DD8/TX2/JetPack_4.2_Linux_P3310/Linux_for_Tegra/rootfs/
2019-09-16 12:10:26.629 - info: [ Package Install Started ]
2019-09-16 12:10:26.629 - info: current working directory is /media/microgic/22B7632E7AAC4DD8/TX2/JetPack_4.2_Linux_P3310/Linux_for_Tegra/rootfs
2019-09-16 12:10:26.629 - info: exec_command [host]:
2019-09-16 12:10:26.629 - info: **********************
2019-09-16 12:10:26.630 - info: #!/bin/bash
2019-09-16 12:10:26.630 - info: set -e
2019-09-16 12:10:26.630 - info: sudo tar xpf /media/microgic/22B7632E7AAC4DD8/TX2/Jetson_OS/Tegra_Linux_Sample-Root-Filesystem_R32.1.0_aarch64.tbz2
2019-09-16 12:10:26.630 - info: cd …
2019-09-16 12:10:26.630 - info: sudo ./apply_binaries.sh
2019-09-16 12:10:26.630 - info: sudo mkdir -p rootfs/opt/nvidia/deb_repos
2019-09-16 12:10:26.630 - info: **********************
2019-09-16 12:10:26.630 - info: exec_command: /tmp/tmp_NV_L4T_FILE_SYSTEM_AND_OS_TX2_COMP.sh
2019-09-16 12:10:26.638 - info: [host] [sudo] password for microgic:
2019-09-16 12:10:26.640 - info: [INPUT] [HOST PASSWORD]
2019-09-16 12:10:26.640 - info:
2019-09-16 12:15:50.827 - error: sudo: ./apply_binaries.sh: command not found
2019-09-16 12:15:50.829 - info: exit status 1
2019-09-16 12:15:50.829 - info: [ Package Install Finished with Error ]
2019-09-16 12:15:50.830 - info: [ 4.00 KB used. Disk Avail: 26.09 GB ]
2019-09-16 12:15:50.830 - info: [ NV_L4T_FILE_SYSTEM_AND_OS_TX2_COMP Install took 5m24s ]
2019-09-16 12:15:50.830 - error: Run commands failed at step Install: command /tmp/tmp_NV_L4T_FILE_SYSTEM_AND_OS_TX2_COMP.sh finished with error
2019-09-16 12:15:50.831 - info:
2019-09-16 12:15:50.831 - error: cmd finished failure SDKM_END_CODE_FAILURE_6fdd1fd7-3ac2-4857-a3e9-d07d330df368_11
2019-09-16 12:15:50.832 - error: command error code: 11
2019-09-16 12:15:50.832 - error: command terminated with error
2019-09-16 12:15:50.833 - error: install ‘File System and OS’ failure, command < cd ‘/media/microgic/22B7632E7AAC4DD8/TX2/JetPack_4.2_Linux_P3310’ ; ‘/opt/nvidia/sdkmanager/resources/app/output/installUtils/adapter’ -a=‘install’ -c=‘eyJpZCI6Ik5WX0w0VF9GSUxFX1NZU1RFTV9BTkRfT1NfVFgyX0NPTVAiLCJuYW1lIjoiRmlsZSBTeXN0ZW0gYW5kIE9TIiwiZGVzY3JpcHRpb24iOiJGaWxlIFN5c3RlbSIsImNvbXBUeXBlIjoidGFyZ2V0X2ltYWdlIiwiaXNWaXNpYmxlIjp0cnVlLCJsaWNlbnNlSWQiOiJOVl9KRVRQQUNLX09TX0VVTEEiLCJpc0RldGVjdGFibGVJbnN0YWxsIjpmYWxzZSwiaXNJbnN0YWxsUGF0aEN1c3RvbWl6YWJsZSI6dHJ1ZSwidmVyc2lvbiI6IjMyLjEiLCJvcGVyYXRpbmdTeXN0ZW1zIjpbInVidW50dTE2MDQiLCJ1YnVudHUxODA0Il0sImluc3RhbGxTaXplTUIiOjMyODQsImRvd25sb2FkRmlsZXMiOlt7InVybCI6IlAzMzEwL1RlZ3JhX0xpbnV4X1NhbXBsZS1Sb290LUZpbGVzeXN0ZW1fUjMyLjEuMF9hYXJjaDY0LnRiejIiLCJmaWxlTmFtZSI6IlRlZ3JhX0xpbnV4X1NhbXBsZS1Sb290LUZpbGVzeXN0ZW1fUjMyLjEuMF9hYXJjaDY0LnRiejIiLCJzaXplIjoxMjIxMDYzNDAwLCJjaGVja3N1bSI6Ijg1ZDRiODIxYTJjMWI3ZWI2NDBlNDcyOGQ5NzhiODlkIiwiY2hlY2tzdW1UeXBlIjoibWQ1IiwiaW5zdGFsbFBhcmFtZXRlcnMiOnsiaW5zdGFsbFR5cGUiOiJjbWQiLCJhZGRpdGlvbmFsUGFyYW1ldGVycyI6eyJpbnN0YWxsRGlyIjoie3tUQVJHRVRfUk9PVH19L3t7QlVORExFX1RJVExFfX1fe3tCT0FSRF9JRH19L0xpbnV4X2Zvcl9UZWdyYS9yb290ZnMvIiwiaW5zdGFsbENvbW1hbmRzIjpbeyJleGVjQmFzaCI6WyJzdWRvIHRhciB4cGYge3tGSUxFX1BBVEh9fSIsImNkIC4uIiwic3VkbyAuL2FwcGx5X2JpbmFyaWVzLnNoIiwic3VkbyBta2RpciAtcCByb290ZnMvb3B0L252aWRpYS9kZWJfcmVwb3MiXX1dfX0sImNhY2hlZFVybCI6Imh0dHBzOi8vZGV2ZWxvcGVyLm52aWRpYS5jb20vYXNzZXRzL2VtYmVkZGVkL3NlY3VyZS90b29scy9maWxlcy9qZXRwYWNrLXNka3MvamV0cGFjay00LjIvSkVUUEFDS180Ml9iMTU4L1AzMzEwL1RlZ3JhX0xpbnV4X1NhbXBsZS1Sb290LUZpbGVzeXN0ZW1fUjMyLjEuMF9hYXJjaDY0LnRiejIiLCJjdXJyZW50RG93bmxvYWRlZFVybCI6Imh0dHBzOi8vZGV2ZWxvcGVyLm52aWRpYS5jb20vYXNzZXRzL2VtYmVkZGVkL3NlY3VyZS90b29scy9maWxlcy9qZXRwYWNrLXNka3MvamV0cGFjay00LjIvSkVUUEFDS180Ml9iMTU4L1AzMzEwL1RlZ3JhX0xpbnV4X1NhbXBsZS1Sb290LUZpbGVzeXN0ZW1fUjMyLjEuMF9hYXJjaDY0LnRiejIifV0sInRhcmdldElkcyI6WyJQMzMxMCIsIlAzNDg5LTAwMDAiXSwiZGVwZW5kZW5jaWVzIjpbeyJpZCI6Ik5WX0w0VF9EUklWRVJTX1RYMl9DT01QIiwib3BlcmF0b3IiOiI9PSIsInZlciI6IjMyLjEiLCJfaWQiOiJOVl9MNFRfRFJJVkVSU19UWDJfQ09NUEBQMzMxMCJ9XSwiZXh0ZXJuYWxfZGVwZW5kZW5jaWVzIjpbXSwidGFyZ2V0SUQiOiJQMzMxMCIsIl9pZCI6Ik5WX0w0VF9GSUxFX1NZU1RFTV9BTkRfT1NfVFgyX0NPTVBAUDMzMTAiLCJwYXJlbnRJRCI6Ik5WX0pFVFBBQ0tfTDRUX0lNQUdFX1NFVFVQX1RBUkdFVF9HUk9VUCIsIl9wYXJlbnRJRCI6Ik5WX0pFVFBBQ0tfTDRUX0lNQUdFX1NFVFVQX1RBUkdFVF9HUk9VUEBQMzMxMCIsImluc3RhbGxTdGF0dXMiOiJub25lIiwiYWN0aW9uIjoxLCJkb3dubG9hZEVycm9ycyI6W10sImV4ZWMiOiIvbWVkaWEvbWljcm9naWMvMjJCNzYzMkU3QUFDNEREOC9UWDIvSmV0c29uX09TL1RlZ3JhX0xpbnV4X1NhbXBsZS1Sb290LUZpbGVzeXN0ZW1fUjMyLjEuMF9hYXJjaDY0LnRiejIiLCJidW5kbGVUaXRsZSI6IkpldFBhY2tfNC4yX0xpbnV4IiwiaW5zdGFsbFBhdGgiOiIvbWVkaWEvbWljcm9naWMvMjJCNzYzMkU3QUFDNEREOC9UWDIvSmV0UGFja180LjJfTGludXhfUDMzMTAiLCJpbnN0YWxsUm9vdCI6Ii9tZWRpYS9taWNyb2dpYy8yMkI3NjMyRTdBQUM0REQ4L1RYMiIsImJvYXJkSUQiOiJQMzMxMCIsInRhcmdldEFjY2Vzc0luZm8iOnsidXNlciI6IiIsInBhc3N3b3JkIjoiIiwiaG9zdCI6IjE5Mi4xNjguNTUuMSIsInBvcnQiOiIyMiJ9LCJpc0RyeVJ1biI6ZmFsc2V9’ -i=‘NV_L4T_FILE_SYSTEM_AND_OS_TX2_COMP’ -v=‘32.1’ -l=’/media/microgic/22B7632E7AAC4DD8/TX2/JetPack_4.2_Linux_P3310’ -L=’/home/microgic/.nvsdkm/logs/JetPack_4.2_Linux’ -p=‘19530’ -t=‘P3310’ -e=’/media/microgic/22B7632E7AAC4DD8/TX2/Jetson_OS/Tegra_Linux_Sample-Root-Filesystem_R32.1.0_aarch64.tbz2’ > terminated with error
2019-09-16 12:15:50.833 - warn: Failed to get component from group data map for NV_L4T_FILE_SYSTEM_AND_OS_TX2_COMP
2019-09-16 12:15:51.958 - error: Flash skipped due to component(s) download/install failure
2019-09-16 12:15:51.959 - warn: Failed to get component from group data map for NV_L4T_DEVICE_MODE_SETUP_COMP_IN_FLASH
2019-09-16 12:15:51.959 - error: Flash skipped due to component(s) download/install failure
2019-09-16 12:15:51.959 - warn: Failed to get component from group data map for NV_L4T_FLASH_TX2_WITH_OS_IMAGE_COMP
2019-09-16 12:15:53.069 - info: The overall duration (Download + Install) is 00:07:47

2019-09-16 12:15:53.071 - info:

*** Download Summary ***

  • Bundle: JetPack 4.2 Linux for Jetson TX2
  • Download server: Devzone
  • Download started on: Mon Sep 16 2019 12:08:06 GMT+0300 (IDT).
  • Download ended on: Mon Sep 16 2019 12:10:26 GMT+0300 (IDT).
  • Download duration: 00:02:20.
  • Average total download speed: 8.3MB/s = total downloaded bytes / download duration.
  • Average total bandwidth: 8.5MB/s, average accumulation of all file chunks speed, downloaded concurrently.
  • Average file chunks download speed: 8.56MB/s, average of all downloaded file chunks speed.
  • Max 6 concurrent files using 6 threads.

Total 15 files:

  • 3.43GB downloaded of 3.43GB
  • 1 downloaded, 0 cached, 14 failed

Details:

  • : .
  • : .
  • : .
  • : .
  • : .
  • : .
  • : .
  • : .
  • : .
  • : .
  • : .
  • : .
  • : .
  • : .
  • Tegra_Linux_Sample-Root-Filesystem_R32.1.0_aarch64.tbz2: Downloaded - 1.14GB in 00:02:15 (12:08:08 - 12:10:24), 6 threads, avg. speed: 8.56MB/s.

*** End of Download Summary ***

2019-09-16 12:15:53.072 - info:
Install summary of 11 components:

Install started on: 12:10:26 GMT+0300 (IDT).

Install ended on: Mon Sep 16 2019 12:15:53 GMT+0300 (IDT).

Install duration: 00:05:26 .

Install idle time: 0.000s .

Real install duration (duration - idle time): 00:05:26 .

Install 8 components.

- Already Install 8 components.

Install failed 1 files.

Install skipped 2 files.

Install details:

  • NV_CUDA_HOST_COMP@host: Already Installed.
  • NV_CUDA_HOST_CROSS_COMP@host: Already Installed.
  • NV_OPENCV_HOST_COMP@host: Already Installed.
  • NV_VISIONWORKS_HOST_COMP@host: Already Installed.
  • NV_NVIDIA_NSIGHT_GRAPHICS_L4T_COMP@host: Already Installed.
  • NV_NVIDIA_SYSTEM_PROFILER_L4T_COMP@host: Already Installed.
  • NV_DEVTOOLS_DOCS_L4T_COMP@host: Already Installed.
  • NV_L4T_FILE_SYSTEM_AND_OS_TX2_COMP@P3310: Failed - start: 12:10:26 GMT+0300 (IDT) - end: 12:15:50 GMT+0300 (IDT).
  • NV_L4T_DRIVERS_TX2_COMP@P3310: Already Installed.
  • NV_L4T_DEVICE_MODE_SETUP_COMP_IN_FLASH@P3310: .
  • NV_L4T_FLASH_TX2_WITH_OS_IMAGE_COMP@P3310: .

2019-09-16 12:15:53.199 - error: install failed
2019-09-16 12:15:53.240 - info:

********************** Completed install for bundle JetPack 4.2 Linux for Jetson TX2 time: 16-Sep-2019-12.15:53 is succeeded: false **********************
2019-09-16 12:15:53.256 - info: Went over log messages 0 - 51. Time: 0.3649999999906868
2019-09-16 12:15:53.267 - info: updateData level3 data
2019-09-16 12:15:53.267 - info: engine init InstallProxy
2019-09-16 12:15:53.267 - warn: installProxy initialization: did not get expected details from engine. Expected {product title, target os, and edition}. Got {title: JetPack 4.2, OS: Linux, edition: }
2019-09-16 12:15:53.268 - info: looking for install adapter from /opt/nvidia/sdkmanager/resources/app/output/installUtils
2019-09-16 12:15:53.302 - info: Replay file new log has been started.
2019-09-16 12:15:53.303 - info: GroupDataMap constructMap
2019-09-16 12:15:53.351 - info: querying component: NV_CUDA_HOST_COMP version: 10.0 for bundle:
2019-09-16 12:15:53.356 - info: querying component: NV_CUDA_HOST_CROSS_COMP version: 10.0 for bundle:
2019-09-16 12:15:53.357 - info: querying component: NV_OPENCV_HOST_COMP version: 3.3.1 for bundle:
2019-09-16 12:15:53.357 - info: querying component: NV_VISIONWORKS_HOST_COMP version: 1.6 for bundle:
2019-09-16 12:15:53.358 - info: querying component: NV_NVIDIA_NSIGHT_GRAPHICS_L4T_COMP version: 2018.7 for bundle:
2019-09-16 12:15:53.358 - info: querying component: NV_NVIDIA_SYSTEM_PROFILER_L4T_COMP version: 2019.3 for bundle:
2019-09-16 12:15:53.452 - info: Using GenericInstaller to Query NV_CUDA_HOST_COMP
exec_command: dpkg-query -W -f=’{db:Status-abbrev} {Version}’ cuda-toolkit-10-0
NV_CUDA_HOST_COMP cuda-repo-ubuntu1604-10-0-local-10.0.166-410.62_1.0-1_amd64.deb installed successfully.

2019-09-16 12:15:53.453 - info: Using GenericInstaller to Query NV_CUDA_HOST_CROSS_COMP
exec_command: dpkg-query -W -f=’{db:Status-abbrev} {Version}’ cuda-cross-aarch64-10-0
NV_CUDA_HOST_CROSS_COMP cuda-repo-cross-aarch64-10-0-local-10.0.166_1.0-1_all.deb installed successfully.

2019-09-16 12:15:53.454 - info: Using GenericInstaller to Query NV_OPENCV_HOST_COMP
exec_command: dpkg-query -W -f=’{db:Status-abbrev} {Version}’ libopencv
NV_OPENCV_HOST_COMP libopencv_3.3.1-2-gd6a8916_amd64.deb installed successfully.
exec_command: dpkg-query -W -f=’{db:Status-abbrev} {Version}’ libopencv-dev

2019-09-16 12:15:53.454 - info: Using GenericInstaller to Query NV_VISIONWORKS_HOST_COMP
exec_command: dpkg-query -W -f=’{db:Status-abbrev} {Version}’ libvisionworks
exec_command: dpkg-query -W -f=’{db:Status-abbrev} {Version}’ libvisionworks-dev

2019-09-16 12:15:53.454 - info: Using GenericInstaller to Query NV_NVIDIA_NSIGHT_GRAPHICS_L4T_COMP
exec_command: dpkg-query -W -f=’{db:Status-abbrev} {Version}’ nsight-graphics-for-l4t

2019-09-16 12:15:53.454 - info: finishing /opt/nvidia/sdkmanager/resources/app/output/installUtils/adapter -a=query -i=NV_CUDA_HOST_COMP -v=10.0 -L=/home/microgic/.nvsdkm/logs/Linux -c=eyJpZCI6Ik5WX0NVREFfSE9TVF9DT01QIiwibmFtZSI6IkNVREEgb24gSG9zdCIsImRlc2NyaXB0aW9uIjoiQ1VEQSB0byBiZSBpbnN0YWxsZWQgb24gaG9zdC4gQ1VEQSBpcyBhIHBhcmFsbGVsIGNvbXB1dGluZyBwbGF0Zm9ybSBhbmQgcHJvZ3JhbW1pbmcgbW9kZWwgaW52ZW50ZWQgYnkgTlZJRElBLiBJdCBlbmFibGVzIGRyYW1hdGljIGluY3JlYXNlcyBpbiBjb21wdXRpbmcgcGVyZm9ybWFuY2UgYnkgaGFybmVzc2luZyB0aGUgcG93ZXIgb2YgdGhlIGdyYXBoaWNzIHByb2Nlc3NpbmcgdW5pdCAoR1BVKS4iLCJjb21wVHlwZSI6Imhvc3QiLCJpc1Zpc2libGUiOnRydWUsImxpY2Vuc2VJZCI6Ik5WX0pFVFBBQ0tfQ1VEQV9FVUxBIiwiaXNEZXRlY3RhYmxlSW5zdGFsbCI6dHJ1ZSwiaXNJbnN0YWxsUGF0aEN1c3RvbWl6YWJsZSI6dHJ1ZSwidmVyc2lvbiI6IjEwLjAiLCJvcGVyYXRpbmdTeXN0ZW1zIjpbInVidW50dTE2MDQiXSwiaW5zdGFsbFNpemVNQiI6NDg5MSwiZG93bmxvYWRGaWxlcyI6W3sidXJsIjoidWJ1bnR1MTYwNC9jdWRhLXJlcG8tdWJ1bnR1MTYwNC0xMC0wLWxvY2FsLTEwLjAuMTY2LTQxMC42Ml8xLjAtMV9hbWQ2NC5kZWIiLCJmaWxlTmFtZSI6ImN1ZGEtcmVwby11YnVudHUxNjA0LTEwLTAtbG9jYWwtMTAuMC4xNjYtNDEwLjYyXzEuMC0xX2FtZDY0LmRlYiIsInNpemUiOjE1MDkwNTYxNDAsImNoZWNrc3VtIjoiYWU5ZWI5NmYyODg4NDdjZTk5M2RiZmMxMDlmYTQ3OTAiLCJjaGVja3N1bVR5cGUiOiJtZDUiLCJpbnN0YWxsUGFyYW1ldGVycyI6eyJpbnN0YWxsVHlwZSI6ImRlYl9yZXBvIiwiYWRkaXRpb25hbFBhcmFtZXRlcnMiOnsicGFja2FnZXNJbmZvIjpbeyJuYW1lIjoiY3VkYS10b29sa2l0LTEwLTAiLCJ2ZXJzaW9uIjoiMTAuMCJ9XSwiYXB0U3dpdGNoIjoiLS1hbGxvdy1kb3duZ3JhZGVzIiwicG9zdFVuaW5zdGFsbENvbW1hbmRzIjpbeyJ1c2VyQ29tbWFuZCI6InN1ZG8gYXB0LWdldCAteSBwdXJnZSBjdWRhLWxpY2Vuc2UtMTAtMCJ9LHsidXNlckNvbW1hbmQiOiJzdWRvIGFwdC1nZXQgLXkgcHVyZ2UgY3VkYS1yZXBvLXVidW50dTE2MDQtMTAtMC1sb2NhbCoifSx7InVzZXJDb21tYW5kIjoic3VkbyBhcHQta2V5IGRlbCAkKGFwdC1rZXkgbGlzdCB8IGdyZXAgY3VkYXRvb2xzIC1CIDF8IGdyZXAgJ3B1YicgfCBjdXQgLWQgJyAnIC1mIDQgfCBjdXQgLWQvIC1mIDIpIn0seyJ1c2VyQ29tbWFuZCI6InN1ZG8gcm0gLXJmIC91c3IvbG9jYWwvY3VkYS0xMC4wIn0seyJ1c2VyQ29tbWFuZCI6InN1ZG8gcm0gLXJmIC91c3Ivc2hhcmUvZG9jL2N1ZGEqMTAtMCJ9XX19fV0sInRhcmdldElkcyI6WyJQMzMxMCIsIlAzNDg5LTAwMDAiLCJQMjg4OCIsIlAzNDQ4LTAwMDAiXSwiZGVwZW5kZW5jaWVzIjpbXSwiZXh0ZXJuYWxfZGVwZW5kZW5jaWVzIjpbXSwidGFyZ2V0SUQiOiJob3N0IiwiX2lkIjoiTlZfQ1VEQV9IT1NUX0NPTVBAaG9zdCIsInBhcmVudElEIjoiTlZfQ1VEQV9IT1NUX0dST1VQIiwiX3BhcmVudElEIjoiTlZfQ1VEQV9IT1NUX0dST1VQQGhvc3QifQ== with exit code 0
2019-09-16 12:15:53.455 - info: finishing /opt/nvidia/sdkmanager/resources/app/output/installUtils/adapter -a=query -i=NV_CUDA_HOST_CROSS_COMP -v=10.0 -L=/home/microgic/.nvsdkm/logs/Linux -c=eyJpZCI6Ik5WX0NVREFfSE9TVF9DUk9TU19DT01QIiwibmFtZSI6IkNVREEgQ3Jvc3MgQ29tcGlsZSBQYWNrYWdlIG9uIEhvc3QiLCJkZXNjcmlwdGlvbiI6IkNVREEgVG9vbGtpdCBvbiBIb3N0IGZvciBDcm9zcyBDb21waWxpbmcuIE5WSURJQSBDVURBIFRvb2xraXQgcHJvdmlkZXMgYSBjb21wcmVoZW5zaXZlIGRldmVsb3BtZW50IGVudmlyb25tZW50IGZvciBDIGFuZCBDKysgZGV2ZWxvcGVycyBidWlsZGluZyBHUFUtYWNjZWxlcmF0ZWQgYXBwbGljYXRpb25zLiIsImNvbXBUeXBlIjoiaG9zdCIsImlzVmlzaWJsZSI6dHJ1ZSwibGljZW5zZUlkIjoiTlZfSkVUUEFDS19DVURBX0VVTEEiLCJpc0RldGVjdGFibGVJbnN0YWxsIjp0cnVlLCJpc0luc3RhbGxQYXRoQ3VzdG9taXphYmxlIjp0cnVlLCJ2ZXJzaW9uIjoiMTAuMCIsIm9wZXJhdGluZ1N5c3RlbXMiOlsidWJ1bnR1MTYwNCIsInVidW50dTE4MDQiXSwiaW5zdGFsbFNpemVNQiI6Mzg1LCJkb3dubG9hZEZpbGVzIjpbeyJ1cmwiOiIvY3VkYS1yZXBvLWNyb3NzLWFhcmNoNjQtMTAtMC1sb2NhbC0xMC4wLjE2Nl8xLjAtMV9hbGwuZGViIiwiZmlsZU5hbWUiOiJjdWRhLXJlcG8tY3Jvc3MtYWFyY2g2NC0xMC0wLWxvY2FsLTEwLjAuMTY2XzEuMC0xX2FsbC5kZWIiLCJzaXplIjozODUxNDIzNDAsImNoZWNrc3VtIjoiNmZiN2JhMjZkYjgzZGFiZmQzY2Y3NTI4MGU3YmYyM2YiLCJjaGVja3N1bVR5cGUiOiJtZDUiLCJpbnN0YWxsUGFyYW1ldGVycyI6eyJpbnN0YWxsVHlwZSI6ImRlYl9yZXBvIiwiYWRkaXRpb25hbFBhcmFtZXRlcnMiOnsicGFja2FnZXNJbmZvIjpbeyJuYW1lIjoiY3VkYS1jcm9zcy1hYXJjaDY0LTEwLTAiLCJ2ZXJzaW9uIjoiMTAuMCJ9XSwicG9zdFVuaW5zdGFsbENvbW1hbmRzIjpbeyJ1c2VyQ29tbWFuZCI6InN1ZG8gYXB0LWdldCAteSBwdXJnZSAnY3VkYS1yZXBvLWNyb3NzLioxMC0wLionIn1dfX19XSwidGFyZ2V0SWRzIjpbIlAzMzEwIiwiUDM0ODktMDAwMCIsIlAyODg4IiwiUDM0NDgtMDAwMCJdLCJkZXBlbmRlbmNpZXMiOlt7ImlkIjoiTlZfQ1VEQV9IT1NUX0NPTVAiLCJvcGVyYXRvciI6Ij09IiwidmVyIjoiMTAuMCIsIl9pZCI6Ik5WX0NVREFfSE9TVF9DT01QQGhvc3QifV0sImV4dGVybmFsX2RlcGVuZGVuY2llcyI6W10sInRhcmdldElEIjoiaG9zdCIsIl9pZCI6Ik5WX0NVREFfSE9TVF9DUk9TU19DT01QQGhvc3QiLCJwYXJlbnRJRCI6Ik5WX0NVREFfSE9TVF9HUk9VUCIsIl9wYXJlbnRJRCI6Ik5WX0NVREFfSE9TVF9HUk9VUEBob3N0In0= with exit code 0
2019-09-16 12:15:53.477 - info: NV_OPENCV_HOST_COMP libopencv-dev_3.3.1-2-gd6a8916_amd64.deb installed successfully.
exec_command: dpkg-query -W -f=’{db:Status-abbrev} {Version}’ libopencv-python

2019-09-16 12:15:53.478 - info: Using GenericInstaller to Query NV_NVIDIA_SYSTEM_PROFILER_L4T_COMP
exec_command: dpkg-query -W -f=’{db:Status-abbrev} {Version}’ nsightsystems-2019.3.2

2019-09-16 12:15:53.484 - info: NV_NVIDIA_NSIGHT_GRAPHICS_L4T_COMP NVIDIA_Nsight_Graphics_2018.7.L4T.25921359.deb installed successfully.

2019-09-16 12:15:53.485 - info: finishing /opt/nvidia/sdkmanager/resources/app/output/installUtils/adapter -a=query -i=NV_NVIDIA_NSIGHT_GRAPHICS_L4T_COMP -v=2018.7 -L=/home/microgic/.nvsdkm/logs/Linux -c=eyJpZCI6Ik5WX05WSURJQV9OU0lHSFRfR1JBUEhJQ1NfTDRUX0NPTVAiLCJuYW1lIjoiTlZJRElBIE5zaWdodCBHcmFwaGljcyIsImRlc2NyaXB0aW9uIjoiTlZJRElBIE5zaWdodCBHcmFwaGljcyBpcyBhIGNvbnNvbGUtZ3JhZGUgdG9vbCB0aGF0IGFsbG93cyBkZXZlbG9wZXJzIHRvIGRlYnVnIGFuZCBwcm9maWxlIE9wZW5HTC9HTCBFUyBhcHBsaWNhdGlvbnMuIiwiY29tcFR5cGUiOiJob3N0IiwiaXNWaXNpYmxlIjp0cnVlLCJsaWNlbnNlSWQiOiJOVl9DT01NT05fRVVMQSIsImlzRGV0ZWN0YWJsZUluc3RhbGwiOnRydWUsImlzSW5zdGFsbFBhdGhDdXN0b21pemFibGUiOnRydWUsInZlcnNpb24iOiIyMDE4LjciLCJvcGVyYXRpbmdTeXN0ZW1zIjpbInVidW50dTE2MDQiLCJ1YnVudHUxODA0Il0sImluc3RhbGxTaXplTUIiOjgyMy44MywiZG93bmxvYWRGaWxlcyI6W3sidXJsIjoiL05WSURJQV9Oc2lnaHRfR3JhcGhpY3NfMjAxOC43Lkw0VC4yNTkyMTM1OS5kZWIiLCJmaWxlTmFtZSI6Ik5WSURJQV9Oc2lnaHRfR3JhcGhpY3NfMjAxOC43Lkw0VC4yNTkyMTM1OS5kZWIiLCJzaXplIjoxNjM1MTQwOTgsImNoZWNrc3VtIjoiNTM2YWM3Y2Q5MDAzYjBlYjNmZDZjZWEyZDUxMmNkYTQiLCJjaGVja3N1bVR5cGUiOiJtZDUiLCJpbnN0YWxsUGFyYW1ldGVycyI6eyJpbnN0YWxsVHlwZSI6ImRlYiIsImFkZGl0aW9uYWxQYXJhbWV0ZXJzIjp7InBhY2thZ2VzSW5mbyI6W3sibmFtZSI6Im5zaWdodC1ncmFwaGljcy1mb3ItbDR0IiwidmVyc2lvbiI6IjIwMTguNyJ9XX19fV0sInRhcmdldElkcyI6WyJQMzMxMCIsIlAzNDg5LTAwMDAiLCJQMjg4OCIsIlAzNDQ4LTAwMDAiXSwiZGVwZW5kZW5jaWVzIjpbXSwiZXh0ZXJuYWxfZGVwZW5kZW5jaWVzIjpbXSwidGFyZ2V0SUQiOiJob3N0IiwiX2lkIjoiTlZfTlZJRElBX05TSUdIVF9HUkFQSElDU19MNFRfQ09NUEBob3N0IiwicGFyZW50SUQiOiJOVl9ERVZUT09MU19IT1NUX0dST1VQIiwiX3BhcmVudElEIjoiTlZfREVWVE9PTFNfSE9TVF9HUk9VUEBob3N0In0= with exit code 0
2019-09-16 12:15:53.497 - info: exec_command: dpkg-query -W -f=’{db:Status-abbrev} {Version}’ libvisionworks-samples

2019-09-16 12:15:53.521 - info: NV_OPENCV_HOST_COMP libopencv-python_3.3.1-2-gd6a8916_amd64.deb installed successfully.
exec_command: dpkg-query -W -f=’{db:Status-abbrev} {Version}’ libopencv-samples

2019-09-16 12:15:53.537 - info: NV_VISIONWORKS_HOST_COMP libvisionworks-repo_1.6.0.500n_amd64.deb installed successfully.
exec_command: dpkg-query -W -f=’{db:Status-abbrev} {Version}’ libvisionworks-sfm

2019-09-16 12:15:53.540 - info: NV_NVIDIA_SYSTEM_PROFILER_L4T_COMP NsightSystems-linux-public-2019.3.2.12-510a942.deb installed successfully.

2019-09-16 12:15:53.541 - info: finishing /opt/nvidia/sdkmanager/resources/app/output/installUtils/adapter -a=query -i=NV_NVIDIA_SYSTEM_PROFILER_L4T_COMP -v=2019.3 -L=/home/microgic/.nvsdkm/logs/Linux -c=eyJpZCI6Ik5WX05WSURJQV9TWVNURU1fUFJPRklMRVJfTDRUX0NPTVAiLCJuYW1lIjoiTlZJRElBIE5zaWdodCBTeXN0ZW1zIiwiZGVzY3JpcHRpb24iOiJOVklESUEgTnNpZ2h0IFN5c3RlbXMgaXMgYSBtdWx0aS1jb3JlIENQVSBzYW1wbGluZyBwcm9maWxlciB0aGF0IHByb3ZpZGVzIGFuIGludGVyYWN0aXZlIHZpZXcgb2YgY2FwdHVyZWQgcHJvZmlsaW5nIGRhdGEsIGhlbHBpbmcgaW1wcm92ZSBvdmVyYWxsIGFwcGxpY2F0aW9uIHBlcmZvcm1hbmNlLiIsImNvbXBUeXBlIjoiaG9zdCIsImlzVmlzaWJsZSI6dHJ1ZSwibGljZW5zZUlkIjoiTlZfQ09NTU9OX0VVTEEiLCJpc0RldGVjdGFibGVJbnN0YWxsIjp0cnVlLCJpc0luc3RhbGxQYXRoQ3VzdG9taXphYmxlIjp0cnVlLCJ2ZXJzaW9uIjoiMjAxOS4zIiwib3BlcmF0aW5nU3lzdGVtcyI6WyJ1YnVudHUxNjA0IiwidWJ1bnR1MTgwNCJdLCJpbnN0YWxsU2l6ZU1CIjozNjUsImRvd25sb2FkRmlsZXMiOlt7InVybCI6Ii9Oc2lnaHRTeXN0ZW1zLWxpbnV4LXB1YmxpYy0yMDE5LjMuMi4xMi01MTBhOTQyLmRlYiIsImZpbGVOYW1lIjoiTnNpZ2h0U3lzdGVtcy1saW51eC1wdWJsaWMtMjAxOS4zLjIuMTItNTEwYTk0Mi5kZWIiLCJzaXplIjoxMTY0MjA1NjgsImNoZWNrc3VtIjoiYWNlMDhhOWJiMWJiZDlmYzcyOGEwMjEzZDljYWI5ZTIiLCJjaGVja3N1bVR5cGUiOiJtZDUiLCJpbnN0YWxsUGFyYW1ldGVycyI6eyJpbnN0YWxsVHlwZSI6ImRlYiIsImFkZGl0aW9uYWxQYXJhbWV0ZXJzIjp7InBhY2thZ2VzSW5mbyI6W3sibmFtZSI6Im5zaWdodHN5c3RlbXMtMjAxOS4zLjIiLCJ2ZXJzaW9uIjoiMjAxOS4zLjIifV19fX1dLCJ0YXJnZXRJZHMiOlsiUDMzMTAiLCJQMzQ4OS0wMDAwIiwiUDI4ODgiLCJQMzQ0OC0wMDAwIl0sImRlcGVuZGVuY2llcyI6W10sImV4dGVybmFsX2RlcGVuZGVuY2llcyI6W10sInRhcmdldElEIjoiaG9zdCIsIl9pZCI6Ik5WX05WSURJQV9TWVNURU1fUFJPRklMRVJfTDRUX0NPTVBAaG9zdCIsInBhcmVudElEIjoiTlZfREVWVE9PTFNfSE9TVF9HUk9VUCIsIl9wYXJlbnRJRCI6Ik5WX0RFVlRPT0xTX0hPU1RfR1JPVVBAaG9zdCJ9 with exit code 0
2019-09-16 12:15:53.554 - info: NV_OPENCV_HOST_COMP libopencv-samples_3.3.1-2-gd6a8916_amd64.deb installed successfully.

2019-09-16 12:15:53.555 - info: finishing /opt/nvidia/sdkmanager/resources/app/output/installUtils/adapter -a=query -i=NV_OPENCV_HOST_COMP -v=3.3.1 -L=/home/microgic/.nvsdkm/logs/Linux -c=eyJpZCI6Ik5WX09QRU5DVl9IT1NUX0NPTVAiLCJuYW1lIjoiT3BlbkNWIG9uIEhvc3QiLCJkZXNjcmlwdGlvbiI6Ik9wZW5DViBmb3IgSG9zdCIsImNvbXBUeXBlIjoiaG9zdCIsImlzVmlzaWJsZSI6dHJ1ZSwibGljZW5zZUlkIjoiTlZfSkVUUEFDS19WSVNJT05XT1JLU19PUEVOQ1ZfRVVMQSIsImlzRGV0ZWN0YWJsZUluc3RhbGwiOnRydWUsImlzSW5zdGFsbFBhdGhDdXN0b21pemFibGUiOmZhbHNlLCJ2ZXJzaW9uIjoiMy4zLjEiLCJvcGVyYXRpbmdTeXN0ZW1zIjpbInVidW50dTE2MDQiXSwiaW5zdGFsbFNpemVNQiI6MTU4LCJkb3dubG9hZEZpbGVzIjpbeyJ1cmwiOiJ1YnVudHUxNjA0L2xpYm9wZW5jdl8zLjMuMS0yLWdkNmE4OTE2X2FtZDY0LmRlYiIsImZpbGVOYW1lIjoibGlib3BlbmN2XzMuMy4xLTItZ2Q2YTg5MTZfYW1kNjQuZGViIiwic2l6ZSI6Mjc4MDMwNzgsImNoZWNrc3VtIjoiMDgyZTFhOGI5NTUyNTRmZGNlNTY0MTU2NDczZGY3ZjYiLCJjaGVja3N1bVR5cGUiOiJtZDUiLCJpbnN0YWxsUGFyYW1ldGVycyI6eyJpbnN0YWxsVHlwZSI6ImRlYiIsImFkZGl0aW9uYWxQYXJhbWV0ZXJzIjp7InBhY2thZ2VzSW5mbyI6W3sibmFtZSI6ImxpYm9wZW5jdiIsInZlcnNpb24iOiIzLjMuMSJ9XSwicHJlSW5zdGFsbENvbW1hbmRzIjpbeyJ1c2VyQ29tbWFuZCI6InN1ZG8gYXB0LWdldCBpbnN0YWxsIC15IGxpYnRiYi1kZXYifV19fX0seyJ1cmwiOiJ1YnVudHUxNjA0L2xpYm9wZW5jdi1kZXZfMy4zLjEtMi1nZDZhODkxNl9hbWQ2NC5kZWIiLCJmaWxlTmFtZSI6ImxpYm9wZW5jdi1kZXZfMy4zLjEtMi1nZDZhODkxNl9hbWQ2NC5kZWIiLCJzaXplIjoxMTQxMjk2LCJjaGVja3N1bSI6IjU0N2NlZWIwYjI1MjRiOGJlZGRhNzIxYmVhZTYwNzRiIiwiY2hlY2tzdW1UeXBlIjoibWQ1IiwiaW5zdGFsbFBhcmFtZXRlcnMiOnsiaW5zdGFsbFR5cGUiOiJkZWIiLCJhZGRpdGlvbmFsUGFyYW1ldGVycyI6eyJwYWNrYWdlc0luZm8iOlt7Im5hbWUiOiJsaWJvcGVuY3YtZGV2IiwidmVyc2lvbiI6IjMuMy4xIn1dfX19LHsidXJsIjoidWJ1bnR1MTYwNC9saWJvcGVuY3YtcHl0aG9uXzMuMy4xLTItZ2Q2YTg5MTZfYW1kNjQuZGViIiwiZmlsZU5hbWUiOiJsaWJvcGVuY3YtcHl0aG9uXzMuMy4xLTItZ2Q2YTg5MTZfYW1kNjQuZGViIiwic2l6ZSI6MTcyMTc1NCwiY2hlY2tzdW0iOiI1YzMyZWIyZTZmNjEwMjJmNGM4MmFmN2ZiNDE5MWE1YiIsImNoZWNrc3VtVHlwZSI6Im1kNSIsImluc3RhbGxQYXJhbWV0ZXJzIjp7Imluc3RhbGxUeXBlIjoiZGViIiwiYWRkaXRpb25hbFBhcmFtZXRlcnMiOnsicGFja2FnZXNJbmZvIjpbeyJuYW1lIjoibGlib3BlbmN2LXB5dGhvbiIsInZlcnNpb24iOiIzLjMuMSJ9XX19fSx7InVybCI6InVidW50dTE2MDQvbGlib3BlbmN2LXNhbXBsZXNfMy4zLjEtMi1nZDZhODkxNl9hbWQ2NC5kZWIiLCJmaWxlTmFtZSI6ImxpYm9wZW5jdi1zYW1wbGVzXzMuMy4xLTItZ2Q2YTg5MTZfYW1kNjQuZGViIiwic2l6ZSI6MTgyMTY4LCJjaGVja3N1bSI6ImUwZGI3ZGViYzEzMGIwNmM3MDk5YzhhMjQ5N2MzYmMxIiwiY2hlY2tzdW1UeXBlIjoibWQ1IiwiaW5zdGFsbFBhcmFtZXRlcnMiOnsiaW5zdGFsbFR5cGUiOiJkZWIiLCJhZGRpdGlvbmFsUGFyYW1ldGVycyI6eyJwYWNrYWdlc0luZm8iOlt7Im5hbWUiOiJsaWJvcGVuY3Ytc2FtcGxlcyIsInZlcnNpb24iOiIzLjMuMSJ9XX19fV0sInRhcmdldElkcyI6WyJQMzMxMCIsIlAzNDg5LTAwMDAiLCJQMjg4OCIsIlAzNDQ4LTAwMDAiXSwiZGVwZW5kZW5jaWVzIjpbeyJpZCI6Ik5WX0NVREFfSE9TVF9DT01QIiwib3BlcmF0b3IiOiI9PSIsInZlciI6IjEwLjAiLCJfaWQiOiJOVl9DVURBX0hPU1RfQ09NUEBob3N0In1dLCJleHRlcm5hbF9kZXBlbmRlbmNpZXMiOltdLCJ0YXJnZXRJRCI6Imhvc3QiLCJfaWQiOiJOVl9PUEVOQ1ZfSE9TVF9DT01QQGhvc3QiLCJwYXJlbnRJRCI6Ik5WX0NPTVBVVEVSVklTSU9OX0hPU1RfR1JPVVAiLCJfcGFyZW50SUQiOiJOVl9DT01QVVRFUlZJU0lPTl9IT1NUX0dST1VQQGhvc3QifQ== with exit code 0
2019-09-16 12:15:53.566 - info: exec_command: dpkg-query -W -f=’{db:Status-abbrev} {Version}’ libvisionworks-sfm-dev

2019-09-16 12:15:53.591 - info: NV_VISIONWORKS_HOST_COMP libvisionworks-sfm-repo_0.90.4_amd64.deb installed successfully.
exec_command: dpkg-query -W -f=’{db:Status-abbrev} {Version}’ libvisionworks-tracking

2019-09-16 12:15:53.616 - info: exec_command: dpkg-query -W -f=’{db:Status-abbrev} {Version}’ libvisionworks-tracking-dev

2019-09-16 12:15:53.643 - info: NV_VISIONWORKS_HOST_COMP libvisionworks-tracking-repo_0.88.2_amd64.deb installed successfully.

2019-09-16 12:15:53.643 - info: finishing /opt/nvidia/sdkmanager/resources/app/output/installUtils/adapter -a=query -i=NV_VISIONWORKS_HOST_COMP -v=1.6 -L=/home/microgic/.nvsdkm/logs/Linux -c=eyJpZCI6Ik5WX1ZJU0lPTldPUktTX0hPU1RfQ09NUCIsIm5hbWUiOiJWaXNpb25Xb3JrcyBvbiBIb3N0IiwiZGVzY3JpcHRpb24iOiJOVklESUEgVmlzaW9uV29ya3MgVG9vbGtpdCBpcyBhIENVREEgYWNjZWxlcmF0ZWQgc29mdHdhcmUgZGV2ZWxvcG1lbnQgcGFja2FnZSBmb3IgY29tcHV0ZXIgdmlzaW9uIChDVikgYW5kIGltYWdlIHByb2Nlc3NpbmcuIFRoZSB0b29sa2l0IGlzIGRlc2lnbmVkIHRvIHByb3ZpZGUgYSBwcm9kdWN0aW9uLXF1YWxpdHksIHN0YW5kYXJkIGludGVyZmFjZSB0aGF0IGltcGxlbWVudHMgYW5kIGV4dGVuZHMgdGhlIE9wZW5WWCBzdGFuZGFyZCwgZW5hYmxpbmcgaGlnaCBwZXJmb3JtYW5jZSBjb21wdXRlciB2aXNpb24gYXBwbGljYXRpb25zIG9uIE5WSURJQSBUZWdyYSBkZXZpY2VzLiIsImNvbXBUeXBlIjoiaG9zdCIsImlzVmlzaWJsZSI6dHJ1ZSwibGljZW5zZUlkIjoiTlZfSkVUUEFDS19WSVNJT05XT1JLU19PUEVOQ1ZfRVVMQSIsImlzRGV0ZWN0YWJsZUluc3RhbGwiOnRydWUsImlzSW5zdGFsbFBhdGhDdXN0b21pemFibGUiOmZhbHNlLCJ2ZXJzaW9uIjoiMS42Iiwib3BlcmF0aW5nU3lzdGVtcyI6WyJ1YnVudHUxNjA0IiwidWJ1bnR1MTgwNCJdLCJpbnN0YWxsU2l6ZU1CIjoyMzMsImRvd25sb2FkRmlsZXMiOlt7InVybCI6Ii9saWJ2aXNpb253b3Jrcy1yZXBvXzEuNi4wLjUwMG5fYW1kNjQuZGViIiwiZmlsZU5hbWUiOiJsaWJ2aXNpb253b3Jrcy1yZXBvXzEuNi4wLjUwMG5fYW1kNjQuZGViIiwic2l6ZSI6NjY1NjE0NzIsImNoZWNrc3VtIjoiMDAxMGIyNmRmNTM4NzczZjM3Y2VkZDYyNDE1MzVmZWYiLCJjaGVja3N1bVR5cGUiOiJtZDUiLCJpbnN0YWxsUGFyYW1ldGVycyI6eyJpbnN0YWxsVHlwZSI6ImRlYl9yZXBvIiwiYWRkaXRpb25hbFBhcmFtZXRlcnMiOnsicmVwb1BhY2thZ2VJbmZvIjp7Im5hbWUiOiJsaWJ2aXNpb253b3Jrcy1yZXBvIiwidmVyc2lvbiI6IjEuNiIsImtleUZpbGUiOiJHUEdLRVkifSwicGFja2FnZXNJbmZvIjpbeyJuYW1lIjoibGlidmlzaW9ud29ya3MiLCJ2ZXJzaW9uIjoiMS42In0seyJuYW1lIjoibGlidmlzaW9ud29ya3MtZGV2IiwidmVyc2lvbiI6IjEuNiJ9LHsibmFtZSI6ImxpYnZpc2lvbndvcmtzLXNhbXBsZXMiLCJ2ZXJzaW9uIjoiMS42In1dLCJwb3N0VW5pbnN0YWxsQ29tbWFuZHMiOlt7InVzZXJDb21tYW5kIjoic3VkbyBhcHQtZ2V0IC15IHB1cmdlIGxpYnZpc2lvbndvcmtzLXJlcG8ifSx7InVzZXJDb21tYW5kIjoic3VkbyBhcHQta2V5IGRlbCAkKGFwdC1rZXkgbGlzdCB8IGdyZXAgdmlzaW9ud29ya3MgLUIgMXwgZ3JlcCAncHViJyB8IGN1dCAtZCAnICcgLWYgNCB8IGN1dCAtZC8gLWYgMikifV19fX0seyJ1cmwiOiIvbGlidmlzaW9ud29ya3Mtc2ZtLXJlcG9fMC45MC40X2FtZDY0LmRlYiIsImZpbGVOYW1lIjoibGlidmlzaW9ud29ya3Mtc2ZtLXJlcG9fMC45MC40X2FtZDY0LmRlYiIsInNpemUiOjIwNTk3NTg2LCJjaGVja3N1bSI6Ijg4YzBlZGE5NzVkZjkzYzdjNzhlNTNmYWFiMzE5NzNmIiwiY2hlY2tzdW1UeXBlIjoibWQ1IiwiaW5zdGFsbFBhcmFtZXRlcnMiOnsiaW5zdGFsbFR5cGUiOiJkZWJfcmVwbyIsImFkZGl0aW9uYWxQYXJhbWV0ZXJzIjp7InJlcG9QYWNrYWdlSW5mbyI6eyJuYW1lIjoibGlidmlzaW9ud29ya3Mtc2ZtLXJlcG8iLCJ2ZXJzaW9uIjoiMC45MCIsImtleUZpbGUiOiJHUEdLRVkifSwicGFja2FnZXNJbmZvIjpbeyJuYW1lIjoibGlidmlzaW9ud29ya3Mtc2ZtIiwidmVyc2lvbiI6IjAuOTAifSx7Im5hbWUiOiJsaWJ2aXNpb253b3Jrcy1zZm0tZGV2IiwidmVyc2lvbiI6IjAuOTAifV0sInBvc3RVbmluc3RhbGxDb21tYW5kcyI6W3sidXNlckNvbW1hbmQiOiJzdWRvIGFwdC1nZXQgLXkgcHVyZ2UgbGlidmlzaW9ud29ya3Mtc2ZtLXJlcG8ifSx7InVzZXJDb21tYW5kIjoic3VkbyBhcHQta2V5IGRlbCAkKGFwdC1rZXkgbGlzdCB8IGdyZXAgdmlzaW9ud29ya3MgLUIgMXwgZ3JlcCAncHViJyB8IGN1dCAtZCAnICcgLWYgNCB8IGN1dCAtZC8gLWYgMikifV19fX0seyJ1cmwiOiIvbGlidmlzaW9ud29ya3MtdHJhY2tpbmctcmVwb18wLjg4LjJfYW1kNjQuZGViIiwiZmlsZU5hbWUiOiJsaWJ2aXNpb253b3Jrcy10cmFja2luZy1yZXBvXzAuODguMl9hbWQ2NC5kZWIiLCJzaXplIjoxMzExMzIzOCwiY2hlY2tzdW0iOiJhMmU4MGJhM2FiMWQ4NzZjMzM3ZmExMDc3NThkZDE1ZCIsImNoZWNrc3VtVHlwZSI6Im1kNSIsImluc3RhbGxQYXJhbWV0ZXJzIjp7Imluc3RhbGxUeXBlIjoiZGViX3JlcG8iLCJhZGRpdGlvbmFsUGFyYW1ldGVycyI6eyJyZXBvUGFja2FnZUluZm8iOnsibmFtZSI6ImxpYnZpc2lvbndvcmtzLXRyYWNraW5nLXJlcG8iLCJ2ZXJzaW9uIjoiMC44OCIsImtleUZpbGUiOiJHUEdLRVkifSwicGFja2FnZXNJbmZvIjpbeyJuYW1lIjoibGlidmlzaW9ud29ya3MtdHJhY2tpbmciLCJ2ZXJzaW9uIjoiMC44OCJ9LHsibmFtZSI6ImxpYnZpc2lvbndvcmtzLXRyYWNraW5nLWRldiIsInZlcnNpb24iOiIwLjg4In1dLCJwb3N0VW5pbnN0YWxsQ29tbWFuZHMiOlt7InVzZXJDb21tYW5kIjoic3VkbyBhcHQtZ2V0IC15IHB1cmdlIGxpYnZpc2lvbndvcmtzLXRyYWNraW5nLXJlcG8ifSx7InVzZXJDb21tYW5kIjoic3VkbyBhcHQta2V5IGRlbCAkKGFwdC1rZXkgbGlzdCB8IGdyZXAgdmlzaW9ud29ya3MgLUIgMXwgZ3JlcCAncHViJyB8IGN1dCAtZCAnICcgLWYgNCB8IGN1dCAtZC8gLWYgMikifV19fX0seyJ1cmwiOiIvTlZJRElBX1Zpc2lvbldvcmtzX1JlZmVyZW5jZXMuemlwIiwiZmlsZU5hbWUiOiJOVklESUFfVmlzaW9uV29ya3NfUmVmZXJlbmNlcy56aXAiLCJzaXplIjo1MzUwNzY1LCJjaGVja3N1bSI6ImZlODE5N2YzNjhmN2VkZjM3Y2QzZjM1Yjc1YTkyNTg0IiwiY2hlY2tzdW1UeXBlIjoibWQ1IiwiaW5zdGFsbFBhcmFtZXRlcnMiOnsiaW5zdGFsbFR5cGUiOiJ6aXAiLCJhZGRpdGlvbmFsUGFyYW1ldGVycyI6eyJpbnN0YWxsRGlyIjoie3tUQVJHRVRfUk9PVH19L3t7QlVORExFX1RJVExFfX0vZG9jdW1lbnRhdGlvbnMvVmlzaW9uV29ya3MvIn19fV0sInRhcmdldElkcyI6WyJQMzMxMCIsIlAzNDg5LTAwMDAiLCJQMjg4OCIsIlAzNDQ4LTAwMDAiXSwiZGVwZW5kZW5jaWVzIjpbeyJpZCI6Ik5WX09QRU5DVl9IT1NUX0NPTVAiLCJvcGVyYXRvciI6Ij09IiwidmVyIjoiMy4zLjEiLCJfaWQiOiJOVl9PUEVOQ1ZfSE9TVF9DT01QQGhvc3QifV0sImV4dGVybmFsX2RlcGVuZGVuY2llcyI6W10sInRhcmdldElEIjoiaG9zdCIsIl9pZCI6Ik5WX1ZJU0lPTldPUktTX0hPU1RfQ09NUEBob3N0IiwicGFyZW50SUQiOiJOVl9DT01QVVRFUlZJU0lPTl9IT1NUX0dST1VQIiwiX3BhcmVudElEIjoiTlZfQ09NUFVURVJWSVNJT05fSE9TVF9HUk9VUEBob3N0In0= with exit code 0
2019-09-16 12:15:53.645 - info: updateData level3 data
2019-09-16 12:15:53.645 - info: engine init InstallProxy
2019-09-16 12:15:53.645 - warn: installProxy initialization: did not get expected details from engine. Expected {product title, target os, and edition}. Got {title: JetPack 4.2, OS: Linux, edition: }
2019-09-16 12:15:53.646 - info: looking for install adapter from /opt/nvidia/sdkmanager/resources/app/output/installUtils
2019-09-16 12:15:53.647 - info: Replay file new log has been started.
2019-09-16 12:15:53.649 - info: GroupDataMap constructMap
2019-09-16 12:15:53.697 - warn: comp NV_L4T_DRIVERS_XAVIER_COMP filtered out, due to supported targetIDs [P2888], not include P3310
2019-09-16 12:15:53.697 - warn: comp NV_L4T_FILE_SYSTEM_AND_OS_XAVIER_COMP filtered out, due to invalid dependencies: [NV_L4T_DRIVERS_XAVIER_COMP 32.1]
2019-09-16 12:15:53.697 - warn: comp NV_L4T_DRIVERS_NANO_COMP filtered out, due to supported targetIDs [P3448-0000], not include P3310
2019-09-16 12:15:53.697 - warn: comp NV_L4T_FILE_SYSTEM_AND_OS_NANO_COMP filtered out, due to invalid dependencies: [NV_L4T_DRIVERS_NANO_COMP 32.1]
2019-09-16 12:15:53.697 - warn: comp NV_L4T_FLASH_TX2I_WITH_OS_IMAGE_COMP filtered out, due to supported targetIDs [P3489-0000], not include P3310
2019-09-16 12:15:53.698 - warn: comp NV_L4T_FLASH_XAVIER_WITH_OS_IMAGE_COMP filtered out, due to invalid dependencies: [NV_L4T_FILE_SYSTEM_AND_OS_XAVIER_COMP 32.1,NV_L4T_DRIVERS_XAVIER_COMP 32.1]
2019-09-16 12:15:53.698 - warn: comp NV_L4T_FLASH_NANO_WITH_OS_IMAGE_COMP filtered out, due to invalid dependencies: [NV_L4T_FILE_SYSTEM_AND_OS_NANO_COMP 32.1,NV_L4T_DRIVERS_NANO_COMP 32.1]
2019-09-16 12:15:53.698 - warn: comp NV_L4T_CUDNN_TARGET_POST_INSTALL_XAVIER_COMP filtered out, due to supported targetIDs [P2888], not include P3310
2019-09-16 12:15:53.698 - warn: comp NV_L4T_CUDNN_TARGET_POST_INSTALL_NANO_COMP filtered out, due to supported targetIDs [P3448-0000], not include P3310
2019-09-16 12:15:53.699 - warn: comp NV_L4T_TENSORRT_TARGET_POST_INSTALL_XAVIER_COMP filtered out, due to invalid dependencies: [NV_L4T_CUDNN_TARGET_POST_INSTALL_XAVIER_COMP 7.3]
2019-09-16 12:15:53.699 - warn: comp NV_L4T_TENSORRT_TARGET_POST_INSTALL_NANO_COMP filtered out, due to invalid dependencies: [NV_L4T_CUDNN_TARGET_POST_INSTALL_NANO_COMP 7.3]
2019-09-16 12:15:53.700 - warn: comp NV_MULTIMEDIA_API_TARGET_POST_INSTALL_XAVIER_COMP filtered out, due to invalid dependencies: [NV_L4T_TENSORRT_TARGET_POST_INSTALL_XAVIER_COMP 5.0]
2019-09-16 12:15:53.700 - warn: comp NV_MULTIMEDIA_API_TARGET_POST_INSTALL_NANO_COMP filtered out, due to invalid dependencies: [NV_L4T_TENSORRT_TARGET_POST_INSTALL_NANO_COMP 5.0]
2019-09-16 12:21:50.270 - info: exporting logs from /home/microgic/.nvsdkm/logs
2019-09-16 12:21:50.489 - info: Exported 74 log files to /media/microgic/22B7632E7AAC4DD8/TX2/Jetson_OS/SDKM_logs_2019-09-16_12-21-50.zip
2019-09-16 12:22:16.820 - info: exporting logs from /home/microgic/.nvsdkm/logs
2019-09-16 12:22:16.906 - info: Exported 74 log files to /media/microgic/22B7632E7AAC4DD8/TX2/Jetson_OS/SDKM_logs_2019-09-16_12-22-16.zip

I see a “…/media/” location. The software is expecting the location of flash.sh to be within “~/nvidia/nvidia_sdk//Linux_for_Tegra/flash.sh”, and not in an alternate location.

First, if your system is auto mounting removable media, then you can umount this and remount it at somewhere like “~/nvidia/nvidia_sdk/”, and then run SDK Manager. Beware that your removable media must be a Linux filesystem type. “ext4” is expected. From the Linux_for_Tegra directory you can run “df -H -T .” to see available space and filesystem type.

FYI, it is JetPack and SDKM which require a specific location. “flash.sh” won’t care, but if items flash.sh uses failed to download or configure correctly, then flash.sh will fail. If the filesystem type is wrong, then flash will succeed, but boot will result in odd/broken behavior.

Hi linuxdev,

I tried everything from the beginning, which means:

Jetson TX2, Jetpack 4.2.1 (Rev 2) with SDKManager.

On the host component everything installed however in the target component it failed to do the “File System and OS” (it got to 86% and failed).

Which file from the SDKM logs should I paste here so you can see the problem?

Was the flash running from somewhere in “~/nvidia/nvidia_sdk/”? If the flash software was elsewhere, then I would expect failure due to being non-relocatable (the software expects a group of programs in that file path).

If the host is a VM, I’d also expect failure.

I don’t keep up with the SDKM log system, I’d suggest just saving a copy of the command line flash results. If you’ve run SDKM 4.2.1 for a TX2 before, then you will have this directory (P3310 is for the TX2):

~/nvidia/nvidia_sdk/JetPack_4.2.1_Linux_P3310/Linux_for_Tegra/

If you cd to that location, and run the command “df -H -T .”, then you should start only if the filesystem type is ext4, and if you have enough space (probably about 22GB).

The following would flash the TX2 (no extra package install…this can be done later), where the “gawk” part cuts out the progress bar spam in the log file:

sudo ./flash.sh jetson-tx2 mmcblk0p1 2>&1 | gawk '{gsub("[0-9][0-9]+[/][0-9[0-9]+ bytes sent..",".");print}' | tee log.txt

On an existing post, if you hover the mouse over the quote icon in the upper right, then other icons will show up. The paper clip icon is for attaching files.

Hello linuxdev,

First I made a folder for all the download of the SDKManager and flash in an hard drive with enough space,
and I can see the name of the folders are:
Flash_TX2 => SDKManager => JetPack_4.2.1_Linux_GA_P3310 => Linux_for_Tegra

I ran the this command in terminal from folders above (Linux_for_Tegra):
sudo ./flash.sh jetson-tx2 mmcblk0p1 2>&1 | gawk ‘{gsub("[0-9][0-9]+[/][0-9[0-9]+ bytes sent…",".");print}’ | tee log.txt

Seems like it flashed, I get this message in the end:
“*** The target t186ref has been flashed successfully. ***
Reset the board to boot from internal eMMC.”

However I can see on the display connected to the TX2 just logo of Nvidia, not anything else…

Hi,

I can also see error 404 which the sdk manager try to get to these packages and can’t find them: http://archive.ubuntu.com/ubuntu/dists/xenial-updates/binary-arm64/packages/ 404 not found

Could you attach the log from the flash? If you hover your mouse over the quote icon in the upper right of one of your existing posts, then other icons will show up. The paper clip icon is for attaching files, e.g., “log.txt”.

That particular URL is not actually the problem it may seem to be. There are several different repositories, and if that repo does not support the architecture, then this is the message you will see. In this case it is for some updates, but those will have no effect on initial install or boot.

FYI, video failing is not a way to see if boot failed since there are many possible video configuration issues. Are you using an actual HDMI monitor without adapters? Is there anything unusual about the monitor?

The definitive way to see what is going on is via serial console, but if you never completed first boot you won’t get as far (this is still quite useful though). For serial console see:
http://www.jetsonhacks.com/2017/03/24/serial-console-nvidia-jetson-tx2/

“I can also see error 404 which the sdk manager try to get to these packages and can’t find them: http://archive.ubuntu.com/ubuntu/dists/xenial-updates/binary-arm64/packages/ 404 not found”

Seeing same problem, but TX2 boots fine, no video problems. However, components don’t complete installation.
Can’t “apt update” from the SDK’s chosen repo via command line either.

Never mind. Problem was something unrelated. Thanks for your response.

That 404 web site response is provided by Ubuntu itself, and is for checking for updates (this isn’t an NVIDIA installer or NVIDIA site failure). The updates are not present for arm64 on the 404 server, and so it is telling you there are no updates for that architecture. This is not an install error. This shouldn’t have any effect on successful flash or boot.

I don’t know if perhaps there is an alternate URL for updates under arm64, but I would not worry about this.

When you say “apt update from the SDK’s chosen…”, are you running apt update from the Jetson? I’d like to clarify which packages are not installing, and if you have internet access from both the Jetson and the host PC. In either case a repo which doesn’t exist can’t succeed, but in the case of NVIDIA-specific packages, it may be a login issue NVIDIA can work on. Ubuntu’s repositories are not controlled by NVIDIA, so for those there is nothing which can be done. The additional package installs for things like CUDA are from NVIDIA servers.

Hello linuxdev,

First thank you very much for all the support for me and for all the forum, really appreciate.

Second, the monitor of the host connected with VGA.
The monitor of the TX2 connected with real HDMI connection to a TV monitor.

I know for sure the problem which I can’t flash the TX2 is with my host computer.
I went to the company I bought the TX2 and they could flash it with the SDKManager.

They told my to download python 3 via the terminal, and I did it.

One thing about my host computer is that it has on it ubunto and also Microsoft - maybe that’s the problem?

Is there anything else I need to download to my host computer?
Does the address on my hard drive where I download all the files can cause the problem?

I try to think about solutions, it’s just ridiculous how hard can be something like this, and why Nvidia don’t have a detailed and clear explanation of how to make a flash to the TX2.

I’m just have no idea what to do and a project of mine in delay because of this.

Only the Jetson must have HDMI. I suppose a host using VGA might have an error when figuring out what software it could install to the host, but even that seems unlikely (host side would not be able to auto configure, but is better set up for fallback modes than is a Jetson…Jetson’s must be able to auto configure via the DDC wire). There may still be modes the Jetson does not support from the HDMI TV monitor, but this would be at run time for a logged in user and would not prevent JetPack from flashing.

What could be an issue is that in later releases you must do a first boot login directly to the Jetson to add a user account prior to continuing with additional package installs.

Dual boot is definitely the best way to go for making a flash environment and still being able to run Windows. An Ubuntu VM over Windows will cause problems.

There have also been issues where booting up the Jetson right after the install has resulted in apt doing an automatic update which took so long it was mistaken for a failure (the ssh package install can’t work at the same time as a system update…this is a case where you might have to wait an hour or more for the update to finish before extra packages could be installed).

So the next question is whether the HDMI monitor was connected during the flash, and if you completed the account setup on first boot? Also, is the host Ubuntu on a VM, or just dual boot?

Now since you’ve started a flash via SDK Manager (JetPack), it implies you will have available (on the host) directory:

~/nvidia/nvidia_sdk/JetPack_4.2_Linux_P3310/Linux_for_Tegra/

From that location, if you want the most reliable method to flash (since “Linux_for_Tegra/rootfs/” is already built up), then do this at the command prompt:

sudo ./flash.sh jetson-tx2 mmcblk0p1

You can still add packages later, but make sure to complete the first boot account setup. If this fails, then we have something to debug.

Note: A way to do the same flash and log is:

sudo ./flash.sh jetson-tx2 mmcblk0p1 2>&1 | gawk '{gsub("[0-9][0-9]+[/][0-9[0-9]+ bytes sent..",".");print}' | tee log.txt