# Tensorflow

**URL:** https://forums.developer.nvidia.com/t/tensorflow/178809
**Category:** Jetson Nano
**Tags:** tensorflow
**Created:** [May 24, 2021, 1:35pm UTC](https://forums.developer.nvidia.com/t/tensorflow/178809 "2021-05-24T13:35:47Z")
**Posts on this page:** 7
**Page:** 1

<div class="post-metadata">

### Author: ![ali.yusuf](https://developer.download.nvidia.com/images/forums/profile-default-devtalk-84.png) [@ali.yusuf](https://forums.developer.nvidia.com/u/ali.yusuf)
#### Post date: [May 24, 2021, 1:35pm UTC](https://forums.developer.nvidia.com/t/tensorflow/178809/1 "2021-05-24T13:35:47Z")

</div>

Hi,  
I am new to programming and not quite familiar with ubuntu etc..

I am trying to install Tensorflow according to the following instructions:

> [@Official TensorFlow for Jetson Nano!](https://forums.developer.nvidia.com/t/official-tensorflow-for-jetson-nano/71770):
>
> Our official TensorFlow release for Jetson Nano! Python 3.6+JetPack4.6.3 $ sudo apt-get update $ sudo apt-get install -y python3-pip pkg-config $ sudo apt-get install -y libhdf5-serial-dev hdf5-tools libhdf5-dev zlib1g-dev zip libjpeg8-dev liblapack-dev libblas-dev gfortran $ sudo ln -s /usr/include/locale.h /usr/include/xlocale.h $ sudo pip3 install --verbose 'protobuf\<4' 'Cython\<3' $ sudo wget --no-check-certificate https://developer.download.nvidia.com/compute/redist/jp/v461/tensorflow/tens…

however this fails in several places.

After the following command:

```auto
sudo pip3 install -U numpy grpcio absl-py py-cpuinfo psutil portpicker six mock requests gast h5py astor termcolor protobuf keras-applications keras-preprocessing wrapt google-pasta

```

I get this error message:

#define NPY\_RELAXED\_STRIDES\_CHECKING 1  
#define HAVE\_LDOUBLE\_IEEE\_QUAD\_LE 1  
#define NPY\_PY3K 1  
#ifndef \_\_cplusplus  
/\* #undef inline \*/  
#endif

```
#ifndef _NPY_NPY_CONFIG_H_
#error config.h should never be included directly, include npy_config.h instead
#endif

EOF
  adding 'build/src.linux-aarch64-3.6/numpy/core/include/numpy/config.h' to sources.
Generating build/src.linux-aarch64-3.6/numpy/core/include/numpy/_numpyconfig.h
C compiler: aarch64-linux-gnu-gcc -pthread -DNDEBUG -g -fwrapv -O2 -Wall -g -fstack-protector-strong -Wformat -Werror=format-security -Wdate-time -D_FORTIFY_SOURCE=2 -fPIC

compile options: '-Inumpy/core/src/private -Inumpy/core/src -Inumpy/core -Inumpy/core/src/npymath -Inumpy/core/src/multiarray -Inumpy/core/src/umath -Inumpy/core/src/npysort -I/usr/include/python3.6m -c'
aarch64-linux-gnu-gcc: _configtest.c
_configtest.c:1:5: warning: conflicting types for built-in function ‘exp’ [-Wbuiltin-declaration-mismatch]
 int exp (void);
     ^~~
aarch64-linux-gnu-gcc -pthread _configtest.o -o _configtest
_configtest.o: In Funktion »main«:
/tmp/pip-install-z270b_cp/numpy_21cb614a79104d9aa17cd6c03524ee4a/_configtest.c:6: Warnung: undefinierter Verweis auf »exp«
collect2: error: ld returned 1 exit status
_configtest.o: In Funktion Â»mainÂ«:
/tmp/pip-install-z270b_cp/numpy_21cb614a79104d9aa17cd6c03524ee4a/_configtest.c:6: Warnung: undefinierter Verweis auf Â»expÂ«
collect2: error: ld returned 1 exit status
failure.
removing: _configtest.c _configtest.o
C compiler: aarch64-linux-gnu-gcc -pthread -DNDEBUG -g -fwrapv -O2 -Wall -g -fstack-protector-strong -Wformat -Werror=format-security -Wdate-time -D_FORTIFY_SOURCE=2 -fPIC

compile options: '-Inumpy/core/src/private -Inumpy/core/src -Inumpy/core -Inumpy/core/src/npymath -Inumpy/core/src/multiarray -Inumpy/core/src/umath -Inumpy/core/src/npysort -I/usr/include/python3.6m -c'
aarch64-linux-gnu-gcc: _configtest.c
_configtest.c:1:5: warning: conflicting types for built-in function ‘exp’ [-Wbuiltin-declaration-mismatch]
 int exp (void);
     ^~~
aarch64-linux-gnu-gcc -pthread _configtest.o -lm -o _configtest
success!
removing: _configtest.c _configtest.o _configtest
C compiler: aarch64-linux-gnu-gcc -pthread -DNDEBUG -g -fwrapv -O2 -Wall -g -fstack-protector-strong -Wformat -Werror=format-security -Wdate-time -D_FORTIFY_SOURCE=2 -fPIC

compile options: '-Inumpy/core/src/private -Inumpy/core/src -Inumpy/core -Inumpy/core/src/npymath -Inumpy/core/src/multiarray -Inumpy/core/src/umath -Inumpy/core/src/npysort -I/usr/include/python3.6m -c'
aarch64-linux-gnu-gcc: _configtest.c
success!
removing: _configtest.c _configtest.o
C compiler: aarch64-linux-gnu-gcc -pthread -DNDEBUG -g -fwrapv -O2 -Wall -g -fstack-protector-strong -Wformat -Werror=format-security -Wdate-time -D_FORTIFY_SOURCE=2 -fPIC

compile options: '-Inumpy/core/src/private -Inumpy/core/src -Inumpy/core -Inumpy/core/src/npymath -Inumpy/core/src/multiarray -Inumpy/core/src/umath -Inumpy/core/src/npysort -I/usr/include/python3.6m -c'
aarch64-linux-gnu-gcc: _configtest.c
success!
removing: _configtest.c _configtest.o
File: build/src.linux-aarch64-3.6/numpy/core/include/numpy/_numpyconfig.h
#define NPY_HAVE_ENDIAN_H 1
#define NPY_SIZEOF_SHORT SIZEOF_SHORT
#define NPY_SIZEOF_INT SIZEOF_INT
#define NPY_SIZEOF_LONG SIZEOF_LONG
#define NPY_SIZEOF_FLOAT 4
#define NPY_SIZEOF_COMPLEX_FLOAT 8
#define NPY_SIZEOF_DOUBLE 8
#define NPY_SIZEOF_COMPLEX_DOUBLE 16
#define NPY_SIZEOF_LONGDOUBLE 16
#define NPY_SIZEOF_COMPLEX_LONGDOUBLE 32
#define NPY_SIZEOF_PY_INTPTR_T 8
#define NPY_SIZEOF_OFF_T 8
#define NPY_SIZEOF_PY_LONG_LONG 8
#define NPY_SIZEOF_LONGLONG 8
#define NPY_NO_SMP 0
#define NPY_HAVE_DECL_ISNAN
#define NPY_HAVE_DECL_ISINF
#define NPY_HAVE_DECL_ISFINITE
#define NPY_HAVE_DECL_SIGNBIT
#define NPY_USE_C99_COMPLEX 1
#define NPY_HAVE_COMPLEX_DOUBLE 1
#define NPY_HAVE_COMPLEX_FLOAT 1
#define NPY_HAVE_COMPLEX_LONG_DOUBLE 1
#define NPY_RELAXED_STRIDES_CHECKING 1
#define NPY_USE_C99_FORMATS 1
#define NPY_VISIBILITY_HIDDEN __attribute__ ((visibility("hidden")))
#define NPY_ABI_VERSION 0x01000009
#define NPY_API_VERSION 0x0000000A

#ifndef __STDC_FORMAT_MACROS
#define __STDC_FORMAT_MACROS 1
#endif

EOF
  adding 'build/src.linux-aarch64-3.6/numpy/core/include/numpy/_numpyconfig.h' to sources.
executing numpy/core/code_generators/generate_numpy_api.py
  adding 'build/src.linux-aarch64-3.6/numpy/core/include/numpy/__multiarray_api.h' to sources.
numpy.core - nothing done with h_files = ['build/src.linux-aarch64-3.6/numpy/core/include/numpy/config.h', 'build/src.linux-aarch64-3.6/numpy/core/include/numpy/_numpyconfig.h', 'build/src.linux-aarch64-3.6/numpy/core/include/numpy/__multiarray_api.h']
building extension "numpy.core.multiarray" sources
  adding 'build/src.linux-aarch64-3.6/numpy/core/include/numpy/config.h' to sources.
  adding 'build/src.linux-aarch64-3.6/numpy/core/include/numpy/_numpyconfig.h' to sources.
executing numpy/core/code_generators/generate_numpy_api.py
  adding 'build/src.linux-aarch64-3.6/numpy/core/include/numpy/__multiarray_api.h' to sources.
creating build/src.linux-aarch64-3.6/numpy/core/src/multiarray
conv_template:> build/src.linux-aarch64-3.6/numpy/core/src/multiarray/arraytypes.c
conv_template:> build/src.linux-aarch64-3.6/numpy/core/src/multiarray/einsum.c
conv_template:> build/src.linux-aarch64-3.6/numpy/core/src/multiarray/lowlevel_strided_loops.c
conv_template:> build/src.linux-aarch64-3.6/numpy/core/src/multiarray/nditer_templ.c
conv_template:> build/src.linux-aarch64-3.6/numpy/core/src/multiarray/scalartypes.c
conv_template:> build/src.linux-aarch64-3.6/numpy/core/src/private/templ_common.h
  adding 'build/src.linux-aarch64-3.6/numpy/core/src/private' to include_dirs.
numpy.core - nothing done with h_files = ['build/src.linux-aarch64-3.6/numpy/core/src/private/templ_common.h', 'build/src.linux-aarch64-3.6/numpy/core/include/numpy/config.h', 'build/src.linux-aarch64-3.6/numpy/core/include/numpy/_numpyconfig.h', 'build/src.linux-aarch64-3.6/numpy/core/include/numpy/__multiarray_api.h']
building extension "numpy.core.umath" sources
  adding 'build/src.linux-aarch64-3.6/numpy/core/include/numpy/config.h' to sources.
  adding 'build/src.linux-aarch64-3.6/numpy/core/include/numpy/_numpyconfig.h' to sources.
executing numpy/core/code_generators/generate_ufunc_api.py
  adding 'build/src.linux-aarch64-3.6/numpy/core/include/numpy/__ufunc_api.h' to sources.
creating build/src.linux-aarch64-3.6/numpy/core/src/umath
conv_template:> build/src.linux-aarch64-3.6/numpy/core/src/umath/funcs.inc
  adding 'build/src.linux-aarch64-3.6/numpy/core/src/umath' to include_dirs.
conv_template:> build/src.linux-aarch64-3.6/numpy/core/src/umath/simd.inc
conv_template:> build/src.linux-aarch64-3.6/numpy/core/src/umath/loops.h
conv_template:> build/src.linux-aarch64-3.6/numpy/core/src/umath/loops.c
conv_template:> build/src.linux-aarch64-3.6/numpy/core/src/umath/scalarmath.c
numpy.core - nothing done with h_files = ['build/src.linux-aarch64-3.6/numpy/core/src/umath/funcs.inc', 'build/src.linux-aarch64-3.6/numpy/core/src/umath/simd.inc', 'build/src.linux-aarch64-3.6/numpy/core/src/umath/loops.h', 'build/src.linux-aarch64-3.6/numpy/core/include/numpy/config.h', 'build/src.linux-aarch64-3.6/numpy/core/include/numpy/_numpyconfig.h', 'build/src.linux-aarch64-3.6/numpy/core/include/numpy/__ufunc_api.h']
building extension "numpy.core.umath_tests" sources
conv_template:> build/src.linux-aarch64-3.6/numpy/core/src/umath/umath_tests.c
building extension "numpy.core.test_rational" sources
conv_template:> build/src.linux-aarch64-3.6/numpy/core/src/umath/test_rational.c
building extension "numpy.core.struct_ufunc_test" sources
conv_template:> build/src.linux-aarch64-3.6/numpy/core/src/umath/struct_ufunc_test.c
building extension "numpy.core.multiarray_tests" sources
conv_template:> build/src.linux-aarch64-3.6/numpy/core/src/multiarray/multiarray_tests.c
building extension "numpy.core.operand_flag_tests" sources
conv_template:> build/src.linux-aarch64-3.6/numpy/core/src/umath/operand_flag_tests.c
building extension "numpy.fft.fftpack_lite" sources
building extension "numpy.linalg.lapack_lite" sources
creating build/src.linux-aarch64-3.6/numpy/linalg
  adding 'numpy/linalg/lapack_lite/python_xerbla.c' to sources.
building extension "numpy.linalg._umath_linalg" sources
  adding 'numpy/linalg/lapack_lite/python_xerbla.c' to sources.
conv_template:> build/src.linux-aarch64-3.6/numpy/linalg/umath_linalg.c
building extension "numpy.random.mtrand" sources
creating build/src.linux-aarch64-3.6/numpy/random
building data_files sources
build_src: building npy-pkg config files
running build_py
creating build/lib.linux-aarch64-3.6
creating build/lib.linux-aarch64-3.6/numpy
copying numpy/add_newdocs.py -> build/lib.linux-aarch64-3.6/numpy
copying numpy/_import_tools.py -> build/lib.linux-aarch64-3.6/numpy
copying numpy/matlib.py -> build/lib.linux-aarch64-3.6/numpy
copying numpy/dual.py -> build/lib.linux-aarch64-3.6/numpy
copying numpy/ctypeslib.py -> build/lib.linux-aarch64-3.6/numpy
copying numpy/_distributor_init.py -> build/lib.linux-aarch64-3.6/numpy
copying numpy/ __init__.py -> build/lib.linux-aarch64-3.6/numpy
copying numpy/_globals.py -> build/lib.linux-aarch64-3.6/numpy
copying numpy/setup.py -> build/lib.linux-aarch64-3.6/numpy
copying numpy/version.py -> build/lib.linux-aarch64-3.6/numpy
copying build/src.linux-aarch64-3.6/numpy/ __config__.py -> build/lib.linux-aarch64-3.6/numpy
creating build/lib.linux-aarch64-3.6/numpy/compat
copying numpy/compat/py3k.py -> build/lib.linux-aarch64-3.6/numpy/compat
copying numpy/compat/_inspect.py -> build/lib.linux-aarch64-3.6/numpy/compat
copying numpy/compat/ __init__.py -> build/lib.linux-aarch64-3.6/numpy/compat
copying numpy/compat/setup.py -> build/lib.linux-aarch64-3.6/numpy/compat
creating build/lib.linux-aarch64-3.6/numpy/core
copying numpy/core/setup_common.py -> build/lib.linux-aarch64-3.6/numpy/core
copying numpy/core/shape_base.py -> build/lib.linux-aarch64-3.6/numpy/core
copying numpy/core/fromnumeric.py -> build/lib.linux-aarch64-3.6/numpy/core
copying numpy/core/defchararray.py -> build/lib.linux-aarch64-3.6/numpy/core
copying numpy/core/numerictypes.py -> build/lib.linux-aarch64-3.6/numpy/core
copying numpy/core/arrayprint.py -> build/lib.linux-aarch64-3.6/numpy/core
copying numpy/core/function_base.py -> build/lib.linux-aarch64-3.6/numpy/core
copying numpy/core/getlimits.py -> build/lib.linux-aarch64-3.6/numpy/core
copying numpy/core/einsumfunc.py -> build/lib.linux-aarch64-3.6/numpy/core
copying numpy/core/machar.py -> build/lib.linux-aarch64-3.6/numpy/core
copying numpy/core/info.py -> build/lib.linux-aarch64-3.6/numpy/core
copying numpy/core/_internal.py -> build/lib.linux-aarch64-3.6/numpy/core
copying numpy/core/ __init__.py -> build/lib.linux-aarch64-3.6/numpy/core
copying numpy/core/_methods.py -> build/lib.linux-aarch64-3.6/numpy/core
copying numpy/core/numeric.py -> build/lib.linux-aarch64-3.6/numpy/core
copying numpy/core/setup.py -> build/lib.linux-aarch64-3.6/numpy/core
copying numpy/core/memmap.py -> build/lib.linux-aarch64-3.6/numpy/core
copying numpy/core/cversions.py -> build/lib.linux-aarch64-3.6/numpy/core
copying numpy/core/records.py -> build/lib.linux-aarch64-3.6/numpy/core
copying numpy/core/code_generators/generate_numpy_api.py -> build/lib.linux-aarch64-3.6/numpy/core
creating build/lib.linux-aarch64-3.6/numpy/distutils
copying numpy/distutils/lib2def.py -> build/lib.linux-aarch64-3.6/numpy/distutils
copying numpy/distutils/msvc9compiler.py -> build/lib.linux-aarch64-3.6/numpy/distutils
copying numpy/distutils/npy_pkg_config.py -> build/lib.linux-aarch64-3.6/numpy/distutils
copying numpy/distutils/ __version__.py -> build/lib.linux-aarch64-3.6/numpy/distutils
copying numpy/distutils/from_template.py -> build/lib.linux-aarch64-3.6/numpy/distutils
copying numpy/distutils/core.py -> build/lib.linux-aarch64-3.6/numpy/distutils
copying numpy/distutils/mingw32ccompiler.py -> build/lib.linux-aarch64-3.6/numpy/distutils
copying numpy/distutils/environment.py -> build/lib.linux-aarch64-3.6/numpy/distutils
copying numpy/distutils/ccompiler.py -> build/lib.linux-aarch64-3.6/numpy/distutils
copying numpy/distutils/misc_util.py -> build/lib.linux-aarch64-3.6/numpy/distutils
copying numpy/distutils/conv_template.py -> build/lib.linux-aarch64-3.6/numpy/distutils
copying numpy/distutils/pathccompiler.py -> build/lib.linux-aarch64-3.6/numpy/distutils
copying numpy/distutils/cpuinfo.py -> build/lib.linux-aarch64-3.6/numpy/distutils
copying numpy/distutils/compat.py -> build/lib.linux-aarch64-3.6/numpy/distutils
copying numpy/distutils/unixccompiler.py -> build/lib.linux-aarch64-3.6/numpy/distutils
copying numpy/distutils/system_info.py -> build/lib.linux-aarch64-3.6/numpy/distutils
copying numpy/distutils/extension.py -> build/lib.linux-aarch64-3.6/numpy/distutils
copying numpy/distutils/info.py -> build/lib.linux-aarch64-3.6/numpy/distutils
copying numpy/distutils/line_endings.py -> build/lib.linux-aarch64-3.6/numpy/distutils
copying numpy/distutils/numpy_distribution.py -> build/lib.linux-aarch64-3.6/numpy/distutils
copying numpy/distutils/ __init__.py -> build/lib.linux-aarch64-3.6/numpy/distutils
copying numpy/distutils/msvccompiler.py -> build/lib.linux-aarch64-3.6/numpy/distutils
copying numpy/distutils/log.py -> build/lib.linux-aarch64-3.6/numpy/distutils
copying numpy/distutils/setup.py -> build/lib.linux-aarch64-3.6/numpy/distutils
copying numpy/distutils/exec_command.py -> build/lib.linux-aarch64-3.6/numpy/distutils
copying numpy/distutils/intelccompiler.py -> build/lib.linux-aarch64-3.6/numpy/distutils
copying build/src.linux-aarch64-3.6/numpy/distutils/ __config__.py -> build/lib.linux-aarch64-3.6/numpy/distutils
creating build/lib.linux-aarch64-3.6/numpy/distutils/command
copying numpy/distutils/command/build_py.py -> build/lib.linux-aarch64-3.6/numpy/distutils/command
copying numpy/distutils/command/bdist_rpm.py -> build/lib.linux-aarch64-3.6/numpy/distutils/command
copying numpy/distutils/command/sdist.py -> build/lib.linux-aarch64-3.6/numpy/distutils/command
copying numpy/distutils/command/build_src.py -> build/lib.linux-aarch64-3.6/numpy/distutils/command
copying numpy/distutils/command/install.py -> build/lib.linux-aarch64-3.6/numpy/distutils/command
copying numpy/distutils/command/install_headers.py -> build/lib.linux-aarch64-3.6/numpy/distutils/command
copying numpy/distutils/command/build_clib.py -> build/lib.linux-aarch64-3.6/numpy/distutils/command
copying numpy/distutils/command/build_scripts.py -> build/lib.linux-aarch64-3.6/numpy/distutils/command
copying numpy/distutils/command/egg_info.py -> build/lib.linux-aarch64-3.6/numpy/distutils/command
copying numpy/distutils/command/config_compiler.py -> build/lib.linux-aarch64-3.6/numpy/distutils/command
copying numpy/distutils/command/develop.py -> build/lib.linux-aarch64-3.6/numpy/distutils/command
copying numpy/distutils/command/install_clib.py -> build/lib.linux-aarch64-3.6/numpy/distutils/command
copying numpy/distutils/command/install_data.py -> build/lib.linux-aarch64-3.6/numpy/distutils/command
copying numpy/distutils/command/ __init__.py -> build/lib.linux-aarch64-3.6/numpy/distutils/command
copying numpy/distutils/command/build.py -> build/lib.linux-aarch64-3.6/numpy/distutils/command
copying numpy/distutils/command/build_ext.py -> build/lib.linux-aarch64-3.6/numpy/distutils/command
copying numpy/distutils/command/config.py -> build/lib.linux-aarch64-3.6/numpy/distutils/command
copying numpy/distutils/command/autodist.py -> build/lib.linux-aarch64-3.6/numpy/distutils/command
creating build/lib.linux-aarch64-3.6/numpy/distutils/fcompiler
copying numpy/distutils/fcompiler/mips.py -> build/lib.linux-aarch64-3.6/numpy/distutils/fcompiler
copying numpy/distutils/fcompiler/pathf95.py -> build/lib.linux-aarch64-3.6/numpy/distutils/fcompiler
copying numpy/distutils/fcompiler/ibm.py -> build/lib.linux-aarch64-3.6/numpy/distutils/fcompiler
copying numpy/distutils/fcompiler/vast.py -> build/lib.linux-aarch64-3.6/numpy/distutils/fcompiler
copying numpy/distutils/fcompiler/compaq.py -> build/lib.linux-aarch64-3.6/numpy/distutils/fcompiler
copying numpy/distutils/fcompiler/absoft.py -> build/lib.linux-aarch64-3.6/numpy/distutils/fcompiler
copying numpy/distutils/fcompiler/pg.py -> build/lib.linux-aarch64-3.6/numpy/distutils/fcompiler
copying numpy/distutils/fcompiler/sun.py -> build/lib.linux-aarch64-3.6/numpy/distutils/fcompiler
copying numpy/distutils/fcompiler/intel.py -> build/lib.linux-aarch64-3.6/numpy/distutils/fcompiler
copying numpy/distutils/fcompiler/hpux.py -> build/lib.linux-aarch64-3.6/numpy/distutils/fcompiler
copying numpy/distutils/fcompiler/none.py -> build/lib.linux-aarch64-3.6/numpy/distutils/fcompiler
copying numpy/distutils/fcompiler/g95.py -> build/lib.linux-aarch64-3.6/numpy/distutils/fcompiler
copying numpy/distutils/fcompiler/ __init__.py -> build/lib.linux-aarch64-3.6/numpy/distutils/fcompiler
copying numpy/distutils/fcompiler/lahey.py -> build/lib.linux-aarch64-3.6/numpy/distutils/fcompiler
copying numpy/distutils/fcompiler/nag.py -> build/lib.linux-aarch64-3.6/numpy/distutils/fcompiler
copying numpy/distutils/fcompiler/gnu.py -> build/lib.linux-aarch64-3.6/numpy/distutils/fcompiler
creating build/lib.linux-aarch64-3.6/numpy/doc
copying numpy/doc/constants.py -> build/lib.linux-aarch64-3.6/numpy/doc
copying numpy/doc/misc.py -> build/lib.linux-aarch64-3.6/numpy/doc
copying numpy/doc/creation.py -> build/lib.linux-aarch64-3.6/numpy/doc
copying numpy/doc/internals.py -> build/lib.linux-aarch64-3.6/numpy/doc
copying numpy/doc/broadcasting.py -> build/lib.linux-aarch64-3.6/numpy/doc
copying numpy/doc/indexing.py -> build/lib.linux-aarch64-3.6/numpy/doc
copying numpy/doc/basics.py -> build/lib.linux-aarch64-3.6/numpy/doc
copying numpy/doc/ufuncs.py -> build/lib.linux-aarch64-3.6/numpy/doc
copying numpy/doc/structured_arrays.py -> build/lib.linux-aarch64-3.6/numpy/doc
copying numpy/doc/glossary.py -> build/lib.linux-aarch64-3.6/numpy/doc
copying numpy/doc/ __init__.py -> build/lib.linux-aarch64-3.6/numpy/doc
copying numpy/doc/byteswapping.py -> build/lib.linux-aarch64-3.6/numpy/doc
copying numpy/doc/subclassing.py -> build/lib.linux-aarch64-3.6/numpy/doc
creating build/lib.linux-aarch64-3.6/numpy/f2py
copying numpy/f2py/ __version__.py -> build/lib.linux-aarch64-3.6/numpy/f2py
copying numpy/f2py/auxfuncs.py -> build/lib.linux-aarch64-3.6/numpy/f2py
copying numpy/f2py/rules.py -> build/lib.linux-aarch64-3.6/numpy/f2py
copying numpy/f2py/capi_maps.py -> build/lib.linux-aarch64-3.6/numpy/f2py
copying numpy/f2py/ __main__.py -> build/lib.linux-aarch64-3.6/numpy/f2py
copying numpy/f2py/f90mod_rules.py -> build/lib.linux-aarch64-3.6/numpy/f2py
copying numpy/f2py/crackfortran.py -> build/lib.linux-aarch64-3.6/numpy/f2py
copying numpy/f2py/func2subr.py -> build/lib.linux-aarch64-3.6/numpy/f2py
copying numpy/f2py/cb_rules.py -> build/lib.linux-aarch64-3.6/numpy/f2py
copying numpy/f2py/diagnose.py -> build/lib.linux-aarch64-3.6/numpy/f2py
copying numpy/f2py/f2py_testing.py -> build/lib.linux-aarch64-3.6/numpy/f2py
copying numpy/f2py/common_rules.py -> build/lib.linux-aarch64-3.6/numpy/f2py
copying numpy/f2py/info.py -> build/lib.linux-aarch64-3.6/numpy/f2py
copying numpy/f2py/ __init__.py -> build/lib.linux-aarch64-3.6/numpy/f2py
copying numpy/f2py/f2py2e.py -> build/lib.linux-aarch64-3.6/numpy/f2py
copying numpy/f2py/use_rules.py -> build/lib.linux-aarch64-3.6/numpy/f2py
copying numpy/f2py/setup.py -> build/lib.linux-aarch64-3.6/numpy/f2py
copying numpy/f2py/cfuncs.py -> build/lib.linux-aarch64-3.6/numpy/f2py
creating build/lib.linux-aarch64-3.6/numpy/fft
copying numpy/fft/fftpack.py -> build/lib.linux-aarch64-3.6/numpy/fft
copying numpy/fft/info.py -> build/lib.linux-aarch64-3.6/numpy/fft
copying numpy/fft/ __init__.py -> build/lib.linux-aarch64-3.6/numpy/fft
copying numpy/fft/setup.py -> build/lib.linux-aarch64-3.6/numpy/fft
copying numpy/fft/helper.py -> build/lib.linux-aarch64-3.6/numpy/fft
creating build/lib.linux-aarch64-3.6/numpy/lib
copying numpy/lib/scimath.py -> build/lib.linux-aarch64-3.6/numpy/lib
copying numpy/lib/nanfunctions.py -> build/lib.linux-aarch64-3.6/numpy/lib
copying numpy/lib/shape_base.py -> build/lib.linux-aarch64-3.6/numpy/lib
copying numpy/lib/_version.py -> build/lib.linux-aarch64-3.6/numpy/lib
copying numpy/lib/arraypad.py -> build/lib.linux-aarch64-3.6/numpy/lib
copying numpy/lib/format.py -> build/lib.linux-aarch64-3.6/numpy/lib
copying numpy/lib/polynomial.py -> build/lib.linux-aarch64-3.6/numpy/lib
copying numpy/lib/arraysetops.py -> build/lib.linux-aarch64-3.6/numpy/lib
copying numpy/lib/twodim_base.py -> build/lib.linux-aarch64-3.6/numpy/lib
copying numpy/lib/ufunclike.py -> build/lib.linux-aarch64-3.6/numpy/lib
copying numpy/lib/utils.py -> build/lib.linux-aarch64-3.6/numpy/lib
copying numpy/lib/function_base.py -> build/lib.linux-aarch64-3.6/numpy/lib
copying numpy/lib/stride_tricks.py -> build/lib.linux-aarch64-3.6/numpy/lib
copying numpy/lib/index_tricks.py -> build/lib.linux-aarch64-3.6/numpy/lib
copying numpy/lib/type_check.py -> build/lib.linux-aarch64-3.6/numpy/lib
copying numpy/lib/arrayterator.py -> build/lib.linux-aarch64-3.6/numpy/lib
copying numpy/lib/info.py -> build/lib.linux-aarch64-3.6/numpy/lib
copying numpy/lib/financial.py -> build/lib.linux-aarch64-3.6/numpy/lib
copying numpy/lib/_iotools.py -> build/lib.linux-aarch64-3.6/numpy/lib
copying numpy/lib/ __init__.py -> build/lib.linux-aarch64-3.6/numpy/lib
copying numpy/lib/recfunctions.py -> build/lib.linux-aarch64-3.6/numpy/lib
copying numpy/lib/user_array.py -> build/lib.linux-aarch64-3.6/numpy/lib
copying numpy/lib/setup.py -> build/lib.linux-aarch64-3.6/numpy/lib
copying numpy/lib/_datasource.py -> build/lib.linux-aarch64-3.6/numpy/lib
copying numpy/lib/npyio.py -> build/lib.linux-aarch64-3.6/numpy/lib
creating build/lib.linux-aarch64-3.6/numpy/linalg
copying numpy/linalg/info.py -> build/lib.linux-aarch64-3.6/numpy/linalg
copying numpy/linalg/linalg.py -> build/lib.linux-aarch64-3.6/numpy/linalg
copying numpy/linalg/ __init__.py -> build/lib.linux-aarch64-3.6/numpy/linalg
copying numpy/linalg/setup.py -> build/lib.linux-aarch64-3.6/numpy/linalg
creating build/lib.linux-aarch64-3.6/numpy/ma
copying numpy/ma/core.py -> build/lib.linux-aarch64-3.6/numpy/ma
copying numpy/ma/timer_comparison.py -> build/lib.linux-aarch64-3.6/numpy/ma
copying numpy/ma/bench.py -> build/lib.linux-aarch64-3.6/numpy/ma
copying numpy/ma/mrecords.py -> build/lib.linux-aarch64-3.6/numpy/ma
copying numpy/ma/testutils.py -> build/lib.linux-aarch64-3.6/numpy/ma
copying numpy/ma/extras.py -> build/lib.linux-aarch64-3.6/numpy/ma
copying numpy/ma/ __init__.py -> build/lib.linux-aarch64-3.6/numpy/ma
copying numpy/ma/setup.py -> build/lib.linux-aarch64-3.6/numpy/ma
copying numpy/ma/version.py -> build/lib.linux-aarch64-3.6/numpy/ma
creating build/lib.linux-aarch64-3.6/numpy/matrixlib
copying numpy/matrixlib/defmatrix.py -> build/lib.linux-aarch64-3.6/numpy/matrixlib
copying numpy/matrixlib/ __init__.py -> build/lib.linux-aarch64-3.6/numpy/matrixlib
copying numpy/matrixlib/setup.py -> build/lib.linux-aarch64-3.6/numpy/matrixlib
creating build/lib.linux-aarch64-3.6/numpy/polynomial
copying numpy/polynomial/legendre.py -> build/lib.linux-aarch64-3.6/numpy/polynomial
copying numpy/polynomial/chebyshev.py -> build/lib.linux-aarch64-3.6/numpy/polynomial
copying numpy/polynomial/laguerre.py -> build/lib.linux-aarch64-3.6/numpy/polynomial
copying numpy/polynomial/hermite.py -> build/lib.linux-aarch64-3.6/numpy/polynomial
copying numpy/polynomial/polynomial.py -> build/lib.linux-aarch64-3.6/numpy/polynomial
copying numpy/polynomial/ __init__.py -> build/lib.linux-aarch64-3.6/numpy/polynomial
copying numpy/polynomial/_polybase.py -> build/lib.linux-aarch64-3.6/numpy/polynomial
copying numpy/polynomial/polyutils.py -> build/lib.linux-aarch64-3.6/numpy/polynomial
copying numpy/polynomial/setup.py -> build/lib.linux-aarch64-3.6/numpy/polynomial
copying numpy/polynomial/hermite_e.py -> build/lib.linux-aarch64-3.6/numpy/polynomial
creating build/lib.linux-aarch64-3.6/numpy/random
copying numpy/random/info.py -> build/lib.linux-aarch64-3.6/numpy/random
copying numpy/random/ __init__.py -> build/lib.linux-aarch64-3.6/numpy/random
copying numpy/random/setup.py -> build/lib.linux-aarch64-3.6/numpy/random
creating build/lib.linux-aarch64-3.6/numpy/testing
copying numpy/testing/decorators.py -> build/lib.linux-aarch64-3.6/numpy/testing
copying numpy/testing/nosetester.py -> build/lib.linux-aarch64-3.6/numpy/testing
copying numpy/testing/utils.py -> build/lib.linux-aarch64-3.6/numpy/testing
copying numpy/testing/print_coercion_tables.py -> build/lib.linux-aarch64-3.6/numpy/testing
copying numpy/testing/ __init__.py -> build/lib.linux-aarch64-3.6/numpy/testing
copying numpy/testing/noseclasses.py -> build/lib.linux-aarch64-3.6/numpy/testing
copying numpy/testing/setup.py -> build/lib.linux-aarch64-3.6/numpy/testing
running build_clib
customize UnixCCompiler
customize UnixCCompiler using build_clib
building 'npymath' library
compiling C sources
C compiler: aarch64-linux-gnu-gcc -pthread -DNDEBUG -g -fwrapv -O2 -Wall -g -fstack-protector-strong -Wformat -Werror=format-security -Wdate-time -D_FORTIFY_SOURCE=2 -fPIC

creating build/temp.linux-aarch64-3.6
creating build/temp.linux-aarch64-3.6/build
creating build/temp.linux-aarch64-3.6/build/src.linux-aarch64-3.6
creating build/temp.linux-aarch64-3.6/build/src.linux-aarch64-3.6/numpy
creating build/temp.linux-aarch64-3.6/build/src.linux-aarch64-3.6/numpy/core
creating build/temp.linux-aarch64-3.6/build/src.linux-aarch64-3.6/numpy/core/src
creating build/temp.linux-aarch64-3.6/build/src.linux-aarch64-3.6/numpy/core/src/npymath
creating build/temp.linux-aarch64-3.6/numpy
creating build/temp.linux-aarch64-3.6/numpy/core
creating build/temp.linux-aarch64-3.6/numpy/core/src
creating build/temp.linux-aarch64-3.6/numpy/core/src/npymath
compile options: '-Inumpy/core/include -Ibuild/src.linux-aarch64-3.6/numpy/core/include/numpy -Inumpy/core/src/private -Inumpy/core/src -Inumpy/core -Inumpy/core/src/npymath -Inumpy/core/src/multiarray -Inumpy/core/src/umath -Inumpy/core/src/npysort -I/usr/include/python3.6m -Ibuild/src.linux-aarch64-3.6/numpy/core/src/private -Ibuild/src.linux-aarch64-3.6/numpy/core/src/private -Ibuild/src.linux-aarch64-3.6/numpy/core/src/private -c'
aarch64-linux-gnu-gcc: build/src.linux-aarch64-3.6/numpy/core/src/npymath/npy_math.c
aarch64-linux-gnu-gcc: build/src.linux-aarch64-3.6/numpy/core/src/npymath/ieee754.c
aarch64-linux-gnu-gcc: build/src.linux-aarch64-3.6/numpy/core/src/npymath/npy_math_complex.c
aarch64-linux-gnu-gcc: numpy/core/src/npymath/halffloat.c
aarch64-linux-gnu-gcc-ar: adding 4 object files to build/temp.linux-aarch64-3.6/libnpymath.a
building 'npysort' library
compiling C sources
C compiler: aarch64-linux-gnu-gcc -pthread -DNDEBUG -g -fwrapv -O2 -Wall -g -fstack-protector-strong -Wformat -Werror=format-security -Wdate-time -D_FORTIFY_SOURCE=2 -fPIC

creating build/temp.linux-aarch64-3.6/build/src.linux-aarch64-3.6/numpy/core/src/npysort
compile options: '-Ibuild/src.linux-aarch64-3.6/numpy/core/src/private -Inumpy/core/include -Ibuild/src.linux-aarch64-3.6/numpy/core/include/numpy -Inumpy/core/src/private -Inumpy/core/src -Inumpy/core -Inumpy/core/src/npymath -Inumpy/core/src/multiarray -Inumpy/core/src/umath -Inumpy/core/src/npysort -I/usr/include/python3.6m -Ibuild/src.linux-aarch64-3.6/numpy/core/src/private -Ibuild/src.linux-aarch64-3.6/numpy/core/src/private -Ibuild/src.linux-aarch64-3.6/numpy/core/src/private -c'
aarch64-linux-gnu-gcc: build/src.linux-aarch64-3.6/numpy/core/src/npysort/quicksort.c
aarch64-linux-gnu-gcc: build/src.linux-aarch64-3.6/numpy/core/src/npysort/mergesort.c
aarch64-linux-gnu-gcc: build/src.linux-aarch64-3.6/numpy/core/src/npysort/heapsort.c
aarch64-linux-gnu-gcc: build/src.linux-aarch64-3.6/numpy/core/src/npysort/selection.c
aarch64-linux-gnu-gcc: build/src.linux-aarch64-3.6/numpy/core/src/npysort/binsearch.c
aarch64-linux-gnu-gcc-ar: adding 5 object files to build/temp.linux-aarch64-3.6/libnpysort.a
running build_ext
customize UnixCCompiler
customize UnixCCompiler using build_ext
building 'numpy.core._dummy' extension
compiling C sources
C compiler: aarch64-linux-gnu-gcc -pthread -DNDEBUG -g -fwrapv -O2 -Wall -g -fstack-protector-strong -Wformat -Werror=format-security -Wdate-time -D_FORTIFY_SOURCE=2 -fPIC

compile options: '-DHAVE_NPY_CONFIG_H=1 -D_FILE_OFFSET_BITS=64 -D_LARGEFILE_SOURCE=1 -D_LARGEFILE64_SOURCE=1 -Inumpy/core/include -Ibuild/src.linux-aarch64-3.6/numpy/core/include/numpy -Inumpy/core/src/private -Inumpy/core/src -Inumpy/core -Inumpy/core/src/npymath -Inumpy/core/src/multiarray -Inumpy/core/src/umath -Inumpy/core/src/npysort -I/usr/include/python3.6m -Ibuild/src.linux-aarch64-3.6/numpy/core/src/private -Ibuild/src.linux-aarch64-3.6/numpy/core/src/private -Ibuild/src.linux-aarch64-3.6/numpy/core/src/private -c'
aarch64-linux-gnu-gcc: numpy/core/src/dummymodule.c
aarch64-linux-gnu-gcc -pthread -shared -Wl,-O1 -Wl,-Bsymbolic-functions -Wl,-Bsymbolic-functions -Wl,-z,relro -Wl,-Bsymbolic-functions -Wl,-z,relro -g -fstack-protector-strong -Wformat -Werror=format-security -Wdate-time -D_FORTIFY_SOURCE=2 build/temp.linux-aarch64-3.6/numpy/core/src/dummymodule.o -Lbuild/temp.linux-aarch64-3.6 -lm -o build/lib.linux-aarch64-3.6/numpy/core/_dummy.cpython-36m-aarch64-linux-gnu.so
building 'numpy.core.multiarray' extension
compiling C sources
C compiler: aarch64-linux-gnu-gcc -pthread -DNDEBUG -g -fwrapv -O2 -Wall -g -fstack-protector-strong -Wformat -Werror=format-security -Wdate-time -D_FORTIFY_SOURCE=2 -fPIC

creating build/temp.linux-aarch64-3.6/numpy/core/src/multiarray
creating build/temp.linux-aarch64-3.6/build/src.linux-aarch64-3.6/numpy/core/src/multiarray
creating build/temp.linux-aarch64-3.6/numpy/core/src/private
compile options: '-DHAVE_NPY_CONFIG_H=1 -D_FILE_OFFSET_BITS=64 -D_LARGEFILE_SOURCE=1 -D_LARGEFILE64_SOURCE=1 -DNO_ATLAS_INFO=1 -DHAVE_CBLAS -Ibuild/src.linux-aarch64-3.6/numpy/core/src/private -Inumpy/core/include -Ibuild/src.linux-aarch64-3.6/numpy/core/include/numpy -Inumpy/core/src/private -Inumpy/core/src -Inumpy/core -Inumpy/core/src/npymath -Inumpy/core/src/multiarray -Inumpy/core/src/umath -Inumpy/core/src/npysort -I/usr/include/python3.6m -Ibuild/src.linux-aarch64-3.6/numpy/core/src/private -Ibuild/src.linux-aarch64-3.6/numpy/core/src/private -Ibuild/src.linux-aarch64-3.6/numpy/core/src/private -c'
aarch64-linux-gnu-gcc: numpy/core/src/multiarray/alloc.c
aarch64-linux-gnu-gcc: numpy/core/src/multiarray/arrayobject.c
aarch64-linux-gnu-gcc: build/src.linux-aarch64-3.6/numpy/core/src/multiarray/arraytypes.c
aarch64-linux-gnu-gcc: numpy/core/src/multiarray/array_assign.c
aarch64-linux-gnu-gcc: numpy/core/src/multiarray/array_assign_scalar.c
aarch64-linux-gnu-gcc: numpy/core/src/multiarray/array_assign_array.c
aarch64-linux-gnu-gcc: numpy/core/src/multiarray/buffer.c
aarch64-linux-gnu-gcc: numpy/core/src/multiarray/calculation.c
aarch64-linux-gnu-gcc: numpy/core/src/multiarray/compiled_base.c
aarch64-linux-gnu-gcc: numpy/core/src/multiarray/common.c
aarch64-linux-gnu-gcc: numpy/core/src/multiarray/convert.c
aarch64-linux-gnu-gcc: numpy/core/src/multiarray/convert_datatype.c
aarch64-linux-gnu-gcc: numpy/core/src/multiarray/conversion_utils.c
aarch64-linux-gnu-gcc: numpy/core/src/multiarray/ctors.c
aarch64-linux-gnu-gcc: numpy/core/src/multiarray/datetime.c
aarch64-linux-gnu-gcc: numpy/core/src/multiarray/datetime_strings.c
aarch64-linux-gnu-gcc: numpy/core/src/multiarray/datetime_busday.c
aarch64-linux-gnu-gcc: numpy/core/src/multiarray/datetime_busdaycal.c
aarch64-linux-gnu-gcc: numpy/core/src/multiarray/descriptor.c
aarch64-linux-gnu-gcc: numpy/core/src/multiarray/dtype_transfer.c
aarch64-linux-gnu-gcc: build/src.linux-aarch64-3.6/numpy/core/src/multiarray/einsum.c
aarch64-linux-gnu-gcc: numpy/core/src/multiarray/flagsobject.c
aarch64-linux-gnu-gcc: numpy/core/src/multiarray/getset.c
aarch64-linux-gnu-gcc: numpy/core/src/multiarray/hashdescr.c
aarch64-linux-gnu-gcc: numpy/core/src/multiarray/item_selection.c
aarch64-linux-gnu-gcc: numpy/core/src/multiarray/iterators.c
aarch64-linux-gnu-gcc: build/src.linux-aarch64-3.6/numpy/core/src/multiarray/lowlevel_strided_loops.c
aarch64-linux-gnu-gcc: numpy/core/src/multiarray/mapping.c
aarch64-linux-gnu-gcc: numpy/core/src/multiarray/methods.c
aarch64-linux-gnu-gcc: numpy/core/src/multiarray/multiarraymodule.c
aarch64-linux-gnu-gcc: build/src.linux-aarch64-3.6/numpy/core/src/multiarray/nditer_templ.c
aarch64-linux-gnu-gcc: numpy/core/src/multiarray/nditer_api.c
aarch64-linux-gnu-gcc: numpy/core/src/multiarray/nditer_constr.c
aarch64-linux-gnu-gcc: numpy/core/src/multiarray/nditer_pywrap.c
aarch64-linux-gnu-gcc: numpy/core/src/multiarray/number.c
aarch64-linux-gnu-gcc: numpy/core/src/multiarray/numpymemoryview.c
aarch64-linux-gnu-gcc: numpy/core/src/multiarray/numpyos.c
numpy/core/src/multiarray/numpyos.c:18:10: fatal error: xlocale.h: Datei oder Verzeichnis nicht gefunden
 #include <xlocale.h>
          ^ ~~~~~~~~~~
compilation terminated.
numpy/core/src/multiarray/numpyos.c:18:10: fatal error: xlocale.h: Datei oder Verzeichnis nicht gefunden
 #include <xlocale.h>
          ^ ~~~~~~~~~~
compilation terminated.
error: Command "aarch64-linux-gnu-gcc -pthread -DNDEBUG -g -fwrapv -O2 -Wall -g -fstack-protector-strong -Wformat -Werror=format-security -Wdate-time -D_FORTIFY_SOURCE=2 -fPIC -DHAVE_NPY_CONFIG_H=1 -D_FILE_OFFSET_BITS=64 -D_LARGEFILE_SOURCE=1 -D_LARGEFILE64_SOURCE=1 -DNO_ATLAS_INFO=1 -DHAVE_CBLAS -Ibuild/src.linux-aarch64-3.6/numpy/core/src/private -Inumpy/core/include -Ibuild/src.linux-aarch64-3.6/numpy/core/include/numpy -Inumpy/core/src/private -Inumpy/core/src -Inumpy/core -Inumpy/core/src/npymath -Inumpy/core/src/multiarray -Inumpy/core/src/umath -Inumpy/core/src/npysort -I/usr/include/python3.6m -Ibuild/src.linux-aarch64-3.6/numpy/core/src/private -Ibuild/src.linux-aarch64-3.6/numpy/core/src/private -Ibuild/src.linux-aarch64-3.6/numpy/core/src/private -c numpy/core/src/multiarray/numpyos.c -o build/temp.linux-aarch64-3.6/numpy/core/src/multiarray/numpyos.o" failed with exit status 1
----------------------------------------
ERROR: Failed building wheel for numpy
Running setup.py clean for numpy
ERROR: Command errored out with exit status 1:
 command: /usr/bin/python3 -u -c 'import io, os, sys, setuptools, tokenize; sys.argv[0] = '"'"'/tmp/pip-install-z270b_cp/numpy_21cb614a79104d9aa17cd6c03524ee4a/setup.py'"'"'; __file__ ='"'"'/tmp/pip-install-z270b_cp/numpy_21cb614a79104d9aa17cd6c03524ee4a/setup.py'"'"';f = getattr(tokenize, '"'"'open'"'"', open)( __file__ ) if os.path.exists( __file__ ) else io.StringIO('"'"'from setuptools import setup; setup()'"'"');code = f.read().replace('"'"'\r\n'"'"', '"'"'\n'"'"');f.close();exec(compile(code, __file__ , '"'"'exec'"'"'))' clean --all
     cwd: /tmp/pip-install-z270b_cp/numpy_21cb614a79104d9aa17cd6c03524ee4a
Complete output (10 lines):
Running from numpy source directory.

`setup.py clean` is not supported, use one of the following instead:

  - `git clean -xdf` (cleans all files)
  - `git clean -Xdf` (cleans all versioned files, doesn't touch
                      files that aren't checked into the git repo)

Add `--force` to your command to use it anyway if you must (unsupported).

----------------------------------------
ERROR: Failed cleaning build dir for numpy

```

Failed to build numpy  
Installing collected packages: pkgconfig, numpy, Cython  
Running setup.py install for numpy: started  
Running setup.py install for numpy: still running…  
Running setup.py install for numpy: still running…  
Running setup.py install for numpy: finished with status ‘error’  
ERROR: Command errored out with exit status 1:  
command: /usr/bin/python3 -u -c ‘import io, os, sys, setuptools, tokenize; sys.argv[0] = ‘"’"’/tmp/pip-install-z270b\_cp/numpy\_21cb614a79104d9aa17cd6c03524ee4a/setup.py’“'”‘; **file** =’“'”‘/tmp/pip-install-z270b\_cp/numpy\_21cb614a79104d9aa17cd6c03524ee4a/setup.py’“'”‘;f = getattr(tokenize, ‘"’“‘open’”’“‘, open)( **file** ) if os.path.exists( **file** ) else io.StringIO(’”‘“‘from setuptools import setup; setup()’”’“‘);code = f.read().replace(’”‘"’\r\n’“'”‘, ‘"’"’\n’“'”‘);f.close();exec(compile(code, **file** , ‘"’“‘exec’”’"‘))’ install --record /tmp/pip-record-m3dr\_0hl/install-record.txt --single-version-externally-managed --prefix /tmp/pip-build-env-tpw31hk8/normal --compile --install-headers /tmp/pip-build-env-tpw31hk8/normal/include/python3.6m/numpy  
cwd: /tmp/pip-install-z270b\_cp/numpy\_21cb614a79104d9aa17cd6c03524ee4a/  
Complete output (286 lines):  
Running from numpy source directory.

```
  Note: if you need reliable uninstall behavior, then install
  with pip instead of using `setup.py install`:

    - `pip install .` (from a git repo or downloaded source
                             release)
    - `pip install numpy` (last NumPy release on PyPi)

  blas_opt_info:
  blas_mkl_info:
    libraries mkl_rt not found in ['/usr/local/lib', '/usr/lib', '/usr/lib/aarch64-linux-gnu']
    NOT AVAILABLE

  blis_info:
    libraries blis not found in ['/usr/local/lib', '/usr/lib', '/usr/lib/aarch64-linux-gnu']
    NOT AVAILABLE

  openblas_info:
    libraries openblas not found in ['/usr/local/lib', '/usr/lib', '/usr/lib/aarch64-linux-gnu']
    NOT AVAILABLE

  atlas_3_10_blas_threads_info:
  Setting PTATLAS=ATLAS
    libraries tatlas not found in ['/usr/local/lib', '/usr/lib', '/usr/lib/aarch64-linux-gnu']
    NOT AVAILABLE

  atlas_3_10_blas_info:
    libraries satlas not found in ['/usr/local/lib', '/usr/lib', '/usr/lib/aarch64-linux-gnu']
    NOT AVAILABLE

  atlas_blas_threads_info:
  Setting PTATLAS=ATLAS
    libraries ptf77blas,ptcblas,atlas not found in ['/usr/local/lib', '/usr/lib', '/usr/lib/aarch64-linux-gnu']
    NOT AVAILABLE

  atlas_blas_info:
    libraries f77blas,cblas,atlas not found in ['/usr/local/lib', '/usr/lib', '/usr/lib/aarch64-linux-gnu']
    NOT AVAILABLE

  /tmp/pip-install-z270b_cp/numpy_21cb614a79104d9aa17cd6c03524ee4a/numpy/distutils/system_info.py:572: UserWarning:
      Atlas (http://math-atlas.sourceforge.net/) libraries not found.
      Directories to search for the libraries can be specified in the
      numpy/distutils/site.cfg file (section [atlas]) or by setting
      the ATLAS environment variable.
    self.calc_info()
  blas_info:
  customize UnixCCompiler
  C compiler: aarch64-linux-gnu-gcc -pthread -DNDEBUG -g -fwrapv -O2 -Wall -g -fstack-protector-strong -Wformat -Werror=format-security -Wdate-time -D_FORTIFY_SOURCE=2 -fPIC

  creating /tmp/tmps1gpewmu/tmp
  creating /tmp/tmps1gpewmu/tmp/tmps1gpewmu
  compile options: '-I/usr/local/include -I/usr/include -c'
  aarch64-linux-gnu-gcc: /tmp/tmps1gpewmu/source.c
  aarch64-linux-gnu-gcc -pthread /tmp/tmps1gpewmu/tmp/tmps1gpewmu/source.o -lcblas -o /tmp/tmps1gpewmu/a.out
  /usr/bin/ld: -lcblas kann nicht gefunden werden
  collect2: error: ld returned 1 exit status
  /usr/bin/ld: -lcblas kann nicht gefunden werden
  collect2: error: ld returned 1 exit status
  aarch64-linux-gnu-gcc -pthread /tmp/tmps1gpewmu/tmp/tmps1gpewmu/source.o -lblas -o /tmp/tmps1gpewmu/a.out
    FOUND:
      libraries = ['blas', 'blas']
      library_dirs = ['/usr/lib/aarch64-linux-gnu']
      language = c
      define_macros = [('HAVE_CBLAS', None)]

    FOUND:
      define_macros = [('NO_ATLAS_INFO', 1), ('HAVE_CBLAS', None)]
      libraries = ['blas', 'blas']
      library_dirs = ['/usr/lib/aarch64-linux-gnu']
      language = c

  /bin/sh: 1: svnversion: not found
  non-existing path in 'numpy/distutils': 'site.cfg'
  /bin/sh: 1: svnversion: not found
  F2PY Version 2
  lapack_opt_info:
  lapack_mkl_info:
    libraries mkl_rt not found in ['/usr/local/lib', '/usr/lib', '/usr/lib/aarch64-linux-gnu']
    NOT AVAILABLE

  openblas_lapack_info:
    libraries openblas not found in ['/usr/local/lib', '/usr/lib', '/usr/lib/aarch64-linux-gnu']
    NOT AVAILABLE

  atlas_3_10_threads_info:
  Setting PTATLAS=ATLAS
    libraries tatlas,tatlas not found in /usr/local/lib
    libraries lapack_atlas not found in /usr/local/lib
    libraries tatlas,tatlas not found in /usr/lib
    libraries lapack_atlas not found in /usr/lib
    libraries tatlas,tatlas not found in /usr/lib/aarch64-linux-gnu
    libraries lapack_atlas not found in /usr/lib/aarch64-linux-gnu
  <class 'numpy.distutils.system_info.atlas_3_10_threads_info'>
    NOT AVAILABLE

  atlas_3_10_info:
    libraries satlas,satlas not found in /usr/local/lib
    libraries lapack_atlas not found in /usr/local/lib
    libraries satlas,satlas not found in /usr/lib
    libraries lapack_atlas not found in /usr/lib
    libraries satlas,satlas not found in /usr/lib/aarch64-linux-gnu
    libraries lapack_atlas not found in /usr/lib/aarch64-linux-gnu
  <class 'numpy.distutils.system_info.atlas_3_10_info'>
    NOT AVAILABLE

  atlas_threads_info:
  Setting PTATLAS=ATLAS
    libraries ptf77blas,ptcblas,atlas not found in /usr/local/lib
    libraries lapack_atlas not found in /usr/local/lib
    libraries ptf77blas,ptcblas,atlas not found in /usr/lib
    libraries lapack_atlas not found in /usr/lib
    libraries ptf77blas,ptcblas,atlas not found in /usr/lib/aarch64-linux-gnu
    libraries lapack_atlas not found in /usr/lib/aarch64-linux-gnu
  <class 'numpy.distutils.system_info.atlas_threads_info'>
    NOT AVAILABLE

  atlas_info:
    libraries f77blas,cblas,atlas not found in /usr/local/lib
    libraries lapack_atlas not found in /usr/local/lib
    libraries f77blas,cblas,atlas not found in /usr/lib
    libraries lapack_atlas not found in /usr/lib
    libraries f77blas,cblas,atlas not found in /usr/lib/aarch64-linux-gnu
    libraries lapack_atlas not found in /usr/lib/aarch64-linux-gnu
  <class 'numpy.distutils.system_info.atlas_info'>
    NOT AVAILABLE

  lapack_info:
    FOUND:
      libraries = ['lapack', 'lapack']
      library_dirs = ['/usr/lib/aarch64-linux-gnu']
      language = f77

    FOUND:
      define_macros = [('NO_ATLAS_INFO', 1), ('HAVE_CBLAS', None)]
      libraries = ['lapack', 'lapack', 'blas', 'blas']
      library_dirs = ['/usr/lib/aarch64-linux-gnu']
      language = c

  /usr/lib/python3.6/distutils/dist.py:261: UserWarning: Unknown distribution option: 'define_macros'
    warnings.warn(msg)
  running install
  running build
  running config_cc
  unifing config_cc, config, build_clib, build_ext, build commands --compiler options
  running config_fc
  unifing config_fc, config, build_clib, build_ext, build commands --fcompiler options
  running build_src
  build_src
  building py_modules sources
  building library "npymath" sources
  customize Gnu95FCompiler
  Found executable /usr/bin/gfortran
  customize Gnu95FCompiler
  customize Gnu95FCompiler using config
  C compiler: aarch64-linux-gnu-gcc -pthread -DNDEBUG -g -fwrapv -O2 -Wall -g -fstack-protector-strong -Wformat -Werror=format-security -Wdate-time -D_FORTIFY_SOURCE=2 -fPIC

  compile options: '-Inumpy/core/src/private -Inumpy/core/src -Inumpy/core -Inumpy/core/src/npymath -Inumpy/core/src/multiarray -Inumpy/core/src/umath -Inumpy/core/src/npysort -I/usr/include/python3.6m -c'
  aarch64-linux-gnu-gcc: _configtest.c
  aarch64-linux-gnu-gcc -pthread _configtest.o -o _configtest
  success!
  removing: _configtest.c _configtest.o _configtest
  C compiler: aarch64-linux-gnu-gcc -pthread -DNDEBUG -g -fwrapv -O2 -Wall -g -fstack-protector-strong -Wformat -Werror=format-security -Wdate-time -D_FORTIFY_SOURCE=2 -fPIC

  compile options: '-Inumpy/core/src/private -Inumpy/core/src -Inumpy/core -Inumpy/core/src/npymath -Inumpy/core/src/multiarray -Inumpy/core/src/umath -Inumpy/core/src/npysort -I/usr/include/python3.6m -c'
  aarch64-linux-gnu-gcc: _configtest.c
  _configtest.c:1:5: warning: conflicting types for built-in function ‘exp’ [-Wbuiltin-declaration-mismatch]
   int exp (void);
       ^~~
  aarch64-linux-gnu-gcc -pthread _configtest.o -o _configtest
  _configtest.o: In Funktion »main«:
  /tmp/pip-install-z270b_cp/numpy_21cb614a79104d9aa17cd6c03524ee4a/_configtest.c:6: Warnung: undefinierter Verweis auf »exp«
  collect2: error: ld returned 1 exit status
  _configtest.o: In Funktion Â»mainÂ«:
  /tmp/pip-install-z270b_cp/numpy_21cb614a79104d9aa17cd6c03524ee4a/_configtest.c:6: Warnung: undefinierter Verweis auf Â»expÂ«
  collect2: error: ld returned 1 exit status
  failure.
  removing: _configtest.c _configtest.o
  C compiler: aarch64-linux-gnu-gcc -pthread -DNDEBUG -g -fwrapv -O2 -Wall -g -fstack-protector-strong -Wformat -Werror=format-security -Wdate-time -D_FORTIFY_SOURCE=2 -fPIC

  compile options: '-Inumpy/core/src/private -Inumpy/core/src -Inumpy/core -Inumpy/core/src/npymath -Inumpy/core/src/multiarray -Inumpy/core/src/umath -Inumpy/core/src/npysort -I/usr/include/python3.6m -c'
  aarch64-linux-gnu-gcc: _configtest.c
  _configtest.c:1:5: warning: conflicting types for built-in function ‘exp’ [-Wbuiltin-declaration-mismatch]
   int exp (void);
       ^~~
  aarch64-linux-gnu-gcc -pthread _configtest.o -lm -o _configtest
  success!
  removing: _configtest.c _configtest.o _configtest
  building library "npysort" sources
    adding 'build/src.linux-aarch64-3.6/numpy/core/src/private' to include_dirs.
  None - nothing done with h_files = ['build/src.linux-aarch64-3.6/numpy/core/src/private/npy_partition.h', 'build/src.linux-aarch64-3.6/numpy/core/src/private/npy_binsearch.h']
  building extension "numpy.core._dummy" sources
    adding 'build/src.linux-aarch64-3.6/numpy/core/include/numpy/config.h' to sources.
    adding 'build/src.linux-aarch64-3.6/numpy/core/include/numpy/_numpyconfig.h' to sources.
  executing numpy/core/code_generators/generate_numpy_api.py
    adding 'build/src.linux-aarch64-3.6/numpy/core/include/numpy/__multiarray_api.h' to sources.
  numpy.core - nothing done with h_files = ['build/src.linux-aarch64-3.6/numpy/core/include/numpy/config.h', 'build/src.linux-aarch64-3.6/numpy/core/include/numpy/_numpyconfig.h', 'build/src.linux-aarch64-3.6/numpy/core/include/numpy/__multiarray_api.h']
  building extension "numpy.core.multiarray" sources
    adding 'build/src.linux-aarch64-3.6/numpy/core/include/numpy/config.h' to sources.
    adding 'build/src.linux-aarch64-3.6/numpy/core/include/numpy/_numpyconfig.h' to sources.
  executing numpy/core/code_generators/generate_numpy_api.py
    adding 'build/src.linux-aarch64-3.6/numpy/core/include/numpy/__multiarray_api.h' to sources.
    adding 'build/src.linux-aarch64-3.6/numpy/core/src/private' to include_dirs.
  numpy.core - nothing done with h_files = ['build/src.linux-aarch64-3.6/numpy/core/src/private/templ_common.h', 'build/src.linux-aarch64-3.6/numpy/core/include/numpy/config.h', 'build/src.linux-aarch64-3.6/numpy/core/include/numpy/_numpyconfig.h', 'build/src.linux-aarch64-3.6/numpy/core/include/numpy/__multiarray_api.h']
  building extension "numpy.core.umath" sources
    adding 'build/src.linux-aarch64-3.6/numpy/core/include/numpy/config.h' to sources.
    adding 'build/src.linux-aarch64-3.6/numpy/core/include/numpy/_numpyconfig.h' to sources.
  executing numpy/core/code_generators/generate_ufunc_api.py
    adding 'build/src.linux-aarch64-3.6/numpy/core/include/numpy/__ufunc_api.h' to sources.
    adding 'build/src.linux-aarch64-3.6/numpy/core/src/umath' to include_dirs.
  numpy.core - nothing done with h_files = ['build/src.linux-aarch64-3.6/numpy/core/src/umath/funcs.inc', 'build/src.linux-aarch64-3.6/numpy/core/src/umath/simd.inc', 'build/src.linux-aarch64-3.6/numpy/core/src/umath/loops.h', 'build/src.linux-aarch64-3.6/numpy/core/include/numpy/config.h', 'build/src.linux-aarch64-3.6/numpy/core/include/numpy/_numpyconfig.h', 'build/src.linux-aarch64-3.6/numpy/core/include/numpy/__ufunc_api.h']
  building extension "numpy.core.umath_tests" sources
  building extension "numpy.core.test_rational" sources
  building extension "numpy.core.struct_ufunc_test" sources
  building extension "numpy.core.multiarray_tests" sources
  building extension "numpy.core.operand_flag_tests" sources
  building extension "numpy.fft.fftpack_lite" sources
  building extension "numpy.linalg.lapack_lite" sources
    adding 'numpy/linalg/lapack_lite/python_xerbla.c' to sources.
  building extension "numpy.linalg._umath_linalg" sources
    adding 'numpy/linalg/lapack_lite/python_xerbla.c' to sources.
  building extension "numpy.random.mtrand" sources
  building data_files sources
  build_src: building npy-pkg config files
  running build_py
  copying numpy/version.py -> build/lib.linux-aarch64-3.6/numpy
  copying build/src.linux-aarch64-3.6/numpy/ __config__.py -> build/lib.linux-aarch64-3.6/numpy
  copying build/src.linux-aarch64-3.6/numpy/distutils/ __config__.py -> build/lib.linux-aarch64-3.6/numpy/distutils
  running build_clib
  customize UnixCCompiler
  customize UnixCCompiler using build_clib
  running build_ext
  customize UnixCCompiler
  customize UnixCCompiler using build_ext
  building 'numpy.core.multiarray' extension
  compiling C sources
  C compiler: aarch64-linux-gnu-gcc -pthread -DNDEBUG -g -fwrapv -O2 -Wall -g -fstack-protector-strong -Wformat -Werror=format-security -Wdate-time -D_FORTIFY_SOURCE=2 -fPIC

  compile options: '-DHAVE_NPY_CONFIG_H=1 -D_FILE_OFFSET_BITS=64 -D_LARGEFILE_SOURCE=1 -D_LARGEFILE64_SOURCE=1 -DNO_ATLAS_INFO=1 -DHAVE_CBLAS -Ibuild/src.linux-aarch64-3.6/numpy/core/src/private -Inumpy/core/include -Ibuild/src.linux-aarch64-3.6/numpy/core/include/numpy -Inumpy/core/src/private -Inumpy/core/src -Inumpy/core -Inumpy/core/src/npymath -Inumpy/core/src/multiarray -Inumpy/core/src/umath -Inumpy/core/src/npysort -I/usr/include/python3.6m -Ibuild/src.linux-aarch64-3.6/numpy/core/src/private -Ibuild/src.linux-aarch64-3.6/numpy/core/src/private -Ibuild/src.linux-aarch64-3.6/numpy/core/src/private -c'
  aarch64-linux-gnu-gcc: numpy/core/src/multiarray/alloc.c
  aarch64-linux-gnu-gcc: numpy/core/src/multiarray/arrayobject.c
  aarch64-linux-gnu-gcc: build/src.linux-aarch64-3.6/numpy/core/src/multiarray/arraytypes.c
  aarch64-linux-gnu-gcc: numpy/core/src/multiarray/array_assign.c
  aarch64-linux-gnu-gcc: numpy/core/src/multiarray/array_assign_scalar.c
  aarch64-linux-gnu-gcc: numpy/core/src/multiarray/array_assign_array.c
  aarch64-linux-gnu-gcc: numpy/core/src/multiarray/buffer.c
  aarch64-linux-gnu-gcc: numpy/core/src/multiarray/calculation.c
  aarch64-linux-gnu-gcc: numpy/core/src/multiarray/compiled_base.c
  aarch64-linux-gnu-gcc: numpy/core/src/multiarray/common.c
  aarch64-linux-gnu-gcc: numpy/core/src/multiarray/convert.c
  aarch64-linux-gnu-gcc: numpy/core/src/multiarray/convert_datatype.c
  aarch64-linux-gnu-gcc: numpy/core/src/multiarray/conversion_utils.c
  aarch64-linux-gnu-gcc: numpy/core/src/multiarray/ctors.c
  aarch64-linux-gnu-gcc: numpy/core/src/multiarray/datetime.c
  aarch64-linux-gnu-gcc: numpy/core/src/multiarray/datetime_strings.c
  aarch64-linux-gnu-gcc: numpy/core/src/multiarray/datetime_busday.c
  aarch64-linux-gnu-gcc: numpy/core/src/multiarray/datetime_busdaycal.c
  aarch64-linux-gnu-gcc: numpy/core/src/multiarray/descriptor.c
  aarch64-linux-gnu-gcc: numpy/core/src/multiarray/dtype_transfer.c
  aarch64-linux-gnu-gcc: build/src.linux-aarch64-3.6/numpy/core/src/multiarray/einsum.c
  aarch64-linux-gnu-gcc: numpy/core/src/multiarray/flagsobject.c
  aarch64-linux-gnu-gcc: numpy/core/src/multiarray/getset.c
  aarch64-linux-gnu-gcc: numpy/core/src/multiarray/hashdescr.c
  aarch64-linux-gnu-gcc: numpy/core/src/multiarray/item_selection.c
  aarch64-linux-gnu-gcc: numpy/core/src/multiarray/iterators.c
  aarch64-linux-gnu-gcc: build/src.linux-aarch64-3.6/numpy/core/src/multiarray/lowlevel_strided_loops.c
  aarch64-linux-gnu-gcc: numpy/core/src/multiarray/mapping.c
  aarch64-linux-gnu-gcc: numpy/core/src/multiarray/methods.c
  aarch64-linux-gnu-gcc: numpy/core/src/multiarray/multiarraymodule.c
  aarch64-linux-gnu-gcc: build/src.linux-aarch64-3.6/numpy/core/src/multiarray/nditer_templ.c
  aarch64-linux-gnu-gcc: numpy/core/src/multiarray/nditer_api.c
  aarch64-linux-gnu-gcc: numpy/core/src/multiarray/nditer_constr.c
  aarch64-linux-gnu-gcc: numpy/core/src/multiarray/nditer_pywrap.c
  aarch64-linux-gnu-gcc: numpy/core/src/multiarray/number.c
  aarch64-linux-gnu-gcc: numpy/core/src/multiarray/numpymemoryview.c
  aarch64-linux-gnu-gcc: numpy/core/src/multiarray/numpyos.c
  numpy/core/src/multiarray/numpyos.c:18:10: fatal error: xlocale.h: Datei oder Verzeichnis nicht gefunden
   #include <xlocale.h>
            ^ ~~~~~~~~~~
  compilation terminated.
  numpy/core/src/multiarray/numpyos.c:18:10: fatal error: xlocale.h: Datei oder Verzeichnis nicht gefunden
   #include <xlocale.h>
            ^ ~~~~~~~~~~
  compilation terminated.
  error: Command "aarch64-linux-gnu-gcc -pthread -DNDEBUG -g -fwrapv -O2 -Wall -g -fstack-protector-strong -Wformat -Werror=format-security -Wdate-time -D_FORTIFY_SOURCE=2 -fPIC -DHAVE_NPY_CONFIG_H=1 -D_FILE_OFFSET_BITS=64 -D_LARGEFILE_SOURCE=1 -D_LARGEFILE64_SOURCE=1 -DNO_ATLAS_INFO=1 -DHAVE_CBLAS -Ibuild/src.linux-aarch64-3.6/numpy/core/src/private -Inumpy/core/include -Ibuild/src.linux-aarch64-3.6/numpy/core/include/numpy -Inumpy/core/src/private -Inumpy/core/src -Inumpy/core -Inumpy/core/src/npymath -Inumpy/core/src/multiarray -Inumpy/core/src/umath -Inumpy/core/src/npysort -I/usr/include/python3.6m -Ibuild/src.linux-aarch64-3.6/numpy/core/src/private -Ibuild/src.linux-aarch64-3.6/numpy/core/src/private -Ibuild/src.linux-aarch64-3.6/numpy/core/src/private -c numpy/core/src/multiarray/numpyos.c -o build/temp.linux-aarch64-3.6/numpy/core/src/multiarray/numpyos.o" failed with exit status 1
  ----------------------------------------

```

## ERROR: Command errored out with exit status 1: /usr/bin/python3 -u -c ‘import io, os, sys, setuptools, tokenize; sys.argv[0] = ‘"’"’/tmp/pip-install-z270b\_cp/numpy\_21cb614a79104d9aa17cd6c03524ee4a/setup.py’“'”‘; **file** =’“'”‘/tmp/pip-install-z270b\_cp/numpy\_21cb614a79104d9aa17cd6c03524ee4a/setup.py’“'”‘;f = getattr(tokenize, ‘"’“‘open’”’“‘, open)( **file** ) if os.path.exists( **file** ) else io.StringIO(’”‘“‘from setuptools import setup; setup()’”’“‘);code = f.read().replace(’”‘"’\r\n’“'”‘, ‘"’"’\n’“'”‘);f.close();exec(compile(code, **file** , ‘"’“‘exec’”’"‘))’ install --record /tmp/pip-record-m3dr\_0hl/install-record.txt --single-version-externally-managed --prefix /tmp/pip-build-env-tpw31hk8/normal --compile --install-headers /tmp/pip-build-env-tpw31hk8/normal/include/python3.6m/numpy Check the logs for full command output.

## WARNING: Discarding [https://files.pythonhosted.org/packages/15/fb/86d26128a5ea42d20f402109e76a63e59845d73171887a08a43a28b847dc/h5py-3.0.0.tar.gz#sha256=7d3803be1b530c68c2955faba726dc0f591079b68941a0c0269b5384a42ab519](https://files.pythonhosted.org/packages/15/fb/86d26128a5ea42d20f402109e76a63e59845d73171887a08a43a28b847dc/h5py-3.0.0.tar.gz#sha256=7d3803be1b530c68c2955faba726dc0f591079b68941a0c0269b5384a42ab519) (from [Links for h5py](https://pypi.org/simple/h5py/)) (requires-python:\>=3.6). Command errored out with exit status 1: /usr/bin/python3 /usr/local/lib/python3.6/dist-packages/pip install --ignore-installed --no-user --prefix /tmp/pip-build-env-tpw31hk8/normal --no-warn-script-location --no-binary :none: --only-binary :none: -i [Simple index](https://pypi.org/simple) – ‘numpy==1.19.3; python\_version \>= “3.9”’ ‘Cython\>=0.29; python\_version \< “3.8”’ ‘numpy==1.14.5; python\_version == “3.7”’ pkgconfig ‘numpy==1.12; python\_version == “3.6”’ ‘Cython\>=0.29.14; python\_version \>= “3.8”’ ‘numpy==1.17.5; python\_version == “3.8”’ Check the logs for full command output. Downloading h5py-2.10.0.tar.gz (301 kB) |████████████████████████████████| 301 kB 14.1 MB/s Requirement already satisfied: astor in /usr/local/lib/python3.6/dist-packages (0.8.1) WARNING: Retrying (Retry(total=4, connect=None, read=None, redirect=None, status=None)) after connection broken by ‘ProtocolError(‘Connection aborted.’, ConnectionResetError(104, ‘Die Verbindung wurde vom Kommunikationspartner zurückgesetzt’))’: /simple/astor/ Requirement already satisfied: termcolor in /usr/local/lib/python3.6/dist-packages (1.1.0) Requirement already satisfied: protobuf in /usr/local/lib/python3.6/dist-packages (3.11.3) Collecting protobuf Downloading protobuf-3.17.0-py2.py3-none-any.whl (173 kB) |████████████████████████████████| 173 kB 13.9 MB/s Requirement already satisfied: keras-applications in /usr/local/lib/python3.6/dist-packages (1.0.8) Requirement already satisfied: keras-preprocessing in /usr/local/lib/python3.6/dist-packages (1.1.0) Collecting keras-preprocessing Downloading Keras\_Preprocessing-1.1.2-py2.py3-none-any.whl (42 kB) |████████████████████████████████| 42 kB 8.0 MB/s Requirement already satisfied: wrapt in /usr/local/lib/python3.6/dist-packages (1.12.1) Requirement already satisfied: google-pasta in /usr/local/lib/python3.6/dist-packages (0.2.0) Requirement already satisfied: urllib3\<1.27,\>=1.21.1 in /usr/lib/python3/dist-packages (from requests) (1.22) Requirement already satisfied: certifi\>=2017.4.17 in /usr/lib/python3/dist-packages (from requests) (2018.1.18) Requirement already satisfied: idna\<3,\>=2.5 in /usr/lib/python3/dist-packages (from requests) (2.6) Requirement already satisfied: chardet\<5,\>=3.0.2 in /usr/lib/python3/dist-packages (from requests) (3.0.4) Building wheels for collected packages: py-cpuinfo, psutil, h5py Building wheel for py-cpuinfo (setup.py) … done Created wheel for py-cpuinfo: filename=py\_cpuinfo-8.0.0-py3-none-any.whl size=22472 sha256=6d37098178e4898d25ef0310a79835d34edad3bcc122fea3f428154439a736df Stored in directory: /tmp/pip-ephem-wheel-cache-nwx75zxo/wheels/3e/e1/d9/9b782b170e5272d6500cee4d29dd6c724598b22dc399d81d01 Building wheel for psutil (setup.py) … done Created wheel for psutil: filename=psutil-5.8.0-cp36-cp36m-linux\_aarch64.whl size=297375 sha256=6e41eb6c2ffe56719d34fdf36bab05ee837571fae878858156fa19659f47f99f Stored in directory: /tmp/pip-ephem-wheel-cache-nwx75zxo/wheels/6d/de/48/9e3627ec70b2df62377606d4fbe106025e60da976b8c7adabc Building wheel for h5py (setup.py) … error ERROR: Command errored out with exit status -4: command: /usr/bin/python3 -u -c ‘import io, os, sys, setuptools, tokenize; sys.argv[0] = ‘"’"’/tmp/pip-install-f\_p0tk4y/h5py\_2a0b9128e3974d97bbb3a40519ef45ae/setup.py’“'”‘; **file** =’“'”‘/tmp/pip-install-f\_p0tk4y/h5py\_2a0b9128e3974d97bbb3a40519ef45ae/setup.py’“'”‘;f = getattr(tokenize, ‘"’“‘open’”’“‘, open)( **file** ) if os.path.exists( **file** ) else io.StringIO(’”‘“‘from setuptools import setup; setup()’”’“‘);code = f.read().replace(’”‘"’\r\n’“'”‘, ‘"’"’\n’“'”‘);f.close();exec(compile(code, **file** , ‘"’“‘exec’”’"‘))’ bdist\_wheel -d /tmp/pip-wheel-ugvi9g4p cwd: /tmp/pip-install-f\_p0tk4y/h5py\_2a0b9128e3974d97bbb3a40519ef45ae/ Complete output (63 lines): WARNING: The directory ‘/home/jetbot/.cache/pip’ or its parent directory is not owned or is not writable by the current user. The cache has been disabled. Check the permissions and owner of that directory. If executing pip with sudo, you should use sudo’s -H flag. running bdist\_wheel running build running build\_py creating build creating build/lib.linux-aarch64-3.6 creating build/lib.linux-aarch64-3.6/h5py copying h5py/h5py\_warnings.py → build/lib.linux-aarch64-3.6/h5py copying h5py/ipy\_completer.py → build/lib.linux-aarch64-3.6/h5py copying h5py/highlevel.py → build/lib.linux-aarch64-3.6/h5py copying h5py/ **init**.py → build/lib.linux-aarch64-3.6/h5py copying h5py/version.py → build/lib.linux-aarch64-3.6/h5py creating build/lib.linux-aarch64-3.6/h5py/\_hl copying h5py/\_hl/dataset.py → build/lib.linux-aarch64-3.6/h5py/\_hl copying h5py/\_hl/filters.py → build/lib.linux-aarch64-3.6/h5py/\_hl copying h5py/\_hl/attrs.py → build/lib.linux-aarch64-3.6/h5py/\_hl copying h5py/\_hl/selections2.py → build/lib.linux-aarch64-3.6/h5py/\_hl copying h5py/\_hl/compat.py → build/lib.linux-aarch64-3.6/h5py/\_hl copying h5py/\_hl/vds.py → build/lib.linux-aarch64-3.6/h5py/\_hl copying h5py/\_hl/selections.py → build/lib.linux-aarch64-3.6/h5py/\_hl copying h5py/\_hl/datatype.py → build/lib.linux-aarch64-3.6/h5py/\_hl copying h5py/\_hl/ **init**.py → build/lib.linux-aarch64-3.6/h5py/\_hl copying h5py/\_hl/base.py → build/lib.linux-aarch64-3.6/h5py/\_hl copying h5py/\_hl/group.py → build/lib.linux-aarch64-3.6/h5py/\_hl copying h5py/\_hl/files.py → build/lib.linux-aarch64-3.6/h5py/\_hl copying h5py/\_hl/dims.py → build/lib.linux-aarch64-3.6/h5py/\_hl creating build/lib.linux-aarch64-3.6/h5py/tests copying h5py/tests/test\_completions.py → build/lib.linux-aarch64-3.6/h5py/tests copying h5py/tests/test\_selections.py → build/lib.linux-aarch64-3.6/h5py/tests copying h5py/tests/test\_slicing.py → build/lib.linux-aarch64-3.6/h5py/tests copying h5py/tests/test\_dataset.py → build/lib.linux-aarch64-3.6/h5py/tests copying h5py/tests/test\_dimension\_scales.py → build/lib.linux-aarch64-3.6/h5py/tests copying h5py/tests/test\_h5.py → build/lib.linux-aarch64-3.6/h5py/tests copying h5py/tests/test\_objects.py → build/lib.linux-aarch64-3.6/h5py/tests copying h5py/tests/test\_attribute\_create.py → build/lib.linux-aarch64-3.6/h5py/tests copying h5py/tests/common.py → build/lib.linux-aarch64-3.6/h5py/tests copying h5py/tests/test\_attrs.py → build/lib.linux-aarch64-3.6/h5py/tests copying h5py/tests/test\_datatype.py → build/lib.linux-aarch64-3.6/h5py/tests copying h5py/tests/test\_h5d\_direct\_chunk.py → build/lib.linux-aarch64-3.6/h5py/tests copying h5py/tests/test\_h5t.py → build/lib.linux-aarch64-3.6/h5py/tests copying h5py/tests/test\_threads.py → build/lib.linux-aarch64-3.6/h5py/tests copying h5py/tests/test\_dtype.py → build/lib.linux-aarch64-3.6/h5py/tests copying h5py/tests/test\_group.py → build/lib.linux-aarch64-3.6/h5py/tests copying h5py/tests/test\_file.py → build/lib.linux-aarch64-3.6/h5py/tests copying h5py/tests/test\_attrs\_data.py → build/lib.linux-aarch64-3.6/h5py/tests copying h5py/tests/test\_deprecation.py → build/lib.linux-aarch64-3.6/h5py/tests copying h5py/tests/test\_dataset\_getitem.py → build/lib.linux-aarch64-3.6/h5py/tests copying h5py/tests/test\_dims\_dimensionproxy.py → build/lib.linux-aarch64-3.6/h5py/tests copying h5py/tests/test\_h5pl.py → build/lib.linux-aarch64-3.6/h5py/tests copying h5py/tests/test\_file2.py → build/lib.linux-aarch64-3.6/h5py/tests copying h5py/tests/test\_h5f.py → build/lib.linux-aarch64-3.6/h5py/tests copying h5py/tests/ **init**.py → build/lib.linux-aarch64-3.6/h5py/tests copying h5py/tests/test\_filters.py → build/lib.linux-aarch64-3.6/h5py/tests copying h5py/tests/test\_file\_image.py → build/lib.linux-aarch64-3.6/h5py/tests copying h5py/tests/test\_h5p.py → build/lib.linux-aarch64-3.6/h5py/tests copying h5py/tests/test\_base.py → build/lib.linux-aarch64-3.6/h5py/tests copying h5py/tests/test\_dataset\_swmr.py → build/lib.linux-aarch64-3.6/h5py/tests creating build/lib.linux-aarch64-3.6/h5py/tests/test\_vds copying h5py/tests/test\_vds/test\_virtual\_source.py → build/lib.linux-aarch64-3.6/h5py/tests/test\_vds copying h5py/tests/test\_vds/test\_highlevel\_vds.py → build/lib.linux-aarch64-3.6/h5py/tests/test\_vds copying h5py/tests/test\_vds/ **init**.py → build/lib.linux-aarch64-3.6/h5py/tests/test\_vds copying h5py/tests/test\_vds/test\_lowlevel\_vds.py → build/lib.linux-aarch64-3.6/h5py/tests/test\_vds running build\_ext

ERROR: Failed building wheel for h5py  
Running setup.py clean for h5py  
Successfully built py-cpuinfo psutil  
Failed to build h5py  
Installing collected packages: h5py, requests, py-cpuinfo, psutil, protobuf, portpicker, mock, keras-preprocessing, grpcio, gast, absl-py  
Attempting uninstall: h5py  
Found existing installation: h5py 2.9.0  
Uninstalling h5py-2.9.0:  
Successfully uninstalled h5py-2.9.0  
Running setup.py install for h5py … error  
ERROR: Command errored out with exit status -4:  
command: /usr/bin/python3 -u -c ‘import io, os, sys, setuptools, tokenize; sys.argv[0] = ‘"’"’/tmp/pip-install-f\_p0tk4y/h5py\_2a0b9128e3974d97bbb3a40519ef45ae/setup.py’“'”‘; **file** =’“'”‘/tmp/pip-install-f\_p0tk4y/h5py\_2a0b9128e3974d97bbb3a40519ef45ae/setup.py’“'”‘;f = getattr(tokenize, ‘"’“‘open’”’“‘, open)( **file** ) if os.path.exists( **file** ) else io.StringIO(’”‘“‘from setuptools import setup; setup()’”’“‘);code = f.read().replace(’”‘"’\r\n’“'”‘, ‘"’"’\n’“'”‘);f.close();exec(compile(code, **file** , ‘"’“‘exec’”’“‘))’ install --record /tmp/pip-record-xxhl08d1/install-record.txt --single-version-externally-managed --compile --install-headers /usr/local/include/python3.6/h5py  
cwd: /tmp/pip-install-f\_p0tk4y/h5py\_2a0b9128e3974d97bbb3a40519ef45ae/  
Complete output (62 lines):  
running install  
running build  
running build\_py  
creating build  
creating build/lib.linux-aarch64-3.6  
creating build/lib.linux-aarch64-3.6/h5py  
copying h5py/h5py\_warnings.py → build/lib.linux-aarch64-3.6/h5py  
copying h5py/ipy\_completer.py → build/lib.linux-aarch64-3.6/h5py  
copying h5py/highlevel.py → build/lib.linux-aarch64-3.6/h5py  
copying h5py/ **init**.py → build/lib.linux-aarch64-3.6/h5py  
copying h5py/version.py → build/lib.linux-aarch64-3.6/h5py  
creating build/lib.linux-aarch64-3.6/h5py/\_hl  
copying h5py/\_hl/dataset.py → build/lib.linux-aarch64-3.6/h5py/\_hl  
copying h5py/\_hl/filters.py → build/lib.linux-aarch64-3.6/h5py/\_hl  
copying h5py/\_hl/attrs.py → build/lib.linux-aarch64-3.6/h5py/\_hl  
copying h5py/\_hl/selections2.py → build/lib.linux-aarch64-3.6/h5py/\_hl  
copying h5py/\_hl/compat.py → build/lib.linux-aarch64-3.6/h5py/\_hl  
copying h5py/\_hl/vds.py → build/lib.linux-aarch64-3.6/h5py/\_hl  
copying h5py/\_hl/selections.py → build/lib.linux-aarch64-3.6/h5py/\_hl  
copying h5py/\_hl/datatype.py → build/lib.linux-aarch64-3.6/h5py/\_hl  
copying h5py/\_hl/ **init**.py → build/lib.linux-aarch64-3.6/h5py/\_hl  
copying h5py/\_hl/base.py → build/lib.linux-aarch64-3.6/h5py/\_hl  
copying h5py/\_hl/group.py → build/lib.linux-aarch64-3.6/h5py/\_hl  
copying h5py/\_hl/files.py → build/lib.linux-aarch64-3.6/h5py/\_hl  
copying h5py/\_hl/dims.py → build/lib.linux-aarch64-3.6/h5py/\_hl  
creating build/lib.linux-aarch64-3.6/h5py/tests  
copying h5py/tests/test\_completions.py → build/lib.linux-aarch64-3.6/h5py/tests  
copying h5py/tests/test\_selections.py → build/lib.linux-aarch64-3.6/h5py/tests  
copying h5py/tests/test\_slicing.py → build/lib.linux-aarch64-3.6/h5py/tests  
copying h5py/tests/test\_dataset.py → build/lib.linux-aarch64-3.6/h5py/tests  
copying h5py/tests/test\_dimension\_scales.py → build/lib.linux-aarch64-3.6/h5py/tests  
copying h5py/tests/test\_h5.py → build/lib.linux-aarch64-3.6/h5py/tests  
copying h5py/tests/test\_objects.py → build/lib.linux-aarch64-3.6/h5py/tests  
copying h5py/tests/test\_attribute\_create.py → build/lib.linux-aarch64-3.6/h5py/tests  
copying h5py/tests/common.py → build/lib.linux-aarch64-3.6/h5py/tests  
copying h5py/tests/test\_attrs.py → build/lib.linux-aarch64-3.6/h5py/tests  
copying h5py/tests/test\_datatype.py → build/lib.linux-aarch64-3.6/h5py/tests  
copying h5py/tests/test\_h5d\_direct\_chunk.py → build/lib.linux-aarch64-3.6/h5py/tests  
copying h5py/tests/test\_h5t.py → build/lib.linux-aarch64-3.6/h5py/tests  
copying h5py/tests/test\_threads.py → build/lib.linux-aarch64-3.6/h5py/tests  
copying h5py/tests/test\_dtype.py → build/lib.linux-aarch64-3.6/h5py/tests  
copying h5py/tests/test\_group.py → build/lib.linux-aarch64-3.6/h5py/tests  
copying h5py/tests/test\_file.py → build/lib.linux-aarch64-3.6/h5py/tests  
copying h5py/tests/test\_attrs\_data.py → build/lib.linux-aarch64-3.6/h5py/tests  
copying h5py/tests/test\_deprecation.py → build/lib.linux-aarch64-3.6/h5py/tests  
copying h5py/tests/test\_dataset\_getitem.py → build/lib.linux-aarch64-3.6/h5py/tests  
copying h5py/tests/test\_dims\_dimensionproxy.py → build/lib.linux-aarch64-3.6/h5py/tests  
copying h5py/tests/test\_h5pl.py → build/lib.linux-aarch64-3.6/h5py/tests  
copying h5py/tests/test\_file2.py → build/lib.linux-aarch64-3.6/h5py/tests  
copying h5py/tests/test\_h5f.py → build/lib.linux-aarch64-3.6/h5py/tests  
copying h5py/tests/ **init**.py → build/lib.linux-aarch64-3.6/h5py/tests  
copying h5py/tests/test\_filters.py → build/lib.linux-aarch64-3.6/h5py/tests  
copying h5py/tests/test\_file\_image.py → build/lib.linux-aarch64-3.6/h5py/tests  
copying h5py/tests/test\_h5p.py → build/lib.linux-aarch64-3.6/h5py/tests  
copying h5py/tests/test\_base.py → build/lib.linux-aarch64-3.6/h5py/tests  
copying h5py/tests/test\_dataset\_swmr.py → build/lib.linux-aarch64-3.6/h5py/tests  
creating build/lib.linux-aarch64-3.6/h5py/tests/test\_vds  
copying h5py/tests/test\_vds/test\_virtual\_source.py → build/lib.linux-aarch64-3.6/h5py/tests/test\_vds  
copying h5py/tests/test\_vds/test\_highlevel\_vds.py → build/lib.linux-aarch64-3.6/h5py/tests/test\_vds  
copying h5py/tests/test\_vds/ **init**.py → build/lib.linux-aarch64-3.6/h5py/tests/test\_vds  
copying h5py/tests/test\_vds/test\_lowlevel\_vds.py → build/lib.linux-aarch64-3.6/h5py/tests/test\_vds  
running build\_ext  
----------------------------------------  
Rolling back uninstall of h5py  
Moving to /usr/local/lib/python3.6/dist-packages/h5py-2.9.0.dist-info/  
from /usr/local/lib/python3.6/dist-packages/~5py-2.9.0.dist-info  
Moving to /usr/local/lib/python3.6/dist-packages/h5py/  
from /usr/local/lib/python3.6/dist-packages/~5py  
ERROR: Command errored out with exit status -4: /usr/bin/python3 -u -c 'import io, os, sys, setuptools, tokenize; sys.argv[0] = '”‘"’/tmp/pip-install-f\_p0tk4y/h5py\_2a0b9128e3974d97bbb3a40519ef45ae/setup.py’“'”‘; **file** =’“'”‘/tmp/pip-install-f\_p0tk4y/h5py\_2a0b9128e3974d97bbb3a40519ef45ae/setup.py’“'”‘;f = getattr(tokenize, ‘"’“‘open’”’“‘, open)( **file** ) if os.path.exists( **file** ) else io.StringIO(’”‘“‘from setuptools import setup; setup()’”’“‘);code = f.read().replace(’”‘"’\r\n’“'”‘, ‘"’"’\n’“'”‘);f.close();exec(compile(code, **file** , ‘"’“‘exec’”’"‘))’ install --record /tmp/pip-record-xxhl08d1/install-record.txt --single-version-externally-managed --compile --install-headers /usr/local/include/python3.6/h5py Check the logs for full command output.

I would be glad for any support.

---

<div class="post-metadata">

### Author: ![AastaLLL](https://sea2.discourse-cdn.com/nvidia/user_avatar/forums.developer.nvidia.com/aastalll/32/14043_2.png) [@AastaLLL](https://forums.developer.nvidia.com/u/AastaLLL)
#### Post date: [May 25, 2021, 5:25am UTC](https://forums.developer.nvidia.com/t/tensorflow/178809/3 "2021-05-25T05:25:29Z")

</div>

Hi,

May I know which JetPack version do you use?  
The instruction will be slightly different on the different software.

If the latest JetPack 4.5.1 is used, you can check below document to setup all the prerequisites and dependencies:

> **[Installing TensorFlow for Jetson Platform :: NVIDIA Deep Learning Frameworks...](https://docs.nvidia.com/deeplearning/frameworks/install-tf-jetson-platform/index.html#prereqs)**
>
> This guide provides instructions for installing TensorFlow for Jetson Platform.

Thanks.

---

<div class="post-metadata">

### Author: ![ali.yusuf](https://developer.download.nvidia.com/images/forums/profile-default-devtalk-84.png) [@ali.yusuf](https://forums.developer.nvidia.com/u/ali.yusuf)
#### Post date: [May 26, 2021, 10:44am UTC](https://forums.developer.nvidia.com/t/tensorflow/178809/4 "2021-05-26T10:44:54Z")

</div>

Hi  
i am using JetPack 4.3

 ![jetpack new](https://global.discourse-cdn.com/nvidia/original/3X/1/e/1e2830ec42ca83a35c0f188a20bce3209caeb49a.png)

I use the following product from Sparkfun: [SparkFun JetBot AI Kit v3.0 Powered by Jetson Nano - KIT-18486 - SparkFun Electronics](https://www.sparkfun.com/products/16417)

Since I’m new to the whole topic I’m also worried that the image files for the hardware components of sparkfun can be lost during any installations.

---

<div class="post-metadata">

### Author: ![AastaLLL](https://sea2.discourse-cdn.com/nvidia/user_avatar/forums.developer.nvidia.com/aastalll/32/14043_2.png) [@AastaLLL](https://forums.developer.nvidia.com/u/AastaLLL)
#### Post date: [June 8, 2021, 6:17am UTC](https://forums.developer.nvidia.com/t/tensorflow/178809/5 "2021-06-08T06:17:38Z")

</div>

Hi,

Sorry for the late update.

This is a known issue in _pip3_ for JetPack4.3.  
Please use `pip3==20.2.4` to meet the compatibility.

You can find the detailed installation steps below:

> [@Tensor Flow Installation - Metafile Error](https://forums.developer.nvidia.com/t/tensor-flow-installation-metafile-error/170994/11):
>
> Hi, We try to install it on a new flash device (JetPack4.3). Here is the detailed steps for your reference: $ sudo pip3 install -U pip==20.2.4 $ sudo apt-get install libhdf5-serial-dev hdf5-tools libhdf5-dev zlib1g-dev zip libjpeg8- $ sudo ln -s /usr/include/locale.h /usr/include/xlocale.h $ sudo pip3 install numpy grpcio absl-py py-cpuinfo psutil portpicker six mock requests gast h5py astor termcolor protobuf keras-applications keras-preprocessing wrapt google-pasta $ sudo pip3 install --pre…

Thanks.

---

<div class="post-metadata">

### Author: ![ali.yusuf](https://developer.download.nvidia.com/images/forums/profile-default-devtalk-84.png) [@ali.yusuf](https://forums.developer.nvidia.com/u/ali.yusuf)
#### Post date: [June 13, 2021, 11:18am UTC](https://forums.developer.nvidia.com/t/tensorflow/178809/6 "2021-06-13T11:18:46Z")

</div>

Hi @AastaLLL ,

i tryed the installation steps but it doesn’t works for me.  
i get this error messages:

sudo pip3 install -U pip==20.2.4  
[sudo] password for jetbot:  
WARNING: The directory ‘/home/jetbot/.cache/pip’ or its parent directory is not owned or is not writable by the current user. The cache has been disabled. Check the permissions and owner of that directory. If executing pip with sudo, you should use sudo’s -H flag.  
Collecting pip==20.2.4  
Downloading pip-20.2.4-py2.py3-none-any.whl (1.5 MB)  
|████████████████████████████████| 1.5 MB 4.8 MB/s  
Installing collected packages: pip  
Attempting uninstall: pip  
Found existing installation: pip 21.1.2  
Uninstalling pip-21.1.2:  
Successfully uninstalled pip-21.1.2  
Successfully installed pip-20.2.4  
WARNING: Running pip as root will break packages and permissions. You should install packages reliably by using venv: [12. Virtual Environments and Packages — Python 3.10.7 documentation](https://pip.pypa.io/warnings/venv)  
jetbot@jetson:~$ sudo apt-get install libhdf5-serial-dev hdf5-tools libhdf5-dev zlib1g-dev zip libjpeg8-  
Reading package lists… Done  
Building dependency tree  
Reading state information… Done  
libhdf5-dev is already the newest version (1.10.0-patch1+docs-4).  
zip is already the newest version (3.0-11build1).  
libhdf5-serial-dev is already the newest version (1.10.0-patch1+docs-4).  
hdf5-tools is already the newest version (1.10.0-patch1+docs-4).  
zlib1g-dev is already the newest version (1:1.2.11.dfsg-0ubuntu2).  
The following packages were automatically installed and are no longer required:  
accountsservice acl adium-theme-ubuntu apg aptdaemon aptdaemon-data aspell  
aspell-en bluez-obexd bubblewrap cheese-common colord-data compiz-core  
compiz-plugins-default cracklib-runtime dconf-cli dictionaries-common  
diffstat emacsen-common enchant evince-common fonts-dejavu-extra freepats  
gdal-data gedit-common geoclue geoclue-2.0 geoclue-ubuntu-geoip  
gir1.2-accounts-1.0 gir1.2-accountsservice-1.0 gir1.2-atk-1.0  
gir1.2-atspi-2.0 gir1.2-dbusmenu-glib-0.4 gir1.2-dee-1.0 gir1.2-gck-1  
gir1.2-gdata-0.0 gir1.2-gdesktopenums-3.0 gir1.2-geoclue-2.0 gir1.2-goa-1.0  
gir1.2-ibus-1.0 gir1.2-javascriptcoregtk-4.0 gir1.2-json-1.0 gir1.2-nm-1.0  
gir1.2-polkit-1.0 gir1.2-secret-1 gir1.2-signon-1.0 gir1.2-soup-2.4  
gir1.2-totemplparser-1.0 gir1.2-unity-5.0 gir1.2-upowerglib-1.0  
gnome-control-center-faces gnome-desktop3-data gnome-keyring-pkcs11  
gnome-session-common gnome-settings-daemon-schemas gnome-shell-common  
gnome-software-common gnome-terminal-data gnome-themes-extra-data  
gnome-todo-common gnupg-l10n gnupg-utils gsfonts gstreamer1.0-x gtk3-nocsd  
hunspell-en-us iio-sensor-proxy indicator-common indicator-messages  
indicator-session ippusbxd java-common language-selector-common libaa1  
libaacs0 libaccounts-glib0 libaccountsservice0 libapt-pkg-perl libaribb24-0  
libarmadillo8 libarpack2 libaspell15 libass9 libassuan-dev  
libatk-wrapper-java libatk-wrapper-java-jni libatkmm-1.6-1v5 libavc1394-0  
libbamf3-2 libbasicusageenvironment1 libbdplus0 libbluray2 libbrotli1  
libbs2b0 libbz2-dev libcaca0 libcairo-gobject-perl libcairo-gobject2  
libcairo-perl libcairomm-1.0-1v5 libcanberra-pulse libcanberra0 libcddb2  
libcdio-cdda2 libcdio-paranoia2 libcgi-fast-perl libcgi-pm-perl libcharls1  
libclass-accessor-perl libclone-perl libclutter-1.0-common libcogl-common  
libcolord2 libcolorhug2 libcolumbus1-common libcolumbus1v5 libcompizconfig0  
libcrack2 libdap25 libdapclient6v5 libdbusmenu-glib4 libdc1394-22 libdca0  
libde265-0 libdecoration0 libdee-1.0-4 libdjvulibre-text  
libdouble-conversion1 libdv4 libdvbpsi10 libebml4v5 libeigen3-dev  
libemail-valid-perl libenchant1c2a libepsilon1 libexempi3 libexif12  
libexiv2-14 libexporter-tiny-perl libfaad2 libfam0 libfcgi-perl  
libfcitx-config4 libfcitx-gclient1 libfcitx-utils0  
libfile-copy-recursive-perl libflite1 libfluidsynth1 libframe6 libfreexl1  
libfyba0 libgdcm2.8 libgdk-pixbuf2.0-common libgee-0.8-2 libgeis1  
libgeoclue-2-0 libgeoclue0 libgeocode-glib0 libgeonames-common libgeonames0  
libgeos-3.6.2 libgeos-c1v5 libgexiv2-2 libgif7 libglewmx1.13  
libglib-object-introspection-perl libglib-perl libglibmm-2.4-1v5 libgme0  
libgmime-3.0-0 libgnome-autoar-0-0 libgnome-games-support-common  
libgnome-todo libgnomekbd-common libgom-1.0-0 libgpg-error-dev libgpgme-dev  
libgphoto2-l10n libgphoto2-port12 libgrail6 libgraphene-1.0-0 libgrilo-0.3-0  
libgroupsock8 libgsm1 libgspell-1-common libgssdp-1.0-3  
libgstreamer-plugins-good1.0-0 libgtk-3-common libgtk2.0-common  
libgtk3-nocsd0 libgtksourceview-3.0-common libgtop-2.0-11 libgtop2-common  
libgupnp-1.0-4 libgupnp-igd-1.0-4 libgweather-common libhunspell-1.6-0  
libhyphen0 libiec61883-0 libieee1284-3 libijs-0.35 libilmbase12  
libimobiledevice6 libio-pty-perl libio-string-perl libipc-run-perl  
libjavascriptcoregtk-4.0-18 libjbig0 libjbig2dec0 libjxr0 libkate1  
libkf5archive5 libkf5auth-data libkf5codecs-data libkf5codecs5  
libkf5config-data libkf5configcore5 libkf5configwidgets-data  
libkf5coreaddons-data libkf5coreaddons5 libkf5dbusaddons-data  
libkf5i18n-data libkf5i18n5 libkf5iconthemes-data libkf5itemviews-data  
libkf5notifications-data libkf5service-data libkf5wallet-data  
libkf5widgetsaddons-data libkf5windowsystem-data libkmlbase1 libkmldom1  
libkmlengine1 liblightdm-gobject-1-0 liblilv-0-0 liblirc-client0  
liblist-moreutils-perl liblivemedia62 liblqr-1-0 liblua5.2-0 liblua5.3-0  
liblz4-dev libmad0 libmatroska6v5 libmessaging-menu0 libmicrodns0  
libminiupnpc10 libminizip1 libmjpegutils-2.1-0 libmms0 libmodplug1  
libmp3lame0 libmpcdec6 libmpeg2encpp-2.1-0 libmpg123-0 libmplex2-2.1-0  
libmtp-common libmtp-runtime libmtp9 libmysofa0 libnatpmp1 libnet-dns-perl  
libnet-domain-tld-perl libnet-ip-perl libnetcdf13 libnfs11 libnice10  
libnm-glib4 libnm-util2 libnorm1 libofa0 libogdi3.2 libopenal-data  
libopenal1 libopencv-core3.2 libopencv-imgproc3.2 libopenexr22 libopenjp2-7  
libopenmpt-modplug1 libopenmpt0 libpangomm-1.4-1v5  
libparse-debianchangelog-perl libpeas-common libperlio-gzip-perl  
libpgm-5.2-0 libplacebo4 libplist3 libpq5 libproj12 libprotobuf-lite10  
libpulse-mainloop-glib0 libpwquality-common libpwquality1 libqhull7  
libqqwing2v5 libqt4-dbus libqt4-network libqt4-script libqt4-sql  
libqt4-sql-mysql libqt4-xml libqt4-xmlpatterns libqt5concurrent5  
libqt5core5a libqt5dbus5 libqt5network5 libqt5script5 libqt5sql5  
libqt5sql5-sqlite libqt5test5 libqt5texttospeech5 libqt5xml5 libqtcore4  
libqtdbus4 libraw1394-11 libresid-builder0c2a librest-0.7-0 librubberband2  
libsane-common libsbc1 libsdl1.2debian libserd-0-0 libsgutils2-2 libshine3  
libshout3 libsidplay2 libsigc+±2.0-0v5 libsignon-glib1 libsocket++1  
libsodium23 libsord-0-0 libsoundtouch1 libsoup-gnome2.4-1 libspatialite7  
libspeex1 libsratom-0-0 libsrtp2-1 libssh2-1 libstartup-notification0  
libsuperlu5 libtag1v5 libtag1v5-vanilla libtelepathy-glib0  
libtext-levenshtein-perl libtimezonemap-data libtotem-plparser-common  
libtotem-plparser18 libtracker-sparql-2.0-0 libtwolame0  
libunity-protocol-private0 libunity-scopes-json-def-desktop libunity9  
libupnp6 libupower-glib3 liburiparser1 liburl-dispatcher1  
libusageenvironment3 libusbmuxd4 libva-wayland2 libvlc5 libvlccore9  
libvo-aacenc0 libvo-amrwbenc0 libvorbisfile3 libvpx5 libwavpack1  
libwayland-egl1-mesa libwebp6 libwebpdemux2 libwebpmux3  
libwhoopsie-preferences0 libwildmidi-config libwildmidi2 libwinpr2-2  
libwnck-3-common libwoff1 libwxbase3.0-0v5 libx265-146 libxapian30  
libxcb-res0 libxcb-xinerama0 libxerces-c3.2 libxkbcommon-x11-0 libxklavier16  
libxml-libxml-perl libxml-namespacesupport-perl libxml-sax-base-perl  
libxml-sax-expat-perl libxml-sax-perl libxml-simple-perl libxrandr-dev  
libxrender-dev libxres1 libxvidcore4 libyaml-cpp-dev libyaml-cpp0.5v5  
libyaml-libyaml-perl libzeitgeist-1.0-1 libzeitgeist-2.0-0 libzmq5  
libzvbi-common libzvbi0 lintian media-player-info  
mobile-broadband-provider-info notify-osd-icons odbcinst odbcinst1debian2  
p11-kit p11-kit-modules patchutils poppler-data proj-bin proj-data  
python-cairo python-defusedxml python-gps python-netifaces python-olefile  
python-paramiko python-pyasn1 python-pycryptodome python-wxversion  
python3-aptdaemon python3-blinker python3-bs4 python3-cairo python3-cups  
python3-cupshelpers python3-dateutil python3-debconf python3-debian  
python3-defer python3-feedparser python3-gi-cairo python3-html5lib  
python3-jwt python3-lxml python3-macaroonbakery python3-mako  
python3-markupsafe python3-nacl python3-oauthlib python3-olefile  
python3-protobuf python3-pyatspi python3-pymacaroons python3-rfc3339  
python3-speechd python3-tz python3-webencodings python3-yaml qdbus qt5-qmake  
qt5-qmake-bin qtbase5-dev-tools qtchooser qtcore4-l10n qttranslations5-l10n  
remmina-common rhythmbox-data ros-melodic-actionlib-msgs ros-melodic-bond  
ros-melodic-bond-core ros-melodic-bondcpp ros-melodic-bondpy  
ros-melodic-camera-calibration-parsers ros-melodic-camera-info-manager  
ros-melodic-cmake-modules ros-melodic-common-msgs  
ros-melodic-diagnostic-msgs ros-melodic-mk ros-melodic-nav-msgs  
ros-melodic-nodelet ros-melodic-ros ros-melodic-rosbag-migration-rule  
ros-melodic-rosbag-storage ros-melodic-rosbash ros-melodic-rosboost-cfg  
ros-melodic-rosclean ros-melodic-rosconsole-bridge ros-melodic-roscpp-core  
ros-melodic-roscreate ros-melodic-rosgraph ros-melodic-roslang  
ros-melodic-roslaunch ros-melodic-roslisp ros-melodic-roslz4  
ros-melodic-rosmake ros-melodic-rosmaster ros-melodic-rosout  
ros-melodic-rosparam ros-melodic-rospy ros-melodic-rostest  
ros-melodic-rosunit ros-melodic-shape-msgs ros-melodic-smclib  
ros-melodic-std-srvs ros-melodic-stereo-msgs ros-melodic-topic-tools  
ros-melodic-trajectory-msgs ros-melodic-visualization-msgs sbcl  
session-migration shotwell-common sound-theme-freedesktop  
system-config-printer-udev t1utils totem-common transmission-common  
ubuntu-system-service ubuntu-touch-sounds ubuntu-wallpapers  
ubuntu-wallpapers-bionic unity-gtk-module-common unity-lens-applications  
unity-lens-files unity-lens-music unity-lens-photos unity-lens-video  
unity-schemas unity-scope-chromiumbookmarks unity-scope-colourlovers  
unity-scope-devhelp unity-scope-firefoxbookmarks unity-scope-home  
unity-scope-openclipart unity-scope-texdoc unity-scope-tomboy  
unity-scope-video-remote unity-scope-virtualbox unity-scope-yelp  
unity-scope-zotero unity-scopes-master-default unity-scopes-runner  
update-inetd update-notifier-common upower usbmuxd vlc-data  
whoopsie-preferences x11proto-randr-dev yelp-xsl zeitgeist-core  
zenity-common  
Use ‘sudo apt autoremove’ to remove them.  
The following packages will be REMOVED:  
activity-log-manager adwaita-icon-theme aisleriot appmenu-qt apport-gtk  
apturl bamfdaemon baobab ca-certificates-java cheese chromium-browser  
chromium-browser-l10n colord compiz compiz-gnome deja-dup eog evince  
evolution-data-server file-roller gcr gdm3 gedit ghostscript ghostscript-x  
gir1.2-appindicator3-0.1 gir1.2-gcr-3 gir1.2-gdkpixbuf-2.0  
gir1.2-gnomebluetooth-1.0 gir1.2-gnomedesktop-3.0 gir1.2-gtk-3.0  
gir1.2-gtksource-3.0 gir1.2-gweather-3.0 gir1.2-mutter-2 gir1.2-nma-1.0  
gir1.2-notify-0.7 gir1.2-peas-1.0 gir1.2-rb-3.0 gir1.2-rsvg-2.0  
gir1.2-totem-1.0 gir1.2-vte-2.91 gir1.2-webkit2-4.0 gir1.2-wnck-3.0 gjs  
gkbd-capplet gnome-bluetooth gnome-calculator gnome-calendar  
gnome-control-center gnome-disk-utility gnome-font-viewer  
gnome-getting-started-docs gnome-initial-setup gnome-keyring gnome-mahjongg  
gnome-mines gnome-online-accounts gnome-power-manager gnome-screensaver  
gnome-screenshot gnome-session-bin gnome-session-canberra  
gnome-settings-daemon gnome-shell gnome-software gnome-software-plugin-snap  
gnome-startup-applications gnome-sudoku gnome-system-monitor gnome-terminal  
gnome-themes-extra gnome-todo gnome-user-docs gnome-user-guide  
gnome-video-effects gnupg gpg-agent gpg-wks-client gpg-wks-server  
gpsd-clients grilo-plugins-0.3-base gstreamer1.0-clutter-3.0 gstreamer1.0-gl  
gstreamer1.0-libav gstreamer1.0-plugins-bad gstreamer1.0-plugins-good  
gtk-update-icon-cache gtk2-engines-murrine gtk2-engines-pixbuf gvfs-backends  
humanity-icon-theme ibus ibus-gtk3 ibus-table imagemagick imagemagick-6.q16  
indicator-applet indicator-application indicator-appmenu indicator-bluetooth  
indicator-datetime indicator-keyboard indicator-power indicator-sound  
language-selector-gnome libappindicator3-1 libappstream-glib8  
libavahi-ui-gtk3-0 libavcodec57 libavfilter6 libavformat57  
libblockdev-crypto2 libcanberra-gtk3-0 libcanberra-gtk3-module  
libcheese-gtk25 libcheese8 libchromaprint1 libclutter-1.0-0  
libclutter-gst-3.0-0 libclutter-gtk-1.0-0 libcogl-pango20 libcogl-path20  
libcogl20 libcolord-gtk1 libcupsfilters1 libdazzle-1.0-0 libdbusmenu-gtk3-4  
libdbusmenu-qt2 libdbusmenu-qt5-2 libdjvulibre21 libdmapsharing-3.0-2  
libedataserverui-1.2-2 libevdocument3-4 libevview3-3 libfreeimage-dev  
libfreeimage3 libfreerdp-client2-2 libfreerdp2-2 libgail-3-0 libgail-common  
libgail18 libgcr-ui-3-1 libgd3 libgdal20 libgdk-pixbuf2.0-0  
libgdk-pixbuf2.0-bin libgeotiff2 libgjs0g libgnome-bluetooth13  
libgnome-desktop-3-17 libgnome-games-support-1-3 libgnomekbd8  
libgoa-backend-1.0-1 libgphoto2-6 libgpod-common libgpod4 libgs9  
libgspell-1-1 libgtk-3-0 libgtk-3-bin libgtk2.0-0 libgtk2.0-bin libgtk3-perl  
libgtkmm-3.0-1v5 libgtksourceview-3.0-1 libgweather-3-15 libgxps2  
libhdf4-0-alt libido3-0.1-0 libindicator3-7 libjpeg-dev libjpeg8  
libjpeg8-dev libkf5auth5 libkf5configgui5 libkf5configwidgets5 libkf5crash5  
libkf5dbusaddons5 libkf5guiaddons5 libkf5iconthemes5 libkf5itemviews5  
libkf5notifications5 libkf5service-bin libkf5service5 libkf5wallet-bin  
libkf5wallet5 libkf5widgetsaddons5 libkf5windowsystem5 libkwalletbackend5-5  
liblcms2-utils libmagickcore-6.q16-3 libmagickcore-6.q16-3-extra  
libmagickwand-6.q16-3 libmediaart-2.0-0 libmetacity1 libmng2 libmutter-2-0  
libnautilus-extension1a libnm-gtk0 libnma0 libnotify-bin libnotify4  
libnux-4.0-0 libopencv libopencv-dev libopencv-imgcodecs3.2 libopencv-python  
libopencv-samples libopencv-videoio3.2 libpanel-applet3 libpeas-1.0-0  
libphonon4qt5-4 libpolkit-qt5-1-1 libpoppler-glib8 libpoppler73  
libqt4-declarative libqt5gui5 libqt5opengl5 libqt5opengl5-dev  
libqt5printsupport5 libqt5svg5 libqt5widgets5 libqt5x11extras5 libqtgui4  
libraw16 librhythmbox-core10 librsvg2-2 librsvg2-common libsane1  
libsdl-image1.2 libspandsp2 libspectre1 libtiff5 libtimezonemap1 libtotem0  
libunity-control-center1 libunity-core-6.0-9 libunity-gtk2-parser0  
libunity-gtk3-parser0 libunity-misc4 libunity-settings-daemon1 libv4l-0  
libv4lconvert0 libvisionworks-samples libvisionworks-sfm-dev  
libvisionworks-tracking-dev libvncclient1 libvolume-key1 libvte-2.91-0  
libwebkit2gtk-4.0-37 libwmf0.2-7 libwmf0.2-7-gtk libwnck-3-0  
libwxgtk3.0-gtk3-0v5 libyelp0 libzbar0 light-themes mousetweaks mutter  
nautilus nautilus-extension-gnome-terminal nautilus-share netpbm  
network-manager-gnome network-manager-pptp-gnome notification-daemon  
notify-osd nvidia-jetpack opencv-licenses openjdk-8-jdk  
openjdk-8-jdk-headless openjdk-8-jre openjdk-8-jre-headless orca phonon4qt5  
phonon4qt5-backend-vlc pinentry-gnome3 policykit-1-gnome poppler-utils  
printer-driver-c2esp printer-driver-pnm2ppa printer-driver-ptouch  
printer-driver-sag-gdi python-gnupg python-gtk2 python-pil python-wxgtk3.0  
python-wxtools python3-aptdaemon.gtk3widgets python3-pil qt-at-spi  
qt5-gtk-platformtheme qtbase5-dev remmina remmina-plugin-rdp  
remmina-plugin-secret remmina-plugin-vnc rhythmbox  
rhythmbox-plugin-alternative-toolbar rhythmbox-plugin-zeitgeist  
rhythmbox-plugins ros-melodic-actionlib ros-melodic-cv-bridge  
ros-melodic-dynamic-reconfigure ros-melodic-image-publisher  
ros-melodic-nodelet-core ros-melodic-nodelet-topic-tools  
ros-melodic-ros-base ros-melodic-ros-comm ros-melodic-ros-core  
ros-melodic-rosbag ros-melodic-rosmsg ros-melodic-rosnode  
ros-melodic-rosservice ros-melodic-rostopic ros-melodic-roswtf sane-utils  
seahorse session-shortcuts shotwell simple-scan software-properties-gtk  
system-config-printer system-config-printer-common totem totem-plugins  
transmission-gtk ubuntu-artwork ubuntu-desktop ubuntu-docs ubuntu-mono  
ubuntu-release-upgrader-gtk ubuntu-session ubuntu-software unity  
unity-asset-pool unity-control-center unity-greeter unity-gtk2-module  
unity-gtk3-module unity-scope-calculator unity-scope-manpages unity-services  
unity-session unity-settings-daemon update-manager update-notifier vino  
vlc-plugin-base vlc-plugin-video-output vpi-samples xdg-user-dirs-gtk  
xloadimage yelp zeitgeist-datahub zenity  
0 upgraded, 0 newly installed, 356 to remove and 0 not upgraded.  
After this operation, 1,169 MB disk space will be freed.  
Do you want to continue? [Y/n] y  
dpkg: error: info database format (2) is bogus or too new; try getting a newer dpkg  
E: Sub-process dpkg --set-selections returned an error code (2)  
E: Couldn’t record the approved state changes as dpkg selection states  
jetbot@jetson:~$ sudo ln -s /usr/include/locale.h /usr/include/xlocale.h  
jetbot@jetson:~$ sudo pip3 install numpy grpcio absl-py py-cpuinfo psutil portpicker six mock requests gast h5py astor termcolor protobuf keras-applications keras-preprocessing wrapt google-pasta  
WARNING: The directory ‘/home/jetbot/.cache/pip’ or its parent directory is not owned or is not writable by the current user. The cache has been disabled. Check the permissions and owner of that directory. If executing pip with sudo, you may want sudo’s -H flag.  
Requirement already satisfied: numpy in /usr/local/lib/python3.6/dist-packages (1.19.4)  
Requirement already satisfied: grpcio in /usr/local/lib/python3.6/dist-packages (1.38.0)  
Requirement already satisfied: absl-py in /usr/local/lib/python3.6/dist-packages (0.12.0)  
Requirement already satisfied: py-cpuinfo in /usr/local/lib/python3.6/dist-packages (8.0.0)  
Requirement already satisfied: psutil in /usr/local/lib/python3.6/dist-packages (5.8.0)  
Requirement already satisfied: portpicker in /usr/local/lib/python3.6/dist-packages (1.3.9)  
Requirement already satisfied: six in /usr/local/lib/python3.6/dist-packages (1.16.0)  
Requirement already satisfied: mock in /usr/local/lib/python3.6/dist-packages (3.0.5)  
Requirement already satisfied: requests in /usr/local/lib/python3.6/dist-packages (2.25.1)  
Requirement already satisfied: gast in /usr/local/lib/python3.6/dist-packages (0.2.2)  
Requirement already satisfied: h5py in /usr/local/lib/python3.6/dist-packages (2.10.0)  
Requirement already satisfied: astor in /usr/local/lib/python3.6/dist-packages (0.8.1)  
Requirement already satisfied: termcolor in /usr/local/lib/python3.6/dist-packages (1.1.0)  
Requirement already satisfied: protobuf in /usr/local/lib/python3.6/dist-packages (3.17.0)  
Requirement already satisfied: keras-applications in /usr/local/lib/python3.6/dist-packages (1.0.8)  
Requirement already satisfied: keras-preprocessing in /usr/local/lib/python3.6/dist-packages (1.1.1)  
Requirement already satisfied: wrapt in /usr/local/lib/python3.6/dist-packages (1.12.1)  
Requirement already satisfied: google-pasta in /usr/local/lib/python3.6/dist-packages (0.2.0)  
Requirement already satisfied: chardet\<5,\>=3.0.2 in /usr/lib/python3/dist-packages (from requests) (3.0.4)  
Requirement already satisfied: urllib3\<1.27,\>=1.21.1 in /usr/lib/python3/dist-packages (from requests) (1.22)  
Requirement already satisfied: certifi\>=2017.4.17 in /usr/lib/python3/dist-packages (from requests) (2018.1.18)  
Requirement already satisfied: idna\<3,\>=2.5 in /usr/lib/python3/dist-packages (from requests) (2.6)  
WARNING: You are using pip version 20.2.4; however, version 21.1.2 is available.  
You should consider upgrading via the ‘/usr/bin/python3 -m pip install --upgrade pip’ command.  
jetbot@jetson:~$ sudo pip3 install --pre --extra-index-url [https://developer.download.nvidia.com/compute/redist/jp/v43](https://developer.download.nvidia.com/compute/redist/jp/v43) tensorflow  
WARNING: The directory ‘/home/jetbot/.cache/pip’ or its parent directory is not owned or is not writable by the current user. The cache has been disabled. Check the permissions and owner of that directory. If executing pip with sudo, you may want sudo’s -H flag.  
Looking in indexes: [Simple index](https://pypi.org/simple), [https://developer.download.nvidia.com/compute/redist/jp/v43](https://developer.download.nvidia.com/compute/redist/jp/v43)  
Requirement already satisfied: tensorflow in ./.local/lib/python3.6/site-packages (1.8.0)  
Requirement already satisfied: gast\>=0.2.0 in /usr/local/lib/python3.6/dist-packages (from tensorflow) (0.2.2)  
Requirement already satisfied: absl-py\>=0.1.6 in /usr/local/lib/python3.6/dist-packages (from tensorflow) (0.12.0)  
Requirement already satisfied: protobuf\>=3.4.0 in /usr/local/lib/python3.6/dist-packages (from tensorflow) (3.17.0)  
Requirement already satisfied: astor\>=0.6.0 in /usr/local/lib/python3.6/dist-packages (from tensorflow) (0.8.1)  
Requirement already satisfied: termcolor\>=1.1.0 in /usr/local/lib/python3.6/dist-packages (from tensorflow) (1.1.0)  
Collecting tensorboard\<1.9.0,\>=1.8.0  
Downloading tensorboard-1.8.0-py3-none-any.whl (3.1 MB)  
|████████████████████████████████| 3.1 MB 5.4 MB/s  
Requirement already satisfied: grpcio\>=1.8.6 in /usr/local/lib/python3.6/dist-packages (from tensorflow) (1.38.0)  
Requirement already satisfied: six\>=1.10.0 in /usr/local/lib/python3.6/dist-packages (from tensorflow) (1.16.0)  
Requirement already satisfied: numpy\>=1.13.3 in /usr/local/lib/python3.6/dist-packages (from tensorflow) (1.19.4)  
Requirement already satisfied: wheel\>=0.26 in /usr/lib/python3/dist-packages (from tensorflow) (0.30.0)  
Requirement already satisfied: werkzeug\>=0.11.10 in /usr/local/lib/python3.6/dist-packages (from tensorboard\<1.9.0,\>=1.8.0-\>tensorflow) (1.0.1)  
Requirement already satisfied: markdown\>=2.6.8 in /usr/local/lib/python3.6/dist-packages (from tensorboard\<1.9.0,\>=1.8.0-\>tensorflow) (3.2.1)  
Requirement already satisfied: html5lib==0.9999999 in ./.local/lib/python3.6/site-packages (from tensorboard\<1.9.0,\>=1.8.0-\>tensorflow) (0.9999999)  
Requirement already satisfied: bleach==1.5.0 in ./.local/lib/python3.6/site-packages (from tensorboard\<1.9.0,\>=1.8.0-\>tensorflow) (1.5.0)  
Requirement already satisfied: setuptools\>=36 in /usr/local/lib/python3.6/dist-packages (from markdown\>=2.6.8-\>tensorboard\<1.9.0,\>=1.8.0-\>tensorflow) (49.6.0)  
Installing collected packages: tensorboard  
Attempting uninstall: tensorboard  
Found existing installation: tensorboard 1.14.0  
Uninstalling tensorboard-1.14.0:  
Successfully uninstalled tensorboard-1.14.0  
ERROR: After October 2020 you may experience errors when installing or updating packages. This is because pip will change the way that it resolves dependency conflicts.

We recommend you use --use-feature=2020-resolver to test your packages with the new resolver before it becomes the default.

tensorflow-gpu 1.14.0+nv19.10 requires tensorboard\<1.15.0,\>=1.14.0, but you’ll have tensorboard 1.8.0 which is incompatible.  
Successfully installed tensorboard-1.8.0  
WARNING: You are using pip version 20.2.4; however, version 21.1.2 is available.  
You should consider upgrading via the ‘/usr/bin/python3 -m pip install --upgrade pip’ command.

---

<div class="post-metadata">

### Author: ![AastaLLL](https://sea2.discourse-cdn.com/nvidia/user_avatar/forums.developer.nvidia.com/aastalll/32/14043_2.png) [@AastaLLL](https://forums.developer.nvidia.com/u/AastaLLL)
#### Post date: [June 25, 2021, 6:34am UTC](https://forums.developer.nvidia.com/t/tensorflow/178809/7 "2021-06-25T06:34:02Z")

</div>

Hi,

Based on your error, could you manually install _tensorboard-1.14.0_ first.  
Then install the TensorFlow package without checking dependency to see it it works?

```auto
$ sudo pip3 install --no-dependencies ...

```

Thanks.

---

<div class="post-metadata">

### Author: ![system](https://sea2.discourse-cdn.com/nvidia/user_avatar/forums.developer.nvidia.com/system/32/68080_2.png) [@system](https://forums.developer.nvidia.com/u/system)
#### Post date: [August 29, 2021, 7:03am UTC](https://forums.developer.nvidia.com/t/tensorflow/178809/9 "2021-08-29T07:03:56Z")

</div>

This topic was automatically closed 60 days after the last reply. New replies are no longer allowed.
