Unable to build basic android app with codeworks 1R8

I recently installed CodeWorks-1R8-windows_b181.exe
Then to get started I created a hello world android app.
However it wont build and complains about not been able to find the toolchain.
If have tried setting different values in the project->properties->general->toolchain version fields all to no avail.

below if the build log

------ Build started: Project: Android1, Configuration: Debug Tegra-Android ------
1>Android1.vcxproj -> C:\Projects\External\CricketCaptain\CricketCaptain\Work\sample\Android1\Tegra-Android\Debug\libAndroid1.so
1>Stripping C:\Projects\External\CricketCaptain\CricketCaptain\Work\sample\Android1\Tegra-Android\Debug\libAndroid1.so to C:\Projects\External\CricketCaptain\CricketCaptain\Work\sample\Android1\Tegra-Android\Debug\stripped_libAndroid1.so
1>Adding debuglink C:\Projects\External\CricketCaptain\CricketCaptain\Work\sample\Android1\Tegra-Android\Debug\libAndroid1.so to C:\Projects\External\CricketCaptain\CricketCaptain\Work\sample\Android1\Tegra-Android\Debug\stripped_libAndroid1.so
1>Building with build tools 28.0.3
1>Building using the JDK located here: ‘C:\NVPACK\jdk1.8.0_77 (Native64Bit)’…
1>C:\Program Files (x86)\Microsoft Visual Studio\2017\Community\Common7\IDE\VC\VCTargets\Platforms\Tegra-Android\Nvidia.AndroidBuild.targets(347,5): warning : When using a 64-bit Java runtime incremental builds may not function correctly.
1>Executing "C:\NVPACK\gradle-4.4.1\bin\gradle.bat --project-cache-dir “C:\Projects\External\CricketCaptain\CricketCaptain\Work\sample\Android1\Android1\Tegra-Android\Debug\gradle_cache” -i -Pnsight_tegra_build_properties_file_path=“C:\Projects\External\CricketCaptain\CricketCaptain\Work\sample\Android1\Android1\Tegra-Android\Debug\nsight_tegra_build_properties.gradle” -b “C:\Projects\External\CricketCaptain\CricketCaptain\Work\sample\Android1\Android1\Tegra-Android\Debug\nsight_tegra_root_build.gradle” assembleDebug "
1>Initialized native services in: C:\Users\USER.gradle\native
1>The client will now receive all logging from the daemon (pid: 9048). The daemon log file: C:\Users\USER.gradle\daemon\4.4.1\daemon-9048.out.log
1>Starting 6th build in daemon [uptime: 26 mins 10.968 secs, performance: 100%, no major garbage collections]
1>Using 4 worker leases.
1>Closing daemon’s stdin at end of input.
1>The daemon will no longer process any standard input.
1>Creating new cache for fileHashes, path C:\Projects\External\CricketCaptain\CricketCaptain\Work\sample\Android1\Android1\Tegra-Android\Debug\gradle_cache\4.4.1\fileHashes\fileHashes.bin, access org.gradle.cache.internal.DefaultCacheAccess@459b325
1>Starting Build
1>Settings evaluated using settings file ‘C:\Projects\External\CricketCaptain\CricketCaptain\Work\sample\Android1\Android1\Tegra-Android\Debug\settings.gradle’.
1>Projects loaded. Root project using build file ‘C:\Projects\External\CricketCaptain\CricketCaptain\Work\sample\Android1\Android1\Tegra-Android\Debug\nsight_tegra_root_build.gradle’.
1>Included projects: [root project ‘rootAndroid1’, project ‘:Android1’]
1>Evaluating root project ‘rootAndroid1’ using build file ‘C:\Projects\External\CricketCaptain\CricketCaptain\Work\sample\Android1\Android1\Tegra-Android\Debug\nsight_tegra_root_build.gradle’.
1>Creating new cache for metadata-1.1/results, path C:\Users\USER.gradle\caches\transforms-1\metadata-1.1\results.bin, access org.gradle.cache.internal.DefaultCacheAccess@591a7133
1>Creating new cache for metadata-2.36/module-metadata, path C:\Users\USER.gradle\caches\modules-2\metadata-2.36\module-metadata.bin, access org.gradle.cache.internal.DefaultCacheAccess@61e39a49
1>Creating new cache for metadata-2.36/module-artifact, path C:\Users\USER.gradle\caches\modules-2\metadata-2.36\module-artifact.bin, access org.gradle.cache.internal.DefaultCacheAccess@61e39a49
1>Evaluating project ‘:Android1’ using build file ‘C:\Projects\External\CricketCaptain\CricketCaptain\Work\sample\Android1\Android1\Tegra-Android\Debug\Android1\nsight_tegra_build.gradle’.
1>Creating configuration compile
1>Creating configuration apk
1>Creating configuration provided
1>Creating configuration wearApp
1>Creating configuration annotationProcessor
1>Creating configuration jackPlugin
1>Creating configuration androidTestCompile
1>Creating configuration androidTestApk
1>Creating configuration androidTestProvided
1>Creating configuration androidTestWearApp
1>Creating configuration androidTestAnnotationProcessor
1>Creating configuration androidTestJackPlugin
1>Creating configuration testCompile
1>Creating configuration testApk
1>Creating configuration testProvided
1>Creating configuration testWearApp
1>Creating configuration testAnnotationProcessor
1>Creating configuration testJackPlugin
1>Creating configuration debugCompile
1>Creating configuration debugApk
1>Creating configuration debugProvided
1>Creating configuration debugWearApp
1>Creating configuration debugAnnotationProcessor
1>Creating configuration debugJackPlugin
1>Creating configuration testDebugCompile
1>Creating configuration testDebugApk
1>Creating configuration testDebugProvided
1>Creating configuration testDebugWearApp
1>Creating configuration testDebugAnnotationProcessor
1>Creating configuration testDebugJackPlugin
1>Creating configuration releaseCompile
1>Creating configuration releaseApk
1>Creating configuration releaseProvided
1>Creating configuration releaseWearApp
1>Creating configuration releaseAnnotationProcessor
1>Creating configuration releaseJackPlugin
1>Creating configuration testReleaseCompile
1>Creating configuration testReleaseApk
1>Creating configuration testReleaseProvided
1>Creating configuration testReleaseWearApp
1>Creating configuration testReleaseAnnotationProcessor
1>Creating configuration testReleaseJackPlugin
1>Parsing the SDK, no caching allowed
1>SDK initialized in 193 ms
1>The CompileOptions.bootClasspath property has been deprecated and is scheduled to be removed in Gradle 5.0. Please use the CompileOptions.bootstrapClasspath property instead.
1>Using incremental javac compilation for :Android1 debug.
1>
1>FAILURE: Build failed with an exception.
1>
1>* What went wrong:
1>A problem occurred configuring project ‘:Android1’.
1>> No toolchains found in the NDK toolchains folder for ABI with prefix: mips64el-linux-android
1>
1>* Try:
1>Run with --stacktrace option to get the stack trace. Run with --debug option to get more log output. Run with --scan to get full insights.
1>
1>* Get more help at https://help.gradle.org
1>
1>BUILD FAILED in 5s
1>Picked up _JAVA_OPTIONS: -Xms256m -Xmx1024m
1>C:\Program Files (x86)\Microsoft Visual Studio\2017\Community\Common7\IDE\VC\VCTargets\Platforms\Tegra-Android\Nvidia.AndroidBuild.targets(347,5): error MSB6006: “gradle.bat” exited with code 1.
1>Done building project “Android1.vcxproj” – FAILED.
========== Build: 0 succeeded, 1 failed, 0 up-to-date, 0 skipped ==========

How do I fix this ?