Unable to build CUDA SDK in Visual Studio 2010 even after preforming goop in README_CUDA4-0-BuildCus

Unable to build CUDA SDK in Visual Studio 2010 even after preforming goop in README_CUDA4-0-BuildCustomization.txt. Seems it cannot find stopwatch.cpp. I appears that it fails to find, but later compiles stopwatch.cpp. 2 successful and 93 failed I think I’ll have better luck winning the lottery than getting this to compile anytime soon

[code]

1>------ Rebuild All started: Project: shrUtils, Configuration: Debug x64 ------

2>------ Rebuild All started: Project: template_runtime, Configuration: Debug x64 ------

3>------ Rebuild All started: Project: cudaEncode, Configuration: Debug x64 ------

2>C:\Program Files (x86)\MSBuild\Microsoft.Cpp\v4.0\BuildCustomizations\CUDA 4.0.targets(76,9): error MSB4062: The “Nvda.Build.CudaTasks.SanitizePaths” task could not be loaded from the assembly C:\Program Files (x86)\MSBuild\Microsoft.Cpp\v4.0\BuildCustomizations\Nvda.Build.CudaTasks.v4.0.dll. Could not load file or assembly ‘file:///C:\Program Files (x86)\MSBuild\Microsoft.Cpp\v4.0\BuildCustomizations\Nvda.Build.CudaTasks.v4.0.dll’ or one of its dependencies. The system cannot find the file specified. Confirm that the declaration is correct, that the assembly and all its dependencies are available, and that the task contains a public class that implements Microsoft.Build.Framework.ITask.

1> cmd_arg_reader.cpp

3> VideoEncoder.cpp

1> shrUtils.cpp

1> Note: including windows.h

1> Note: including math.h

1> Note: including assert.h

3> main.cpp

1> stopwatch.cpp

1>c1xx : fatal error C1083: Cannot open source file: ‘src\stopwatch.cpp’: No such file or directory

1> stopwatch_win.cpp

1>c1xx : fatal error C1083: Cannot open source file: ‘src\stopwatch_win.cpp’: No such file or directory

1> Generating Code…

3> Note: including windows.h

3> Note: including math.h

3> Note: including assert.h

3> stopwatch_win.cpp

3> stopwatch.cpp

4>------ Rebuild All started: Project: cutil, Configuration: Debug x64 ------

4> bank_checker.cpp

3> cutil.cpp

4> cmd_arg_reader.cpp

3> Generating Code…

4> cutil.cpp

4> stopwatch.cpp

4> stopwatch_win.cpp

4> Generating Code…

3> cudaEncode_vs2010.vcxproj -> C:\ProgramData\NVIDIA Corporation\NVIDIA GPU Computing SDK 4.0\C\src\cudaEncode…/…/bin/win64/Debug/cudaEncode.exe

4> Creating library C:\ProgramData\NVIDIA Corporation\NVIDIA GPU Computing SDK 4.0\C\common\lib\x64\cutil64D.lib and object C:\ProgramData\NVIDIA Corporation\NVIDIA GPU Computing SDK 4.0\C\common\lib\x64\cutil64D.exp

4> cutil_vs2010.vcxproj -> C:\ProgramData\NVIDIA Corporation\NVIDIA GPU Computing SDK 4.0\C\common\lib\x64\cutil64D.dll

4> Creating library C:\ProgramData\NVIDIA Corporation\NVIDIA GPU Computing SDK 4.0\C\common\lib\x64\cutil64D.lib and object C:\ProgramData\NVIDIA Corporation\NVIDIA GPU Computing SDK 4.0\C\common\lib\x64\cutil64D.exp

4> cutil_vs2010.vcxproj -> C:\ProgramData\NVIDIA Corporation\NVIDIA GPU Computing SDK 4.0\C\common\lib\x64\cutil64D.dll

4> A subdirectory or file …\bin\win64\Debug already exists.

4> 1 file(s) copied.

5>------ Rebuild All started: Project: SingleAsianOptionP, Configuration: Debug x64 ------

6>------ Rebuild All started: Project: EstimatePiQ, Configuration: Debug x64 ------

7>------ Rebuild All started: Project: EstimatePiP, Configuration: Debug x64 ------

8>------ Rebuild All started: Project: EstimatePiInlineQ, Configuration: Debug x64 ------

7>C:\Program Files (x86)\MSBuild\Microsoft.Cpp\v4.0\BuildCustomizations\CUDA 4.0.targets(76,9): error MSB4062: The “Nvda.Build.CudaTasks.SanitizePaths” task could not be loaded from the assembly C:\Program Files (x86)\MSBuild\Microsoft.Cpp\v4.0\BuildCustomizations\Nvda.Build.CudaTasks.v4.0.dll. Could not load file or assembly ‘file:///C:\Program Files (x86)\MSBuild\Microsoft.Cpp\v4.0\BuildCustomizations\Nvda.Build.CudaTasks.v4.0.dll’ or one of its dependencies. The system cannot find the file specified. Confirm that the declaration is correct, that the assembly and all its dependencies are available, and that the task contains a public class that implements Microsoft.Build.Framework.ITask.

5>C:\Program Files (x86)\MSBuild\Microsoft.Cpp\v4.0\BuildCustomizations\CUDA 4.0.targets(76,9): error MSB4062: The “Nvda.Build.CudaTasks.SanitizePaths” task could not be loaded from the assembly C:\Program Files (x86)\MSBuild\Microsoft.Cpp\v4.0\BuildCustomizations\Nvda.Build.CudaTasks.v4.0.dll. Could not load file or assembly ‘file:///C:\Program Files (x86)\MSBuild\Microsoft.Cpp\v4.0\BuildCustomizations\Nvda.Build.CudaTasks.v4.0.dll’ or one of its dependencies. The system cannot find the file specified. Confirm that the declaration is correct, that the assembly and all its dependencies are available, and that the task contains a public class that implements Microsoft.Build.Framework.ITask.

6>C:\Program Files (x86)\MSBuild\Microsoft.Cpp\v4.0\BuildCustomizations\CUDA 4.0.targets(76,9): error MSB4062: The “Nvda.Build.CudaTasks.SanitizePaths” task could not be loaded from the assembly C:\Program Files (x86)\MSBuild\Microsoft.Cpp\v4.0\BuildCustomizations\Nvda.Build.CudaTasks.v4.0.dll. Could not load file or assembly ‘file:///C:\Program Files (x86)\MSBuild\Microsoft.Cpp\v4.0\BuildCustomizations\Nvda.Build.CudaTasks.v4.0.dll’ or one of its dependencies. The system cannot find the file specified. Confirm that the declaration is correct, that the assembly and all its dependencies are available, and that the task contains a public class that implements Microsoft.Build.Framework.ITask.

9>------ Rebuild All started: Project: EstimatePiInlineP, Configuration: Debug x64 ------

10>------ Rebuild All started: Project: volumeRender, Configuration: Debug x64 ------

11>------ Rebuild All started: Project: vectorAddDrv, Configuration: Debug x64 ------

9>C:\Program Files (x86)\MSBuild\Microsoft.Cpp\v4.0\BuildCustomizations\CUDA 4.0.targets(76,9): error MSB4062: The “Nvda.Build.CudaTasks.SanitizePaths” task could not be loaded from the assembly C:\Program Files (x86)\MSBuild\Microsoft.Cpp\v4.0\BuildCustomizations\Nvda.Build.CudaTasks.v4.0.dll. Could not load file or assembly ‘file:///C:\Program Files (x86)\MSBuild\Microsoft.Cpp\v4.0\BuildCustomizations\Nvda.Build.CudaTasks.v4.0.dll’ or one of its dependencies. The system cannot find the file specified. Confirm that the declaration is correct, that the assembly and all its dependencies are available, and that the task contains a public class that implements Microsoft.Build.Framework.ITask.

10>C:\Program Files (x86)\MSBuild\Microsoft.Cpp\v4.0\BuildCustomizations\CUDA 4.0.targets(76,9): error MSB4062: The “Nvda.Build.CudaTasks.SanitizePaths” task could not be loaded from the assembly C:\Program Files (x86)\MSBuild\Microsoft.Cpp\v4.0\BuildCustomizations\Nvda.Build.CudaTasks.v4.0.dll. Could not load file or assembly ‘file:///C:\Program Files (x86)\MSBuild\Microsoft.Cpp\v4.0\BuildCustomizations\Nvda.Build.CudaTasks.v4.0.dll’ or one of its dependencies. The system cannot find the file specified. Confirm that the declaration is correct, that the assembly and all its dependencies are available, and that the task contains a public class that implements Microsoft.Build.Framework.ITask.

8>C:\Program Files (x86)\MSBuild\Microsoft.Cpp\v4.0\BuildCustomizations\CUDA 4.0.targets(76,9): error MSB4062: The “Nvda.Build.CudaTasks.SanitizePaths” task could not be loaded from the assembly C:\Program Files (x86)\MSBuild\Microsoft.Cpp\v4.0\BuildCustomizations\Nvda.Build.CudaTasks.v4.0.dll. Could not load file or assembly ‘file:///C:\Program Files (x86)\MSBuild\Microsoft.Cpp\v4.0\BuildCustomizations\Nvda.Build.CudaTasks.v4.0.dll’ or one of its dependencies. The system cannot find the file specified. Confirm that the declaration is correct, that the assembly and all its dependencies are available, and that the task contains a public class that implements Microsoft.Build.Framework.ITask.

11>C:\Program Files (x86)\MSBuild\Microsoft.Cpp\v4.0\BuildCustomizations\CUDA 4.0.targets(76,9): error MSB4062: The “Nvda.Build.CudaTasks.SanitizePaths” task could not be loaded from the assembly C:\Program Files (x86)\MSBuild\Microsoft.Cpp\v4.0\BuildCustomizations\Nvda.Build.CudaTasks.v4.0.dll. Could not load file or assembly ‘file:///C:\Program Files (x86)\MSBuild\Microsoft.Cpp\v4.0\BuildCustomizations\Nvda.Build.CudaTasks.v4.0.dll’ or one of its dependencies. The system cannot find the file specified. Confirm that the declaration is correct, that the assembly and all its dependencies are available, and that the task contains a public class that implements Microsoft.Build.Framework.ITask.

12>------ Rebuild All started: Project: vectorAdd, Configuration: Debug x64 ------

13>------ Rebuild All started: Project: transpose, Configuration: Debug x64 ------

14>------ Rebuild All started: Project: threadMigration, Configuration: Debug x64 ------

15>------ Rebuild All started: Project: threadFenceReduction, Configuration: Debug x64 ------

14>C:\Program Files (x86)\MSBuild\Microsoft.Cpp\v4.0\BuildCustomizations\CUDA 4.0.targets(76,9): error MSB4062: The “Nvda.Build.CudaTasks.SanitizePaths” task could not be loaded from the assembly C:\Program Files (x86)\MSBuild\Microsoft.Cpp\v4.0\BuildCustomizations\Nvda.Build.CudaTasks.v4.0.dll. Could not load file or assembly ‘file:///C:\Program Files (x86)\MSBuild\Microsoft.Cpp\v4.0\BuildCustomizations\Nvda.Build.CudaTasks.v4.0.dll’ or one of its dependencies. The system cannot find the file specified. Confirm that the declaration is correct, that the assembly and all its dependencies are available, and that the task contains a public class that implements Microsoft.Build.Framework.ITask.

13>C:\Program Files (x86)\MSBuild\Microsoft.Cpp\v4.0\BuildCustomizations\CUDA 4.0.targets(76,9): error MSB4062: The “Nvda.Build.CudaTasks.SanitizePaths” task could not be loaded from the assembly C:\Program Files (x86)\MSBuild\Microsoft.Cpp\v4.0\BuildCustomizations\Nvda.Build.CudaTasks.v4.0.dll. Could not load file or assembly ‘file:///C:\Program Files (x86)\MSBuild\Microsoft.Cpp\v4.0\BuildCustomizations\Nvda.Build.CudaTasks.v4.0.dll’ or one of its dependencies. The system cannot find the file specified. Confirm that the declaration is correct, that the assembly and all its dependencies are available, and that the task contains a public class that implements Microsoft.Build.Framework.ITask.

12>C:\Program Files (x86)\MSBuild\Microsoft.Cpp\v4.0\BuildCustomizations\CUDA 4.0.targets(76,9): error MSB4062: The “Nvda.Build.CudaTasks.SanitizePaths” task could not be loaded from the assembly C:\Program Files (x86)\MSBuild\Microsoft.Cpp\v4.0\BuildCustomizations\Nvda.Build.CudaTasks.v4.0.dll. Could not load file or assembly ‘file:///C:\Program Files (x86)\MSBuild\Microsoft.Cpp\v4.0\BuildCustomizations\Nvda.Build.CudaTasks.v4.0.dll’ or one of its dependencies. The system cannot find the file specified. Confirm that the declaration is correct, that the assembly and all its dependencies are available, and that the task contains a public class that implements Microsoft.Build.Framework.ITask.

15>C:\Program Files (x86)\MSBuild\Microsoft.Cpp\v4.0\BuildCustomizations\CUDA 4.0.targets(76,9): error MSB4062: The “Nvda.Build.CudaTasks.SanitizePaths” task could not be loaded from the assembly C:\Program Files (x86)\MSBuild\Microsoft.Cpp\v4.0\BuildCustomizations\Nvda.Build.CudaTasks.v4.0.dll. Could not load file or assembly ‘file:///C:\Program Files (x86)\MSBuild\Microsoft.Cpp\v4.0\BuildCustomizations\Nvda.Build.CudaTasks.v4.0.dll’ or one of its dependencies. The system cannot find the file specified. Confirm that the declaration is correct, that the assembly and all its dependencies are available, and that the task contains a public class that implements Microsoft.Build.Framework.ITask.

16>------ Rebuild All started: Project: template, Configuration: Debug x64 ------

17>------ Rebuild All started: Project: sortingNetworks, Configuration: Debug x64 ------

18>------ Rebuild All started: Project: SobolQRNG, Configuration: Debug x64 ------

19>------ Rebuild All started: Project: SobelFilter, Configuration: Debug x64 ------

16>C:\Program Files (x86)\MSBuild\Microsoft.Cpp\v4.0\BuildCustomizations\CUDA 4.0.targets(76,9): error MSB4062: The “Nvda.Build.CudaTasks.SanitizePaths” task could not be loaded from the assembly C:\Program Files (x86)\MSBuild\Microsoft.Cpp\v4.0\BuildCustomizations\Nvda.Build.CudaTasks.v4.0.dll. Could not load file or assembly ‘file:///C:\Program Files (x86)\MSBuild\Microsoft.Cpp\v4.0\BuildCustomizations\Nvda.Build.CudaTasks.v4.0.dll’ or one of its dependencies. The system cannot find the file specified. Confirm that the declaration is correct, that the assembly and all its dependencies are available, and that the task contains a public class that implements Microsoft.Build.Framework.ITask.

18>C:\Program Files (x86)\MSBuild\Microsoft.Cpp\v4.0\BuildCustomizations\CUDA 4.0.targets(76,9): error MSB4062: The “Nvda.Build.CudaTasks.SanitizePaths” task could not be loaded from the assembly C:\Program Files (x86)\MSBuild\Microsoft.Cpp\v4.0\BuildCustomizations\Nvda.Build.CudaTasks.v4.0.dll. Could not load file or assembly ‘file:///C:\Program Files (x86)\MSBuild\Microsoft.Cpp\v4.0\BuildCustomizations\Nvda.Build.CudaTasks.v4.0.dll’ or one of its dependencies. The system cannot find the file specified. Confirm that the declaration is correct, that the assembly and all its dependencies are available, and that the task contains a public class that implements Microsoft.Build.Framework.ITask.

20>------ Rebuild All started: Project: smokeParticles, Configuration: Debug x64 ------

17>C:\Program Files (x86)\MSBuild\Microsoft.Cpp\v4.0\BuildCustomizations\CUDA 4.0.targets(76,9): error MSB4062: The “Nvda.Build.CudaTasks.SanitizePaths” task could not be loaded from the assembly C:\Program Files (x86)\MSBuild\Microsoft.Cpp\v4.0\BuildCustomizations\Nvda.Build.CudaTasks.v4.0.dll. Could not load file or assembly ‘file:///C:\Program Files (x86)\MSBuild\Microsoft.Cpp\v4.0\BuildCustomizations\Nvda.Build.CudaTasks.v4.0.dll’ or one of its dependencies. The system cannot find the file specified. Confirm that the declaration is correct, that the assembly and all its dependencies are available, and that the task contains a public class that implements Microsoft.Build.Framework.ITask.

19>C:\Program Files (x86)\MSBuild\Microsoft.Cpp\v4.0\BuildCustomizations\CUDA 4.0.targets(76,9): error MSB4062: The “Nvda.Build.CudaTasks.SanitizePaths” task could not be loaded from the assembly C:\Program Files (x86)\MSBuild\Microsoft.Cpp\v4.0\BuildCustomizations\Nvda.Build.CudaTasks.v4.0.dll. Could not load file or assembly ‘file:///C:\Program Files (x86)\MSBuild\Microsoft.Cpp\v4.0\BuildCustomizations\Nvda.Build.CudaTasks.v4.0.dll’ or one of its dependencies. The system cannot find the file specified. Confirm that the declaration is correct, that the assembly and all its dependencies are available, and that the task contains a public class that implements Microsoft.Build.Framework.ITask.

21>------ Rebuild All started: Project: SLID3D10Texture, Configuration: Debug x64 ------

20>C:\Program Files (x86)\MSBuild\Microsoft.Cpp\v4.0\BuildCustomizations\CUDA 4.0.targets(76,9): error MSB4062: The “Nvda.Build.CudaTasks.SanitizePaths” task could not be loaded from the assembly C:\Program Files (x86)\MSBuild\Microsoft.Cpp\v4.0\BuildCustomizations\Nvda.Build.CudaTasks.v4.0.dll. Could not load file or assembly ‘file:///C:\Program Files (x86)\MSBuild\Microsoft.Cpp\v4.0\BuildCustomizations\Nvda.Build.CudaTasks.v4.0.dll’ or one of its dependencies. The system cannot find the file specified. Confirm that the declaration is correct, that the assembly and all its dependencies are available, and that the task contains a public class that implements Microsoft.Build.Framework.ITask.

22>------ Rebuild All started: Project: simpleZeroCopy, Configuration: Debug x64 ------

23>------ Rebuild All started: Project: simpleVoteIntrinsics, Configuration: Debug x64 ------

21>C:\Program Files (x86)\MSBuild\Microsoft.Cpp\v4.0\BuildCustomizations\CUDA 4.0.targets(76,9): error MSB4062: The “Nvda.Build.CudaTasks.SanitizePaths” task could not be loaded from the assembly C:\Program Files (x86)\MSBuild\Microsoft.Cpp\v4.0\BuildCustomizations\Nvda.Build.CudaTasks.v4.0.dll. Could not load file or assembly ‘file:///C:\Program Files (x86)\MSBuild\Microsoft.Cpp\v4.0\BuildCustomizations\Nvda.Build.CudaTasks.v4.0.dll’ or one of its dependencies. The system cannot find the file specified. Confirm that the declaration is correct, that the assembly and all its dependencies are available, and that the task contains a public class that implements Microsoft.Build.Framework.ITask.

24>------ Rebuild All started: Project: simpleTexture3D, Configuration: Debug x64 ------

22>C:\Program Files (x86)\MSBuild\Microsoft.Cpp\v4.0\BuildCustomizations\CUDA 4.0.targets(76,9): error MSB4062: The “Nvda.Build.CudaTasks.SanitizePaths” task could not be loaded from the assembly C:\Program Files (x86)\MSBuild\Microsoft.Cpp\v4.0\BuildCustomizations\Nvda.Build.CudaTasks.v4.0.dll. Could not load file or assembly ‘file:///C:\Program Files (x86)\MSBuild\Microsoft.Cpp\v4.0\BuildCustomizations\Nvda.Build.CudaTasks.v4.0.dll’ or one of its dependencies. The system cannot find the file specified. Confirm that the declaration is correct, that the assembly and all its dependencies are available, and that the task contains a public class that implements Microsoft.Build.Framework.ITask.

25>------ Rebuild All started: Project: simpleTextureDrv, Configuration: Debug x64 ------

23>C:\Program Files (x86)\MSBuild\Microsoft.Cpp\v4.0\BuildCustomizations\CUDA 4.0.targets(76,9): error MSB4062: The “Nvda.Build.CudaTasks.SanitizePaths” task could not be loaded from the assembly C:\Program Files (x86)\MSBuild\Microsoft.Cpp\v4.0\BuildCustomizations\Nvda.Build.CudaTasks.v4.0.dll. Could not load file or assembly ‘file:///C:\Program Files (x86)\MSBuild\Microsoft.Cpp\v4.0\BuildCustomizations\Nvda.Build.CudaTasks.v4.0.dll’ or one of its dependencies. The system cannot find the file specified. Confirm that the declaration is correct, that the assembly and all its dependencies are available, and that the task contains a public class that implements Microsoft.Build.Framework.ITask.

24>C:\Program Files (x86)\MSBuild\Microsoft.Cpp\v4.0\BuildCustomizations\CUDA 4.0.targets(76,9): error MSB4062: The “Nvda.Build.CudaTasks.SanitizePaths” task could not be loaded from the assembly C:\Program Files (x86)\MSBuild\Microsoft.Cpp\v4.0\BuildCustomizations\Nvda.Build.CudaTasks.v4.0.dll. Could not load file or assembly ‘file:///C:\Program Files (x86)\MSBuild\Microsoft.Cpp\v4.0\BuildCustomizations\Nvda.Build.CudaTasks.v4.0.dll’ or one of its dependencies. The system cannot find the file specified. Confirm that the declaration is correct, that the assembly and all its dependencies are available, and that the task contains a public class that implements Microsoft.Build.Framework.ITask.

26>------ Rebuild All started: Project: simpleTexture, Configuration: Debug x64 ------

25>C:\Program Files (x86)\MSBuild\Microsoft.Cpp\v4.0\BuildCustomizations\CUDA 4.0.targets(76,9): error MSB4062: The “Nvda.Build.CudaTasks.SanitizePaths” task could not be loaded from the assembly C:\Program Files (x86)\MSBuild\Microsoft.Cpp\v4.0\BuildCustomizations\Nvda.Build.CudaTasks.v4.0.dll. Could not load file or assembly ‘file:///C:\Program Files (x86)\MSBuild\Microsoft.Cpp\v4.0\BuildCustomizations\Nvda.Build.CudaTasks.v4.0.dll’ or one of its dependencies. The system cannot find the file specified. Confirm that the declaration is correct, that the assembly and all its dependencies are available, and that the task contains a public class that implements Microsoft.Build.Framework.ITask.

27>------ Rebuild All started: Project: simpleTemplates, Configuration: Debug x64 ------

28>------ Rebuild All started: Project: simpleSurfaceWrite, Configuration: Debug x64 ------

26>C:\Program Files (x86)\MSBuild\Microsoft.Cpp\v4.0\BuildCustomizations\CUDA 4.0.targets(76,9): error MSB4062: The “Nvda.Build.CudaTasks.SanitizePaths” task could not be loaded from the assembly C:\Program Files (x86)\MSBuild\Microsoft.Cpp\v4.0\BuildCustomizations\Nvda.Build.CudaTasks.v4.0.dll. Could not load file or assembly ‘file:///C:\Program Files (x86)\MSBuild\Microsoft.Cpp\v4.0\BuildCustomizations\Nvda.Build.CudaTasks.v4.0.dll’ or one of its dependencies. The system cannot find the file specified. Confirm that the declaration is correct, that the assembly and all its dependencies are available, and that the task contains a public class that implements Microsoft.Build.Framework.ITask.

29>------ Rebuild All started: Project: simpleStreams, Configuration: Debug x64 ------

28>C:\Program Files (x86)\MSBuild\Microsoft.Cpp\v4.0\BuildCustomizations\CUDA 4.0.targets(76,9): error MSB4062: The “Nvda.Build.CudaTasks.SanitizePaths” task could not be loaded from the assembly C:\Program Files (x86)\MSBuild\Microsoft.Cpp\v4.0\BuildCustomizations\Nvda.Build.CudaTasks.v4.0.dll. Could not load file or assembly ‘file:///C:\Program Files (x86)\MSBuild\Microsoft.Cpp\v4.0\BuildCustomizations\Nvda.Build.CudaTasks.v4.0.dll’ or one of its dependencies. The system cannot find the file specified. Confirm that the declaration is correct, that the assembly and all its dependencies are available, and that the task contains a public class that implements Microsoft.Build.Framework.ITask.

30>------ Rebuild All started: Project: simplePrintf, Configuration: Debug x64 ------

29>C:\Program Files (x86)\MSBuild\Microsoft.Cpp\v4.0\BuildCustomizations\CUDA 4.0.targets(76,9): error MSB4062: The “Nvda.Build.CudaTasks.SanitizePaths” task could not be loaded from the assembly C:\Program Files (x86)\MSBuild\Microsoft.Cpp\v4.0\BuildCustomizations\Nvda.Build.CudaTasks.v4.0.dll. Could not load file or assembly ‘file:///C:\Program Files (x86)\MSBuild\Microsoft.Cpp\v4.0\BuildCustomizations\Nvda.Build.CudaTasks.v4.0.dll’ or one of its dependencies. The system cannot find the file specified. Confirm that the declaration is correct, that the assembly and all its dependencies are available, and that the task contains a public class that implements Microsoft.Build.Framework.ITask.

27>C:\Program Files (x86)\MSBuild\Microsoft.Cpp\v4.0\BuildCustomizations\CUDA 4.0.targets(76,9): error MSB4062: The “Nvda.Build.CudaTasks.SanitizePaths” task could not be loaded from the assembly C:\Program Files (x86)\MSBuild\Microsoft.Cpp\v4.0\BuildCustomizations\Nvda.Build.CudaTasks.v4.0.dll. Could not load file or assembly ‘file:///C:\Program Files (x86)\MSBuild\Microsoft.Cpp\v4.0\BuildCustomizations\Nvda.Build.CudaTasks.v4.0.dll’ or one of its dependencies. The system cannot find the file specified. Confirm that the declaration is correct, that the assembly and all its dependencies are available, and that the task contains a public class that implements Microsoft.Build.Framework.ITask.

31>------ Rebuild All started: Project: simplePitchLinearTexture, Configuration: Debug x64 ------

30>C:\Program Files (x86)\MSBuild\Microsoft.Cpp\v4.0\BuildCustomizations\CUDA 4.0.targets(76,9): error MSB4062: The “Nvda.Build.CudaTasks.SanitizePaths” task could not be loaded from the assembly C:\Program Files (x86)\MSBuild\Microsoft.Cpp\v4.0\BuildCustomizations\Nvda.Build.CudaTasks.v4.0.dll. Could not load file or assembly ‘file:///C:\Program Files (x86)\MSBuild\Microsoft.Cpp\v4.0\BuildCustomizations\Nvda.Build.CudaTasks.v4.0.dll’ or one of its dependencies. The system cannot find the file specified. Confirm that the declaration is correct, that the assembly and all its dependencies are available, and that the task contains a public class that implements Microsoft.Build.Framework.ITask.

32>------ Rebuild All started: Project: simpleP2P, Configuration: Debug x64 ------

33>------ Rebuild All started: Project: simpleMultiGPU, Configuration: Debug x64 ------

31>C:\Program Files (x86)\MSBuild\Microsoft.Cpp\v4.0\BuildCustomizations\CUDA 4.0.targets(76,9): error MSB4062: The “Nvda.Build.CudaTasks.SanitizePaths” task could not be loaded from the assembly C:\Program Files (x86)\MSBuild\Microsoft.Cpp\v4.0\BuildCustomizations\Nvda.Build.CudaTasks.v4.0.dll. Could not load file or assembly ‘file:///C:\Program Files (x86)\MSBuild\Microsoft.Cpp\v4.0\BuildCustomizations\Nvda.Build.CudaTasks.v4.0.dll’ or one of its dependencies. The system cannot find the file specified. Confirm that the declaration is correct, that the assembly and all its dependencies are available, and that the task contains a public class that implements Microsoft.Build.Framework.ITask.

34>------ Rebuild All started: Project: simpleMultiCopy, Configuration: Debug x64 ------

35>------ Rebuild All started: Project: simpleLayeredTexture, Configuration: Debug x64 ------

32>C:\Program Files (x86)\MSBuild\Microsoft.Cpp\v4.0\BuildCustomizations\CUDA 4.0.targets(76,9): error MSB4062: The “Nvda.Build.CudaTasks.SanitizePaths” task could not be loaded from the assembly C:\Program Files (x86)\MSBuild\Microsoft.Cpp\v4.0\BuildCustomizations\Nvda.Build.CudaTasks.v4.0.dll. Could not load file or assembly ‘file:///C:\Program Files (x86)\MSBuild\Microsoft.Cpp\v4.0\BuildCustomizations\Nvda.Build.CudaTasks.v4.0.dll’ or one of its dependencies. The system cannot find the file specified. Confirm that the declaration is correct, that the assembly and all its dependencies are available, and that the task contains a public class that implements Microsoft.Build.Framework.ITask.

36>------ Rebuild All started: Project: simpleGL, Configuration: Debug x64 ------

34>C:\Program Files (x86)\MSBuild\Microsoft.Cpp\v4.0\BuildCustomizations\CUDA 4.0.targets(76,9): error MSB4062: The “Nvda.Build.CudaTasks.SanitizePaths” task could not be loaded from the assembly C:\Program Files (x86)\MSBuild\Microsoft.Cpp\v4.0\BuildCustomizations\Nvda.Build.CudaTasks.v4.0.dll. Could not load file or assembly ‘file:///C:\Program Files (x86)\MSBuild\Microsoft.Cpp\v4.0\BuildCustomizations\Nvda.Build.CudaTasks.v4.0.dll’ or one of its dependencies. The system cannot find the file specified. Confirm that the declaration is correct, that the assembly and all its dependencies are available, and that the task contains a public class that implements Microsoft.Build.Framework.ITask.

35>C:\Program Files (x86)\MSBuild\Microsoft.Cpp\v4.0\BuildCustomizations\CUDA 4.0.targets(76,9): error MSB4062: The “Nvda.Build.CudaTasks.SanitizePaths” task could not be loaded from the assembly C:\Program Files (x86)\MSBuild\Microsoft.Cpp\v4.0\BuildCustomizations\Nvda.Build.CudaTasks.v4.0.dll. Could not load file or assembly ‘file:///C:\Program Files (x86)\MSBuild\Microsoft.Cpp\v4.0\BuildCustomizations\Nvda.Build.CudaTasks.v4.0.dll’ or one of its dependencies. The system cannot find the file specified. Confirm that the declaration is correct, that the assembly and all its dependencies are available, and that the task contains a public class that implements Microsoft.Build.Framework.ITask.

33>C:\Program Files (x86)\MSBuild\Microsoft.Cpp\v4.0\BuildCustomizations\CUDA 4.0.targets(76,9): error MSB4062: The “Nvda.Build.CudaTasks.SanitizePaths” task could not be loaded from the assembly C:\Program Files (x86)\MSBuild\Microsoft.Cpp\v4.0\BuildCustomizations\Nvda.Build.CudaTasks.v4.0.dll. Could not load file or assembly ‘file:///C:\Program Files (x86)\MSBuild\Microsoft.Cpp\v4.0\BuildCustomizations\Nvda.Build.CudaTasks.v4.0.dll’ or one of its dependencies. The system cannot find the file specified. Confirm that the declaration is correct, that the assembly and all its dependencies are available, and that the task contains a public class that implements Microsoft.Build.Framework.ITask.

37>------ Rebuild All started: Project: simpleD3D11Texture, Configuration: Debug x64 ------

36>C:\Program Files (x86)\MSBuild\Microsoft.Cpp\v4.0\BuildCustomizations\CUDA 4.0.targets(76,9): error MSB4062: The “Nvda.Build.CudaTasks.SanitizePaths” task could not be loaded from the assembly C:\Program Files (x86)\MSBuild\Microsoft.Cpp\v4.0\BuildCustomizations\Nvda.Build.CudaTasks.v4.0.dll. Could not load file or assembly ‘file:///C:\Program Files (x86)\MSBuild\Microsoft.Cpp\v4.0\BuildCustomizations\Nvda.Build.CudaTasks.v4.0.dll’ or one of its dependencies. The system cannot find the file specified. Confirm that the declaration is correct, that the assembly and all its dependencies are available, and that the task contains a public class that implements Microsoft.Build.Framework.ITask.

38>------ Rebuild All started: Project: simpleD3D10Texture, Configuration: Debug x64 ------

39>------ Rebuild All started: Project: simpleD3D10, Configuration: Debug x64 ------

37>C:\Program Files (x86)\MSBuild\Microsoft.Cpp\v4.0\BuildCustomizations\CUDA 4.0.targets(76,9): error MSB4062: The “Nvda.Build.CudaTasks.SanitizePaths” task could not be loaded from the assembly C:\Program Files (x86)\MSBuild\Microsoft.Cpp\v4.0\BuildCustomizations\Nvda.Build.CudaTasks.v4.0.dll. Could not load file or assembly ‘file:///C:\Program Files (x86)\MSBuild\Microsoft.Cpp\v4.0\BuildCustomizations\Nvda.Build.CudaTasks.v4.0.dll’ or one of its dependencies. The system cannot find the file specified. Confirm that the declaration is correct, that the assembly and all its dependencies are available, and that the task contains a public class that implements Microsoft.Build.Framework.ITask.

40>------ Rebuild All started: Project: simpleD3D9Texture, Configuration: Debug x64 ------

38>C:\Program Files (x86)\MSBuild\Microsoft.Cpp\v4.0\BuildCustomizations\CUDA 4.0.targets(76,9): error MSB4062: The “Nvda.Build.CudaTasks.SanitizePaths” task could not be loaded from the assembly C:\Program Files (x86)\MSBuild\Microsoft.Cpp\v4.0\BuildCustomizations\Nvda.Build.CudaTasks.v4.0.dll. Could not load file or assembly ‘file:///C:\Program Files (x86)\MSBuild\Microsoft.Cpp\v4.0\BuildCustomizations\Nvda.Build.CudaTasks.v4.0.dll’ or one of its dependencies. The system cannot find the file specified. Confirm that the declaration is correct, that the assembly and all its dependencies are available, and that the task contains a public class that implements Microsoft.Build.Framework.ITask.

41>------ Rebuild All started: Project: simpleD3D9, Configuration: Debug x64 ------

40>C:\Program Files (x86)\MSBuild\Microsoft.Cpp\v4.0\BuildCustomizations\CUDA 4.0.targets(76,9): error MSB4062: The “Nvda.Build.CudaTasks.SanitizePaths” task could not be loaded from the assembly C:\Program Files (x86)\MSBuild\Microsoft.Cpp\v4.0\BuildCustomizations\Nvda.Build.CudaTasks.v4.0.dll. Could not load file or assembly ‘file:///C:\Program Files (x86)\MSBuild\Microsoft.Cpp\v4.0\BuildCustomizations\Nvda.Build.CudaTasks.v4.0.dll’ or one of its dependencies. The system cannot find the file specified. Confirm that the declaration is correct, that the assembly and all its dependencies are available, and that the task contains a public class that implements Microsoft.Build.Framework.ITask.

39>C:\Program Files (x86)\MSBuild\Microsoft.Cpp\v4.0\BuildCustomizations\CUDA 4.0.targets(76,9): error MSB4062: The “Nvda.Build.CudaTasks.SanitizePaths” task could not be loaded from the assembly C:\Program Files (x86)\MSBuild\Microsoft.Cpp\v4.0\BuildCustomizations\Nvda.Build.CudaTasks.v4.0.dll. Could not load file or assembly ‘file:///C:\Program Files (x86)\MSBuild\Microsoft.Cpp\v4.0\BuildCustomizations\Nvda.Build.CudaTasks.v4.0.dll’ or one of its dependencies. The system cannot find the file specified. Confirm that the declaration is correct, that the assembly and all its dependencies are available, and that the task contains a public class that implements Microsoft.Build.Framework.ITask.

42>------ Rebuild All started: Project: simpleAtomicIntrinsics, Configuration: Debug x64 ------

41>C:\Program Files (x86)\MSBuild\Microsoft.Cpp\v4.0\BuildCustomizations\CUDA 4.0.targets(76,9): error MSB4062: The “Nvda.Build.CudaTasks.SanitizePaths” task could not be loaded from the assembly C:\Program Files (x86)\MSBuild\Microsoft.Cpp\v4.0\BuildCustomizations\Nvda.Build.CudaTasks.v4.0.dll. Could not load file or assembly ‘file:///C:\Program Files (x86)\MSBuild\Microsoft.Cpp\v4.0\BuildCustomizations\Nvda.Build.CudaTasks.v4.0.dll’ or one of its dependencies. The system cannot find the file specified. Confirm that the declaration is correct, that the assembly and all its dependencies are available, and that the task contains a public class that implements Microsoft.Build.Framework.ITask.

42>C:\Program Files (x86)\MSBuild\Microsoft.Cpp\v4.0\BuildCustomizations\CUDA 4.0.targets(76,9): error MSB4062: The “Nvda.Build.CudaTasks.SanitizePaths” task could not be loaded from the assembly C:\Program Files (x86)\MSBuild\Microsoft.Cpp\v4.0\BuildCustomizations\Nvda.Build.CudaTasks.v4.0.dll. Could not load file or assembly ‘file:///C:\Program Files (x86)\MSBuild\Microsoft.Cpp\v4.0\BuildCustomizations\Nvda.Build.CudaTasks.v4.0.dll’ or one of its dependencies. The system cannot find the file specified. Confirm that the declaration is correct, that the assembly and all its dependencies are available, and that the task contains a public class that implements Microsoft.Build.Framework.ITask.

43>------ Rebuild All started: Project: scan, Configuration: Debug x64 ------

44>------ Rebuild All started: Project: scalarProd, Configuration: Debug x64 ------

43>C:\Program Files (x86)\MSBuild\Microsoft.Cpp\v4.0\BuildCustomizations\CUDA 4.0.targets(76,9): error MSB4062: The “Nvda.Build.CudaTasks.SanitizePaths” task could not be loaded from the assembly C:\Program Files (x86)\MSBuild\Microsoft.Cpp\v4.0\BuildCustomizations\Nvda.Build.CudaTasks.v4.0.dll. Could not load file or assembly ‘file:///C:\Program Files (x86)\MSBuild\Microsoft.Cpp\v4.0\BuildCustomizations\Nvda.Build.CudaTasks.v4.0.dll’ or one of its dependencies. The system cannot find the file specified. Confirm that the declaration is correct, that the assembly and all its dependencies are available, and that the task contains a public class that implements Microsoft.Build.Framework.ITask.

44>C:\Program Files (x86)\MSBuild\Microsoft.Cpp\v4.0\BuildCustomizations\CUDA 4.0.targets(76,9): error MSB4062: The “Nvda.Build.CudaTasks.SanitizePaths” task could not be loaded from the assembly C:\Program Files (x86)\MSBuild\Microsoft.Cpp\v4.0\BuildCustomizations\Nvda.Build.CudaTasks.v4.0.dll. Could not load file or assembly ‘file:///C:\Program Files (x86)\MSBuild\Microsoft.Cpp\v4.0\BuildCustomizations\Nvda.Build.CudaTasks.v4.0.dll’ or one of its dependencies. The system cannot find the file specified. Confirm that the declaration is correct, that the assembly and all its dependencies are available, and that the task contains a public class that implements Microsoft.Build.Framework.ITask.

45>------ Rebuild All started: Project: reduction, Configuration: Debug x64 ------

46>------ Rebuild All started: Project: recursiveGaussian, Configuration: Debug x64 ------

45>C:\Program Files (x86)\MSBuild\Microsoft.Cpp\v4.0\BuildCustomizations\CUDA 4.0.targets(76,9): error MSB4062: The “Nvda.Build.CudaTasks.SanitizePaths” task could not be loaded from the assembly C:\Program Files (x86)\MSBuild\Microsoft.Cpp\v4.0\BuildCustomizations\Nvda.Build.CudaTasks.v4.0.dll. Could not load file or assembly ‘file:///C:\Program Files (x86)\MSBuild\Microsoft.Cpp\v4.0\BuildCustomizations\Nvda.Build.CudaTasks.v4.0.dll’ or one of its dependencies. The system cannot find the file specified. Confirm that the declaration is correct, that the assembly and all its dependencies are available, and that the task contains a public class that implements Microsoft.Build.Framework.ITask.

46>C:\Program Files (x86)\MSBuild\Microsoft.Cpp\v4.0\BuildCustomizations\CUDA 4.0.targets(76,9): error MSB4062: The “Nvda.Build.CudaTasks.SanitizePaths” task could not be loaded from the assembly C:\Program Files (x86)\MSBuild\Microsoft.Cpp\v4.0\BuildCustomizations\Nvda.Build.CudaTasks.v4.0.dll. Could not load file or assembly ‘file:///C:\Program Files (x86)\MSBuild\Microsoft.Cpp\v4.0\BuildCustomizations\Nvda.Build.CudaTasks.v4.0.dll’ or one of its dependencies. The system cannot find the file specified. Confirm that the declaration is correct, that the assembly and all its dependencies are available, and that the task contains a public class that implements Microsoft.Build.Framework.ITask.

47>------ Rebuild All started: Project: radixSortThrust, Configuration: Debug x64 ------

48>------ Rebuild All started: Project: quasirandomGenerator, Configuration: Debug x64 ------

49>------ Rebuild All started: Project: ptxjit, Configuration: Debug x64 ------

47>C:\Program Files (x86)\MSBuild\Microsoft.Cpp\v4.0\BuildCustomizations\CUDA 4.0.targets(76,9): error MSB4062: The “Nvda.Build.CudaTasks.SanitizePaths” task could not be loaded from the assembly C:\Program Files (x86)\MSBuild\Microsoft.Cpp\v4.0\BuildCustomizations\Nvda.Build.CudaTasks.v4.0.dll. Could not load file or assembly ‘file:///C:\Program Files (x86)\MSBuild\Microsoft.Cpp\v4.0\BuildCustomizations\Nvda.Build.CudaTasks.v4.0.dll’ or one of its dependencies. The system cannot find the file specified. Confirm that the declaration is correct, that the assembly and all its dependencies are available, and that the task contains a public class that implements Microsoft.Build.Framework.ITask.

50>------ Rebuild All started: Project: postProcessGL, Configuration: Debug x64 ------

48>C:\Program Files (x86)\MSBuild\Microsoft.Cpp\v4.0\BuildCustomizations\CUDA 4.0.targets(76,9): error MSB4062: The “Nvda.Build.CudaTasks.SanitizePaths” task could not be loaded from the assembly C:\Program Files (x86)\MSBuild\Microsoft.Cpp\v4.0\BuildCustomizations\Nvda.Build.CudaTasks.v4.0.dll. Could not load file or assembly ‘file:///C:\Program Files (x86)\MSBuild\Microsoft.Cpp\v4.0\BuildCustomizations\Nvda.Build.CudaTasks.v4.0.dll’ or one of its dependencies. The system cannot find the file specified. Confirm that the declaration is correct, that the assembly and all its dependencies are available, and that the task contains a public class that implements Microsoft.Build.Framework.ITask.

51>------ Rebuild All started: Project: particles, Configuration: Debug x64 ------

50>C:\Program Files (x86)\MSBuild\Microsoft.Cpp\v4.0\BuildCustomizations\CUDA 4.0.targets(76,9): error MSB4062: The “Nvda.Build.CudaTasks.SanitizePaths” task could not be loaded from the assembly C:\Program Files (x86)\MSBuild\Microsoft.Cpp\v4.0\BuildCustomizations\Nvda.Build.CudaTasks.v4.0.dll. Could not load file or assembly ‘file:///C:\Program Files (x86)\MSBuild\Microsoft.Cpp\v4.0\BuildCustomizations\Nvda.Build.CudaTasks.v4.0.dll’ or one of its dependencies. The system cannot find the file specified. Confirm that the declaration is correct, that the assembly and all its dependencies are available, and that the task contains a public class that implements Microsoft.Build.Framework.ITask.

52>------ Rebuild All started: Project: oceanFFT, Configuration: Debug x64 ------

49> ptxjit.cpp

51>C:\Program Files (x86)\MSBuild\Microsoft.Cpp\v4.0\BuildCustomizations\CUDA 4.0.targets(76,9): error MSB4062: The “Nvda.Build.CudaTasks.SanitizePaths” task could not be loaded from the assembly C:\Program Files (x86)\MSBuild\Microsoft.Cpp\v4.0\BuildCustomizations\Nvda.Build.CudaTasks.v4.0.dll. Could not load file or assembly ‘file:///C:\Program Files (x86)\MSBuild\Microsoft.Cpp\v4.0\BuildCustomizations\Nvda.Build.CudaTasks.v4.0.dll’ or one of its dependencies. The system cannot find the file specified. Confirm that the declaration is correct, that the assembly and all its dependencies are available, and that the task contains a public class that implements Microsoft.Build.Framework.ITask.

53>------ Rebuild All started: Project: nbody, Configuration: Debug x64 ------

52>C:\Program Files (x86)\MSBuild\Microsoft.Cpp\v4.0\BuildCustomizations\CUDA 4.0.targets(76,9): error MSB4062: The “Nvda.Build.CudaTasks.SanitizePaths” task could not be loaded from the assembly C:\Program Files (x86)\MSBuild\Microsoft.Cpp\v4.0\BuildCustomizations\Nvda.Build.CudaTasks.v4.0.dll. Could not load file or assembly ‘file:///C:\Program Files (x86)\MSBuild\Microsoft.Cpp\v4.0\BuildCustomizations\Nvda.Build.CudaTasks.v4.0.dll’ or one of its dependencies. The system cannot find the file specified. Confirm that the declaration is correct, that the assembly and all its dependencies are available, and that the task contains a public class that implements Microsoft.Build.Framework.ITask.

54>------ Rebuild All started: Project: newdelete, Configuration: Debug x64 ------

53>C:\Program Files (x86)\MSBuild\Microsoft.Cpp\v4.0\BuildCustomizations\CUDA 4.0.targets(76,9): error MSB4062: The “Nvda.Build.CudaTasks.SanitizePaths” task could not be loaded from the assembly C:\Program Files (x86)\MSBuild\Microsoft.Cpp\v4.0\BuildCustomizations\Nvda.Build.CudaTasks.v4.0.dll. Could not load file or assembly ‘file:///C:\Program Files (x86)\MSBuild\Microsoft.Cpp\v4.0\BuildCustomizations\Nvda.Build.CudaTasks.v4.0.dll’ or one of its dependencies. The system cannot find the file specified. Confirm that the declaration is correct, that the assembly and all its dependencies are available, and that the task contains a public class that implements Microsoft.Build.Framework.ITask.

55>------ Rebuild All started: Project: MonteCarloMultiGPU, Configuration: Debug x64 ------

56>------ Rebuild All started: Project: MonteCarlo, Configuration: Debug x64 ------

54>C:\Program Files (x86)\MSBuild\Microsoft.Cpp\v4.0\BuildCustomizations\CUDA 4.0.targets(76,9): error MSB4062: The “Nvda.Build.CudaTasks.SanitizePaths” task could not be loaded from the assembly C:\Program Files (x86)\MSBuild\Microsoft.Cpp\v4.0\BuildCustomizations\Nvda.Build.CudaTasks.v4.0.dll. Could not load file or assembly ‘file:///C:\Program Files (x86)\MSBuild\Microsoft.Cpp\v4.0\BuildCustomizations\Nvda.Build.CudaTasks.v4.0.dll’ or one of its dependencies. The system cannot find the file specified. Confirm that the declaration is correct, that the assembly and all its dependencies are available, and that the task contains a public class that implements Microsoft.Build.Framework.ITask.

56>C:\Program Files (x86)\MSBuild\Microsoft.Cpp\v4.0\BuildCustomizations\CUDA 4.0.targets(76,9): error MSB4062: The “Nvda.Build.CudaTasks.SanitizePaths” task could not be loaded from the assembly C:\Program Files (x86)\MSBuild\Microsoft.Cpp\v4.0\BuildCustomizations\Nvda.Build.CudaTasks.v4.0.dll. Could not load file or assembly ‘file:///C:\Program Files (x86)\MSBuild\Microsoft.Cpp\v4.0\BuildCustomizations\Nvda.Build.CudaTasks.v4.0.dll’ or one of its dependencies. The system cannot find the file specified. Confirm that the declaration is correct, that the assembly and all its dependencies are available, and that the task contains a public class that implements Microsoft.Build.Framework.ITask.

55>C:\Program Files (x86)\MSBuild\Microsoft.Cpp\v4.0\BuildCustomizations\CUDA 4.0.targets(76,9): error MSB4062: The “Nvda.Build.CudaTasks.SanitizePaths” task could not be loaded from the assembly C:\Program Files (x86)\MSBuild\Microsoft.Cpp\v4.0\BuildCustomizations\Nvda.Build.CudaTasks.v4.0.dll. Could not load file or assembly ‘file:///C:\Program Files (x86)\MSBuild\Microsoft.Cpp\v4.0\BuildCustomizations\Nvda.Build.CudaTasks.v4.0.dll’ or one of its dependencies. The system cannot find the file specified. Confirm that the declaration is correct, that the assembly and all its dependencies are available, and that the task contains a public class that implements Microsoft.Build.Framework.ITask.

57>------ Rebuild All started: Project: MersenneTwister, Configuration: Debug x64 ------

57>C:\Program Files (x86)\MSBuild\Microsoft.Cpp\v4.0\BuildCustomizations\CUDA 4.0.targets(76,9): error MSB4062: The “Nvda.Build.CudaTasks.SanitizePaths” task could not be loaded from the assembly C:\Program Files (x86)\MSBuild\Microsoft.Cpp\v4.0\BuildCustomizations\Nvda.Build.CudaTasks.v4.0.dll. Could not load file or assembly ‘file:///C:\Program Files (x86)\MSBuild\Microsoft.Cpp\v4.0\BuildCustomizations\Nvda.Build.CudaTasks.v4.0.dll’ or one of its dependencies. The system cannot find the file specified. Confirm that the declaration is correct, that the assembly and all its dependencies are available, and that the task contains a public class that implements Microsoft.Build.Framework.ITask.

58>------ Rebuild All started: Project: matrixMulDynlinkJIT, Configuration: Debug x64 ------

59>------ Rebuild All started: Project: matrixMulDrv, Configuration: Debug x64 ------

59>C:\Program Files (x86)\MSBuild\Microsoft.Cpp\v4.0\BuildCustomizations\CUDA 4.0.targets(76,9): error MSB4062: The “Nvda.Build.CudaTasks.SanitizePaths” task could not be loaded from the assembly C:\Program Files (x86)\MSBuild\Microsoft.Cpp\v4.0\BuildCustomizations\Nvda.Build.CudaTasks.v4.0.dll. Could not load file or assembly ‘file:///C:\Program Files (x86)\MSBuild\Microsoft.Cpp\v4.0\BuildCustomizations\Nvda.Build.CudaTasks.v4.0.dll’ or one of its dependencies. The system cannot find the file specified. Confirm that the declaration is correct, that the assembly and all its dependencies are available, and that the task contains a public class that implements Microsoft.Build.Framework.ITask.

60>------ Rebuild All started: Project: matrixMul, Configuration: Debug x64 ------

58> matrixMul_kernel_64_ptxdump.c

60>C:\Program Files (x86)\MSBuild\Microsoft.Cpp\v4.0\BuildCustomizations\CUDA 4.0.targets(76,9): error MSB4062: The “Nvda.Build.CudaTasks.SanitizePaths” task could not be loaded from the assembly C:\Program Files (x86)\MSBuild\Microsoft.Cpp\v4.0\BuildCustomizations\Nvda.Build.CudaTasks.v4.0.dll. Could not load file or assembly ‘file:///C:\Program Files (x86)\MSBuild\Microsoft.Cpp\v4.0\BuildCustomizations\Nvda.Build.CudaTasks.v4.0.dll’ or one of its dependencies. The system cannot find the file specified. Confirm that the declaration is correct, that the assembly and all its dependencies are available, and that the task contains a public class that implements Microsoft.Build.Framework.ITask.

61>------ Rebuild All started: Project: marchingCubes, Configuration: Debug x64 ------

58> matrixMul_kernel_32_ptxdump.c

61>C:\Program Files (x86)\MSBuild\Microsoft.Cpp\v4.0\BuildCustomizations\CUDA 4.0.targets(76,9): error MSB4062: The “Nvda.Build.CudaTasks.SanitizePaths” task could not be loaded from the assembly C:\Program Files (x86)\MSBuild\Microsoft.Cpp\v4.0\BuildCustomizations\Nvda.Build.CudaTasks.v4.0.dll. Could not load file or assembly ‘file:///C:\Program Files (x86)\MSBuild\Microsoft.Cpp\v4.0\BuildCustomizations\Nvda.Build.CudaTasks.v4.0.dll’ or one of its dependencies. The system cannot find the file specified. Confirm that the declaration is correct, that the assembly and all its dependencies are available, and that the task contains a public class that implements Microsoft.Build.Framework.ITask.

62>------ Rebuild All started: Project: Mandelbrot, Configuration: Debug x64 ------

58> cuda_drvapi_dynlink.c

62>C:\Program Files (x86)\MSBuild\Microsoft.Cpp\v4.0\BuildCustomizations\CUDA 4.0.targets(76,9): error MSB4062: The “Nvda.Build.CudaTasks.SanitizePaths” task could not be loaded from the assembly C:\Program Files (x86)\MSBuild\Microsoft.Cpp\v4.0\BuildCustomizations\Nvda.Build.CudaTasks.v4.0.dll. Could not load file or assembly ‘file:///C:\Program Files (x86)\MSBuild\Microsoft.Cpp\v4.0\BuildCustomizations\Nvda.Build.CudaTasks.v4.0.dll’ or one of its dependencies. The system cannot find the file specified. Confirm that the declaration is correct, that the assembly and all its dependencies are available, and that the task contains a public class that implements Microsoft.Build.Framework.ITask.

63>------ Rebuild All started: Project: lineOfSight, Configuration: Debug x64 ------

63>C:\Program Files (x86)\MSBuild\Microsoft.Cpp\v4.0\BuildCustomizations\CUDA 4.0.targets(76,9): error MSB4062: The “Nvda.Build.CudaTasks.SanitizePaths” task could not be loaded from the assembly C:\Program Files (x86)\MSBuild\Microsoft.Cpp\v4.0\BuildCustomizations\Nvda.Build.CudaTasks.v4.0.dll. Could not load file or assembly ‘file:///C:\Program Files (x86)\MSBuild\Microsoft.Cpp\v4.0\BuildCustomizations\Nvda.Build.CudaTasks.v4.0.dll’ or one of its dependencies. The system cannot find the file specified. Confirm that the declaration is correct, that the assembly and all its dependencies are available, and that the task contains a public class that implements Microsoft.Build.Framework.ITask.

64>------ Rebuild All started: Project: Interval, Configuration: Debug x64 ------

64>C:\Program Files (x86)\MSBuild\Microsoft.Cpp\v4.0\BuildCustomizations\CUDA 4.0.targets(76,9): error MSB4062: The “Nvda.Build.CudaTasks.SanitizePaths” task could not be loaded from the assembly C:\Program Files (x86)\MSBuild\Microsoft.Cpp\v4.0\BuildCustomizations\Nvda.Build.CudaTasks.v4.0.dll. Could not load file or assembly ‘file:///C:\Program Files (x86)\MSBuild\Microsoft.Cpp\v4.0\BuildCustomizations\Nvda.Build.CudaTasks.v4.0.dll’ or one of its dependencies. The system cannot find the file specified. Confirm that the declaration is correct, that the assembly and all its dependencies are available, and that the task contains a public class that implements Microsoft.Build.Framework.ITask.

65>------ Rebuild All started: Project: inlinePTX, Configuration: Debug x64 ------

65>C:\Program Files (x86)\MSBuild\Microsoft.Cpp\v4.0\BuildCustomizations\CUDA 4.0.targets(76,9): error MSB4062: The “Nvda.Build.CudaTasks.SanitizePaths” task could not be loaded from the assembly C:\Program Files (x86)\MSBuild\Microsoft.Cpp\v4.0\BuildCustomizations\Nvda.Build.CudaTasks.v4.0.dll. Could not load file or assembly ‘file:///C:\Program Files (x86)\MSBuild\Microsoft.Cpp\v4.0\BuildCustomizations\Nvda.Build.CudaTasks.v4.0.dll’ or one of its dependencies. The system cannot find the file specified. Confirm that the declaration is correct, that the assembly and all its dependencies are available, and that the task contains a public class that implements Microsoft.Build.Framework.ITask.

66>------ Rebuild All started: Project: imageDenoising, Configuration: Debug x64 ------

67>------ Rebuild All started: Project: histogram, Configuration: Debug x64 ------

66>C:\Program Files (x86)\MSBuild\Microsoft.Cpp\v4.0\BuildCustomizations\CUDA 4.0.targets(76,9): error MSB4062: The “Nvda.Build.CudaTasks.SanitizePaths” task could not be loaded from the assembly C:\Program Files (x86)\MSBuild\Microsoft.Cpp\v4.0\BuildCustomizations\Nvda.Build.CudaTasks.v4.0.dll. Could not load file or assembly ‘file:///C:\Program Files (x86)\MSBuild\Microsoft.Cpp\v4.0\BuildCustomizations\Nvda.Build.CudaTasks.v4.0.dll’ or one of its dependencies. The system cannot find the file specified. Confirm that the declaration is correct, that the assembly and all its dependencies are available, and that the task contains a public class that implements Microsoft.Build.Framework.ITask.

67>C:\Program Files (x86)\MSBuild\Microsoft.Cpp\v4.0\BuildCustomizations\CUDA 4.0.targets(76,9): error MSB4062: The “Nvda.Build.CudaTasks.SanitizePaths” task could not be loaded from the assembly C:\Program Files (x86)\MSBuild\Microsoft.Cpp\v4.0\BuildCustomizations\Nvda.Build.CudaTasks.v4.0.dll. Could not load file or assembly ‘file:///C:\Program Files (x86)\MSBuild\Microsoft.Cpp\v4.0\BuildCustomizations\Nvda.Build.CudaTasks.v4.0.dll’ or one of its dependencies. The system cannot find the file specified. Confirm that the declaration is correct, that the assembly and all its dependencies are available, and that the task contains a public class that implements Microsoft.Build.Framework.ITask.

68>------ Rebuild All started: Project: FunctionPointers, Configuration: Debug x64 ------

68>C:\Program Files (x86)\MSBuild\Microsoft.Cpp\v4.0\BuildCustomizations\CUDA 4.0.targets(76,9): error MSB4062: The “Nvda.Build.CudaTasks.SanitizePaths” task could not be loaded from the assembly C:\Program Files (x86)\MSBuild\Microsoft.Cpp\v4.0\BuildCustomizations\Nvda.Build.CudaTasks.v4.0.dll. Could not load file or assembly ‘file:///C:\Program Files (x86)\MSBuild\Microsoft.Cpp\v4.0\BuildCustomizations\Nvda.Build.CudaTasks.v4.0.dll’ or one of its dependencies. The system cannot find the file specified. Confirm that the declaration is correct, that the assembly and all its dependencies are available, and that the task contains a public class that implements Microsoft.Build.Framework.ITask.

69>------ Rebuild All started: Project: fluidsGL, Configuration: Debug x64 ------

69>C:\Program Files (x86)\MSBuild\Microsoft.Cpp\v4.0\BuildCustomizations\CUDA 4.0.targets(76,9): error MSB4062: The “Nvda.Build.CudaTasks.SanitizePaths” task could not be loaded from the assembly C:\Program Files (x86)\MSBuild\Microsoft.Cpp\v4.0\BuildCustomizations\Nvda.Build.CudaTasks.v4.0.dll. Could not load file or assembly ‘file:///C:\Program Files (x86)\MSBuild\Microsoft.Cpp\v4.0\BuildCustomizations\Nvda.Build.CudaTasks.v4.0.dll’ or one of its dependencies. The system cannot find the file specified. Confirm that the declaration is correct, that the assembly and all its dependencies are available, and that the task contains a public class that implements Microsoft.Build.Framework.ITask.

70>------ Rebuild All started: Project: fluidsD3D9, Configuration: Debug x64 ------

70>C:\Program Files (x86)\MSBuild\Microsoft.Cpp\v4.0\BuildCustomizations\CUDA 4.0.targets(76,9): error MSB4062: The “Nvda.Build.CudaTasks.SanitizePaths” task could not be loaded from the assembly C:\Program Files (x86)\MSBuild\Microsoft.Cpp\v4.0\BuildCustomizations\Nvda.Build.CudaTasks.v4.0.dll. Could not load file or assembly ‘file:///C:\Program Files (x86)\MSBuild\Microsoft.Cpp\v4.0\BuildCustomizations\Nvda.Build.CudaTasks.v4.0.dll’ or one of its dependencies. The system cannot find the file specified. Confirm that the declaration is correct, that the assembly and all its dependencies are available, and that the task contains a public class that implements Microsoft.Build.Framework.ITask.

71>------ Rebuild All started: Project: FDTD3d, Configuration: Debug x64 ------

58> Generating Code…

71>C:\Program Files (x86)\MSBuild\Microsoft.Cpp\v4.0\BuildCustomizations\CUDA 4.0.targets(76,9): error MSB4062: The “Nvda.Build.CudaTasks.SanitizePaths” task could not be loaded from the assembly C:\Program Files (x86)\MSBuild\Microsoft.Cpp\v4.0\BuildCustomizations\Nvda.Build.CudaTasks.v4.0.dll. Could not load file or assembly ‘file:///C:\Program Files (x86)\MSBuild\Microsoft.Cpp\v4.0\BuildCustomizations\Nvda.Build.CudaTasks.v4.0.dll’ or one of its dependencies. The system cannot find the file specified. Confirm that the declaration is correct, that the assembly and all its dependencies are available, and that the task contains a public class that implements Microsoft.Build.Framework.ITask.

72>------ Rebuild All started: Project: fastWalshTransform, Configuration: Debug x64 ------

72>C:\Program Files (x86)\MSBuild\Microsoft.Cpp\v4.0\BuildCustomizations\CUDA 4.0.targets(76,9): error MSB4062: The “Nvda.Build.CudaTasks.SanitizePaths” task could not be loaded from the assembly C:\Program Files (x86)\MSBuild\Microsoft.Cpp\v4.0\BuildCustomizations\Nvda.Build.CudaTasks.v4.0.dll. Could not load file or assembly ‘file:///C:\Program Files (x86)\MSBuild\Microsoft.Cpp\v4.0\BuildCustomizations\Nvda.Build.CudaTasks.v4.0.dll’ or one of its dependencies. The system cannot find the file specified. Confirm that the declaration is correct, that the as

I was able to get shrUtils to compile by using /C/common/src/stopwatch_win.cpp and removing the stopwatch.cpp and stopwatch_win in the SDK project, but I was unsure as to which stopwatch.cpp to choose:

$ find | grep [Ss]top[Ww]atch.*<li>cpp

./C/common/src/stopwatch.cpp

./C/common/src/stopwatch_win.cpp

./C/src/cudaEncode/cutil/stopwatch.cpp

./C/src/cudaEncode/cutil/stopwatch_win.cpp

./CUDALibraries/common/src/stopwatch.cpp

./CUDALibraries/common/src/stopwatch_win.cpp

./CUDALibraries/common/UtilNPP/StopWatchLinux.cpp

./CUDALibraries/common/UtilNPP/StopWatchWin.cpp

I am pretty sure I don’t want the StopWatchLinux.cpp, but then again using the NVIDIA logic maybe I do.

[code]

1>------ Rebuild All started: Project: shrUtils, Configuration: Debug x64 ------

2>------ Rebuild All started: Project: template_runtime, Configuration: Debug x64 ------

3>------ Rebuild All started: Project: cudaEncode, Configuration: Debug x64 ------

2>C:\Program Files (x86)\MSBuild\Microsoft.Cpp\v4.0\BuildCustomizations\CUDA 4.0.targets(76,9): error MSB4062: The “Nvda.Build.CudaTasks.SanitizePaths” task could not be loaded from the assembly C:\Program Files (x86)\MSBuild\Microsoft.Cpp\v4.0\BuildCustomizations\Nvda.Build.CudaTasks.v4.0.dll. Could not load file or assembly ‘file:///C:\Program Files (x86)\MSBuild\Microsoft.Cpp\v4.0\BuildCustomizations\Nvda.Build.CudaTasks.v4.0.dll’ or one of its dependencies. The system cannot find the file specified. Confirm that the declaration is correct, that the assembly and all its dependencies are available, and that the task contains a public class that implements Microsoft.Build.Framework.ITask.

1> stopwatch_win.cpp

3> VideoEncoder.cpp

1> cmd_arg_reader.cpp

3> main.cpp

1> shrUtils.cpp

1> Note: including windows.h

1> Note: including math.h

1> Note: including assert.h

3> Note: including windows.h

3> Note: including math.h

3> Note: including assert.h

3> stopwatch_win.cpp

1> Generating Code…

3> stopwatch.cpp

1> shrUtils_vs2010.vcxproj -> C:\ProgramData\NVIDIA Corporation\NVIDIA GPU Computing SDK 4.0\shared\lib\x64\shrUtils64D.lib

4>------ Rebuild All started: Project: cutil, Configuration: Debug x64 ------

4> bank_checker.cpp

3> cutil.cpp

4> cmd_arg_reader.cpp

4> cutil.cpp

3> Generating Code…

4> stopwatch.cpp

4> stopwatch_win.cpp

4> Generating Code…

3> cudaEncode_vs2010.vcxproj -> C:\ProgramData\NVIDIA Corporation\NVIDIA GPU Computing SDK 4.0\C\src\cudaEncode…/…/bin/win64/Debug/cudaEncode.exe

4> Creating library C:\ProgramData\NVIDIA Corporation\NVIDIA GPU Computing SDK 4.0\C\common\lib\x64\cutil64D.lib and object C:\ProgramData\NVIDIA Corporation\NVIDIA GPU Computing SDK 4.0\C\common\lib\x64\cutil64D.exp

4> cutil_vs2010.vcxproj -> C:\ProgramData\NVIDIA Corporation\NVIDIA GPU Computing SDK 4.0\C\common\lib\x64\cutil64D.dll

4> Creating library C:\ProgramData\NVIDIA Corporation\NVIDIA GPU Computing SDK 4.0\C\common\lib\x64\cutil64D.lib and object C:\ProgramData\NVIDIA Corporation\NVIDIA GPU Computing SDK 4.0\C\common\lib\x64\cutil64D.exp

4> cutil_vs2010.vcxproj -> C:\ProgramData\NVIDIA Corporation\NVIDIA GPU Computing SDK 4.0\C\common\lib\x64\cutil64D.dll

4> A subdirectory or file …\bin\win64\Debug already exists.

4> 1 file(s) copied.

5>------ Rebuild All started: Project: SingleAsianOptionP, Configuration: Debug x64 ------

6>------ Rebuild All started: Project: EstimatePiQ, Configuration: Debug x64 ------

7>------ Rebuild All started: Project: EstimatePiP, Configuration: Debug x64 ------

8>------ Rebuild All started: Project: EstimatePiInlineQ, Configuration: Debug x64 ------

6>C:\Program Files (x86)\MSBuild\Microsoft.Cpp\v4.0\BuildCustomizations\CUDA 4.0.targets(76,9): error MSB4062: The “Nvda.Build.CudaTasks.SanitizePaths” task could not be loaded from the assembly C:\Program Files (x86)\MSBuild\Microsoft.Cpp\v4.0\BuildCustomizations\Nvda.Build.CudaTasks.v4.0.dll. Could not load file or assembly ‘file:///C:\Program Files (x86)\MSBuild\Microsoft.Cpp\v4.0\BuildCustomizations\Nvda.Build.CudaTasks.v4.0.dll’ or one of its dependencies. The system cannot find the file specified. Confirm that the declaration is correct, that the assembly and all its dependencies are available, and that the task contains a public class that implements Microsoft.Build.Framework.ITask.

5>C:\Program Files (x86)\MSBuild\Microsoft.Cpp\v4.0\BuildCustomizations\CUDA 4.0.targets(76,9): error MSB4062: The “Nvda.Build.CudaTasks.SanitizePaths” task could not be loaded from the assembly C:\Program Files (x86)\MSBuild\Microsoft.Cpp\v4.0\BuildCustomizations\Nvda.Build.CudaTasks.v4.0.dll. Could not load file or assembly ‘file:///C:\Program Files (x86)\MSBuild\Microsoft.Cpp\v4.0\BuildCustomizations\Nvda.Build.CudaTasks.v4.0.dll’ or one of its dependencies. The system cannot find the file specified. Confirm that the declaration is correct, that the assembly and all its dependencies are available, and that the task contains a public class that implements Microsoft.Build.Framework.ITask.

9>------ Rebuild All started: Project: EstimatePiInlineP, Configuration: Debug x64 ------

7>C:\Program Files (x86)\MSBuild\Microsoft.Cpp\v4.0\BuildCustomizations\CUDA 4.0.targets(76,9): error MSB4062: The “Nvda.Build.CudaTasks.SanitizePaths” task could not be loaded from the assembly C:\Program Files (x86)\MSBuild\Microsoft.Cpp\v4.0\BuildCustomizations\Nvda.Build.CudaTasks.v4.0.dll. Could not load file or assembly ‘file:///C:\Program Files (x86)\MSBuild\Microsoft.Cpp\v4.0\BuildCustomizations\Nvda.Build.CudaTasks.v4.0.dll’ or one of its dependencies. The system cannot find the file specified. Confirm that the declaration is correct, that the assembly and all its dependencies are available, and that the task contains a public class that implements Microsoft.Build.Framework.ITask.

10>------ Rebuild All started: Project: volumeRender, Configuration: Debug x64 ------

9>C:\Program Files (x86)\MSBuild\Microsoft.Cpp\v4.0\BuildCustomizations\CUDA 4.0.targets(76,9): error MSB4062: The “Nvda.Build.CudaTasks.SanitizePaths” task could not be loaded from the assembly C:\Program Files (x86)\MSBuild\Microsoft.Cpp\v4.0\BuildCustomizations\Nvda.Build.CudaTasks.v4.0.dll. Could not load file or assembly ‘file:///C:\Program Files (x86)\MSBuild\Microsoft.Cpp\v4.0\BuildCustomizations\Nvda.Build.CudaTasks.v4.0.dll’ or one of its dependencies. The system cannot find the file specified. Confirm that the declaration is correct, that the assembly and all its dependencies are available, and that the task contains a public class that implements Microsoft.Build.Framework.ITask.

8>C:\Program Files (x86)\MSBuild\Microsoft.Cpp\v4.0\BuildCustomizations\CUDA 4.0.targets(76,9): error MSB4062: The “Nvda.Build.CudaTasks.SanitizePaths” task could not be loaded from the assembly C:\Program Files (x86)\MSBuild\Microsoft.Cpp\v4.0\BuildCustomizations\Nvda.Build.CudaTasks.v4.0.dll. Could not load file or assembly ‘file:///C:\Program Files (x86)\MSBuild\Microsoft.Cpp\v4.0\BuildCustomizations\Nvda.Build.CudaTasks.v4.0.dll’ or one of its dependencies. The system cannot find the file specified. Confirm that the declaration is correct, that the assembly and all its dependencies are available, and that the task contains a public class that implements Microsoft.Build.Framework.ITask.

11>------ Rebuild All started: Project: vectorAddDrv, Configuration: Debug x64 ------

10>C:\Program Files (x86)\MSBuild\Microsoft.Cpp\v4.0\BuildCustomizations\CUDA 4.0.targets(76,9): error MSB4062: The “Nvda.Build.CudaTasks.SanitizePaths” task could not be loaded from the assembly C:\Program Files (x86)\MSBuild\Microsoft.Cpp\v4.0\BuildCustomizations\Nvda.Build.CudaTasks.v4.0.dll. Could not load file or assembly ‘file:///C:\Program Files (x86)\MSBuild\Microsoft.Cpp\v4.0\BuildCustomizations\Nvda.Build.CudaTasks.v4.0.dll’ or one of its dependencies. The system cannot find the file specified. Confirm that the declaration is correct, that the assembly and all its dependencies are available, and that the task contains a public class that implements Microsoft.Build.Framework.ITask.

12>------ Rebuild All started: Project: vectorAdd, Configuration: Debug x64 ------

13>------ Rebuild All started: Project: transpose, Configuration: Debug x64 ------

11>C:\Program Files (x86)\MSBuild\Microsoft.Cpp\v4.0\BuildCustomizations\CUDA 4.0.targets(76,9): error MSB4062: The “Nvda.Build.CudaTasks.SanitizePaths” task could not be loaded from the assembly C:\Program Files (x86)\MSBuild\Microsoft.Cpp\v4.0\BuildCustomizations\Nvda.Build.CudaTasks.v4.0.dll. Could not load file or assembly ‘file:///C:\Program Files (x86)\MSBuild\Microsoft.Cpp\v4.0\BuildCustomizations\Nvda.Build.CudaTasks.v4.0.dll’ or one of its dependencies. The system cannot find the file specified. Confirm that the declaration is correct, that the assembly and all its dependencies are available, and that the task contains a public class that implements Microsoft.Build.Framework.ITask.

14>------ Rebuild All started: Project: threadMigration, Configuration: Debug x64 ------

13>C:\Program Files (x86)\MSBuild\Microsoft.Cpp\v4.0\BuildCustomizations\CUDA 4.0.targets(76,9): error MSB4062: The “Nvda.Build.CudaTasks.SanitizePaths” task could not be loaded from the assembly C:\Program Files (x86)\MSBuild\Microsoft.Cpp\v4.0\BuildCustomizations\Nvda.Build.CudaTasks.v4.0.dll. Could not load file or assembly ‘file:///C:\Program Files (x86)\MSBuild\Microsoft.Cpp\v4.0\BuildCustomizations\Nvda.Build.CudaTasks.v4.0.dll’ or one of its dependencies. The system cannot find the file specified. Confirm that the declaration is correct, that the assembly and all its dependencies are available, and that the task contains a public class that implements Microsoft.Build.Framework.ITask.

14>C:\Program Files (x86)\MSBuild\Microsoft.Cpp\v4.0\BuildCustomizations\CUDA 4.0.targets(76,9): error MSB4062: The “Nvda.Build.CudaTasks.SanitizePaths” task could not be loaded from the assembly C:\Program Files (x86)\MSBuild\Microsoft.Cpp\v4.0\BuildCustomizations\Nvda.Build.CudaTasks.v4.0.dll. Could not load file or assembly ‘file:///C:\Program Files (x86)\MSBuild\Microsoft.Cpp\v4.0\BuildCustomizations\Nvda.Build.CudaTasks.v4.0.dll’ or one of its dependencies. The system cannot find the file specified. Confirm that the declaration is correct, that the assembly and all its dependencies are available, and that the task contains a public class that implements Microsoft.Build.Framework.ITask.

12>C:\Program Files (x86)\MSBuild\Microsoft.Cpp\v4.0\BuildCustomizations\CUDA 4.0.targets(76,9): error MSB4062: The “Nvda.Build.CudaTasks.SanitizePaths” task could not be loaded from the assembly C:\Program Files (x86)\MSBuild\Microsoft.Cpp\v4.0\BuildCustomizations\Nvda.Build.CudaTasks.v4.0.dll. Could not load file or assembly ‘file:///C:\Program Files (x86)\MSBuild\Microsoft.Cpp\v4.0\BuildCustomizations\Nvda.Build.CudaTasks.v4.0.dll’ or one of its dependencies. The system cannot find the file specified. Confirm that the declaration is correct, that the assembly and all its dependencies are available, and that the task contains a public class that implements Microsoft.Build.Framework.ITask.

15>------ Rebuild All started: Project: threadFenceReduction, Configuration: Debug x64 ------

15>C:\Program Files (x86)\MSBuild\Microsoft.Cpp\v4.0\BuildCustomizations\CUDA 4.0.targets(76,9): error MSB4062: The “Nvda.Build.CudaTasks.SanitizePaths” task could not be loaded from the assembly C:\Program Files (x86)\MSBuild\Microsoft.Cpp\v4.0\BuildCustomizations\Nvda.Build.CudaTasks.v4.0.dll. Could not load file or assembly ‘file:///C:\Program Files (x86)\MSBuild\Microsoft.Cpp\v4.0\BuildCustomizations\Nvda.Build.CudaTasks.v4.0.dll’ or one of its dependencies. The system cannot find the file specified. Confirm that the declaration is correct, that the assembly and all its dependencies are available, and that the task contains a public class that implements Microsoft.Build.Framework.ITask.

16>------ Rebuild All started: Project: template, Configuration: Debug x64 ------

17>------ Rebuild All started: Project: sortingNetworks, Configuration: Debug x64 ------

18>------ Rebuild All started: Project: SobolQRNG, Configuration: Debug x64 ------

19>------ Rebuild All started: Project: SobelFilter, Configuration: Debug x64 ------

16>C:\Program Files (x86)\MSBuild\Microsoft.Cpp\v4.0\BuildCustomizations\CUDA 4.0.targets(76,9): error MSB4062: The “Nvda.Build.CudaTasks.SanitizePaths” task could not be loaded from the assembly C:\Program Files (x86)\MSBuild\Microsoft.Cpp\v4.0\BuildCustomizations\Nvda.Build.CudaTasks.v4.0.dll. Could not load file or assembly ‘file:///C:\Program Files (x86)\MSBuild\Microsoft.Cpp\v4.0\BuildCustomizations\Nvda.Build.CudaTasks.v4.0.dll’ or one of its dependencies. The system cannot find the file specified. Confirm that the declaration is correct, that the assembly and all its dependencies are available, and that the task contains a public class that implements Microsoft.Build.Framework.ITask.

18>C:\Program Files (x86)\MSBuild\Microsoft.Cpp\v4.0\BuildCustomizations\CUDA 4.0.targets(76,9): error MSB4062: The “Nvda.Build.CudaTasks.SanitizePaths” task could not be loaded from the assembly C:\Program Files (x86)\MSBuild\Microsoft.Cpp\v4.0\BuildCustomizations\Nvda.Build.CudaTasks.v4.0.dll. Could not load file or assembly ‘file:///C:\Program Files (x86)\MSBuild\Microsoft.Cpp\v4.0\BuildCustomizations\Nvda.Build.CudaTasks.v4.0.dll’ or one of its dependencies. The system cannot find the file specified. Confirm that the declaration is correct, that the assembly and all its dependencies are available, and that the task contains a public class that implements Microsoft.Build.Framework.ITask.

17>C:\Program Files (x86)\MSBuild\Microsoft.Cpp\v4.0\BuildCustomizations\CUDA 4.0.targets(76,9): error MSB4062: The “Nvda.Build.CudaTasks.SanitizePaths” task could not be loaded from the assembly C:\Program Files (x86)\MSBuild\Microsoft.Cpp\v4.0\BuildCustomizations\Nvda.Build.CudaTasks.v4.0.dll. Could not load file or assembly ‘file:///C:\Program Files (x86)\MSBuild\Microsoft.Cpp\v4.0\BuildCustomizations\Nvda.Build.CudaTasks.v4.0.dll’ or one of its dependencies. The system cannot find the file specified. Confirm that the declaration is correct, that the assembly and all its dependencies are available, and that the task contains a public class that implements Microsoft.Build.Framework.ITask.

19>C:\Program Files (x86)\MSBuild\Microsoft.Cpp\v4.0\BuildCustomizations\CUDA 4.0.targets(76,9): error MSB4062: The “Nvda.Build.CudaTasks.SanitizePaths” task could not be loaded from the assembly C:\Program Files (x86)\MSBuild\Microsoft.Cpp\v4.0\BuildCustomizations\Nvda.Build.CudaTasks.v4.0.dll. Could not load file or assembly ‘file:///C:\Program Files (x86)\MSBuild\Microsoft.Cpp\v4.0\BuildCustomizations\Nvda.Build.CudaTasks.v4.0.dll’ or one of its dependencies. The system cannot find the file specified. Confirm that the declaration is correct, that the assembly and all its dependencies are available, and that the task contains a public class that implements Microsoft.Build.Framework.ITask.

20>------ Rebuild All started: Project: smokeParticles, Configuration: Debug x64 ------

20>C:\Program Files (x86)\MSBuild\Microsoft.Cpp\v4.0\BuildCustomizations\CUDA 4.0.targets(76,9): error MSB4062: The “Nvda.Build.CudaTasks.SanitizePaths” task could not be loaded from the assembly C:\Program Files (x86)\MSBuild\Microsoft.Cpp\v4.0\BuildCustomizations\Nvda.Build.CudaTasks.v4.0.dll. Could not load file or assembly ‘file:///C:\Program Files (x86)\MSBuild\Microsoft.Cpp\v4.0\BuildCustomizations\Nvda.Build.CudaTasks.v4.0.dll’ or one of its dependencies. The system cannot find the file specified. Confirm that the declaration is correct, that the assembly and all its dependencies are available, and that the task contains a public class that implements Microsoft.Build.Framework.ITask.

21>------ Rebuild All started: Project: SLID3D10Texture, Configuration: Debug x64 ------

22>------ Rebuild All started: Project: simpleZeroCopy, Configuration: Debug x64 ------

23>------ Rebuild All started: Project: simpleVoteIntrinsics, Configuration: Debug x64 ------

24>------ Rebuild All started: Project: simpleTexture3D, Configuration: Debug x64 ------

24>C:\Program Files (x86)\MSBuild\Microsoft.Cpp\v4.0\BuildCustomizations\CUDA 4.0.targets(76,9): error MSB4062: The “Nvda.Build.CudaTasks.SanitizePaths” task could not be loaded from the assembly C:\Program Files (x86)\MSBuild\Microsoft.Cpp\v4.0\BuildCustomizations\Nvda.Build.CudaTasks.v4.0.dll. Could not load file or assembly ‘file:///C:\Program Files (x86)\MSBuild\Microsoft.Cpp\v4.0\BuildCustomizations\Nvda.Build.CudaTasks.v4.0.dll’ or one of its dependencies. The system cannot find the file specified. Confirm that the declaration is correct, that the assembly and all its dependencies are available, and that the task contains a public class that implements Microsoft.Build.Framework.ITask.

21>C:\Program Files (x86)\MSBuild\Microsoft.Cpp\v4.0\BuildCustomizations\CUDA 4.0.targets(76,9): error MSB4062: The “Nvda.Build.CudaTasks.SanitizePaths” task could not be loaded from the assembly C:\Program Files (x86)\MSBuild\Microsoft.Cpp\v4.0\BuildCustomizations\Nvda.Build.CudaTasks.v4.0.dll. Could not load file or assembly ‘file:///C:\Program Files (x86)\MSBuild\Microsoft.Cpp\v4.0\BuildCustomizations\Nvda.Build.CudaTasks.v4.0.dll’ or one of its dependencies. The system cannot find the file specified. Confirm that the declaration is correct, that the assembly and all its dependencies are available, and that the task contains a public class that implements Microsoft.Build.Framework.ITask.

23>C:\Program Files (x86)\MSBuild\Microsoft.Cpp\v4.0\BuildCustomizations\CUDA 4.0.targets(76,9): error MSB4062: The “Nvda.Build.CudaTasks.SanitizePaths” task could not be loaded from the assembly C:\Program Files (x86)\MSBuild\Microsoft.Cpp\v4.0\BuildCustomizations\Nvda.Build.CudaTasks.v4.0.dll. Could not load file or assembly ‘file:///C:\Program Files (x86)\MSBuild\Microsoft.Cpp\v4.0\BuildCustomizations\Nvda.Build.CudaTasks.v4.0.dll’ or one of its dependencies. The system cannot find the file specified. Confirm that the declaration is correct, that the assembly and all its dependencies are available, and that the task contains a public class that implements Microsoft.Build.Framework.ITask.

22>C:\Program Files (x86)\MSBuild\Microsoft.Cpp\v4.0\BuildCustomizations\CUDA 4.0.targets(76,9): error MSB4062: The “Nvda.Build.CudaTasks.SanitizePaths” task could not be loaded from the assembly C:\Program Files (x86)\MSBuild\Microsoft.Cpp\v4.0\BuildCustomizations\Nvda.Build.CudaTasks.v4.0.dll. Could not load file or assembly ‘file:///C:\Program Files (x86)\MSBuild\Microsoft.Cpp\v4.0\BuildCustomizations\Nvda.Build.CudaTasks.v4.0.dll’ or one of its dependencies. The system cannot find the file specified. Confirm that the declaration is correct, that the assembly and all its dependencies are available, and that the task contains a public class that implements Microsoft.Build.Framework.ITask.

25>------ Rebuild All started: Project: simpleTextureDrv, Configuration: Debug x64 ------

26>------ Rebuild All started: Project: simpleTexture, Configuration: Debug x64 ------

26>C:\Program Files (x86)\MSBuild\Microsoft.Cpp\v4.0\BuildCustomizations\CUDA 4.0.targets(76,9): error MSB4062: The “Nvda.Build.CudaTasks.SanitizePaths” task could not be loaded from the assembly C:\Program Files (x86)\MSBuild\Microsoft.Cpp\v4.0\BuildCustomizations\Nvda.Build.CudaTasks.v4.0.dll. Could not load file or assembly ‘file:///C:\Program Files (x86)\MSBuild\Microsoft.Cpp\v4.0\BuildCustomizations\Nvda.Build.CudaTasks.v4.0.dll’ or one of its dependencies. The system cannot find the file specified. Confirm that the declaration is correct, that the assembly and all its dependencies are available, and that the task contains a public class that implements Microsoft.Build.Framework.ITask.

25>C:\Program Files (x86)\MSBuild\Microsoft.Cpp\v4.0\BuildCustomizations\CUDA 4.0.targets(76,9): error MSB4062: The “Nvda.Build.CudaTasks.SanitizePaths” task could not be loaded from the assembly C:\Program Files (x86)\MSBuild\Microsoft.Cpp\v4.0\BuildCustomizations\Nvda.Build.CudaTasks.v4.0.dll. Could not load file or assembly ‘file:///C:\Program Files (x86)\MSBuild\Microsoft.Cpp\v4.0\BuildCustomizations\Nvda.Build.CudaTasks.v4.0.dll’ or one of its dependencies. The system cannot find the file specified. Confirm that the declaration is correct, that the assembly and all its dependencies are available, and that the task contains a public class that implements Microsoft.Build.Framework.ITask.

27>------ Rebuild All started: Project: simpleTemplates, Configuration: Debug x64 ------

28>------ Rebuild All started: Project: simpleSurfaceWrite, Configuration: Debug x64 ------

27>C:\Program Files (x86)\MSBuild\Microsoft.Cpp\v4.0\BuildCustomizations\CUDA 4.0.targets(76,9): error MSB4062: The “Nvda.Build.CudaTasks.SanitizePaths” task could not be loaded from the assembly C:\Program Files (x86)\MSBuild\Microsoft.Cpp\v4.0\BuildCustomizations\Nvda.Build.CudaTasks.v4.0.dll. Could not load file or assembly ‘file:///C:\Program Files (x86)\MSBuild\Microsoft.Cpp\v4.0\BuildCustomizations\Nvda.Build.CudaTasks.v4.0.dll’ or one of its dependencies. The system cannot find the file specified. Confirm that the declaration is correct, that the assembly and all its dependencies are available, and that the task contains a public class that implements Microsoft.Build.Framework.ITask.

29>------ Rebuild All started: Project: simpleStreams, Configuration: Debug x64 ------

28>C:\Program Files (x86)\MSBuild\Microsoft.Cpp\v4.0\BuildCustomizations\CUDA 4.0.targets(76,9): error MSB4062: The “Nvda.Build.CudaTasks.SanitizePaths” task could not be loaded from the assembly C:\Program Files (x86)\MSBuild\Microsoft.Cpp\v4.0\BuildCustomizations\Nvda.Build.CudaTasks.v4.0.dll. Could not load file or assembly ‘file:///C:\Program Files (x86)\MSBuild\Microsoft.Cpp\v4.0\BuildCustomizations\Nvda.Build.CudaTasks.v4.0.dll’ or one of its dependencies. The system cannot find the file specified. Confirm that the declaration is correct, that the assembly and all its dependencies are available, and that the task contains a public class that implements Microsoft.Build.Framework.ITask.

30>------ Rebuild All started: Project: simplePrintf, Configuration: Debug x64 ------

29>C:\Program Files (x86)\MSBuild\Microsoft.Cpp\v4.0\BuildCustomizations\CUDA 4.0.targets(76,9): error MSB4062: The “Nvda.Build.CudaTasks.SanitizePaths” task could not be loaded from the assembly C:\Program Files (x86)\MSBuild\Microsoft.Cpp\v4.0\BuildCustomizations\Nvda.Build.CudaTasks.v4.0.dll. Could not load file or assembly ‘file:///C:\Program Files (x86)\MSBuild\Microsoft.Cpp\v4.0\BuildCustomizations\Nvda.Build.CudaTasks.v4.0.dll’ or one of its dependencies. The system cannot find the file specified. Confirm that the declaration is correct, that the assembly and all its dependencies are available, and that the task contains a public class that implements Microsoft.Build.Framework.ITask.

30>C:\Program Files (x86)\MSBuild\Microsoft.Cpp\v4.0\BuildCustomizations\CUDA 4.0.targets(76,9): error MSB4062: The “Nvda.Build.CudaTasks.SanitizePaths” task could not be loaded from the assembly C:\Program Files (x86)\MSBuild\Microsoft.Cpp\v4.0\BuildCustomizations\Nvda.Build.CudaTasks.v4.0.dll. Could not load file or assembly ‘file:///C:\Program Files (x86)\MSBuild\Microsoft.Cpp\v4.0\BuildCustomizations\Nvda.Build.CudaTasks.v4.0.dll’ or one of its dependencies. The system cannot find the file specified. Confirm that the declaration is correct, that the assembly and all its dependencies are available, and that the task contains a public class that implements Microsoft.Build.Framework.ITask.

31>------ Rebuild All started: Project: simplePitchLinearTexture, Configuration: Debug x64 ------

32>------ Rebuild All started: Project: simpleP2P, Configuration: Debug x64 ------

33>------ Rebuild All started: Project: simpleMultiGPU, Configuration: Debug x64 ------

32>C:\Program Files (x86)\MSBuild\Microsoft.Cpp\v4.0\BuildCustomizations\CUDA 4.0.targets(76,9): error MSB4062: The “Nvda.Build.CudaTasks.SanitizePaths” task could not be loaded from the assembly C:\Program Files (x86)\MSBuild\Microsoft.Cpp\v4.0\BuildCustomizations\Nvda.Build.CudaTasks.v4.0.dll. Could not load file or assembly ‘file:///C:\Program Files (x86)\MSBuild\Microsoft.Cpp\v4.0\BuildCustomizations\Nvda.Build.CudaTasks.v4.0.dll’ or one of its dependencies. The system cannot find the file specified. Confirm that the declaration is correct, that the assembly and all its dependencies are available, and that the task contains a public class that implements Microsoft.Build.Framework.ITask.

31>C:\Program Files (x86)\MSBuild\Microsoft.Cpp\v4.0\BuildCustomizations\CUDA 4.0.targets(76,9): error MSB4062: The “Nvda.Build.CudaTasks.SanitizePaths” task could not be loaded from the assembly C:\Program Files (x86)\MSBuild\Microsoft.Cpp\v4.0\BuildCustomizations\Nvda.Build.CudaTasks.v4.0.dll. Could not load file or assembly ‘file:///C:\Program Files (x86)\MSBuild\Microsoft.Cpp\v4.0\BuildCustomizations\Nvda.Build.CudaTasks.v4.0.dll’ or one of its dependencies. The system cannot find the file specified. Confirm that the declaration is correct, that the assembly and all its dependencies are available, and that the task contains a public class that implements Microsoft.Build.Framework.ITask.

33>C:\Program Files (x86)\MSBuild\Microsoft.Cpp\v4.0\BuildCustomizations\CUDA 4.0.targets(76,9): error MSB4062: The “Nvda.Build.CudaTasks.SanitizePaths” task could not be loaded from the assembly C:\Program Files (x86)\MSBuild\Microsoft.Cpp\v4.0\BuildCustomizations\Nvda.Build.CudaTasks.v4.0.dll. Could not load file or assembly ‘file:///C:\Program Files (x86)\MSBuild\Microsoft.Cpp\v4.0\BuildCustomizations\Nvda.Build.CudaTasks.v4.0.dll’ or one of its dependencies. The system cannot find the file specified. Confirm that the declaration is correct, that the assembly and all its dependencies are available, and that the task contains a public class that implements Microsoft.Build.Framework.ITask.

34>------ Rebuild All started: Project: simpleMultiCopy, Configuration: Debug x64 ------

34>C:\Program Files (x86)\MSBuild\Microsoft.Cpp\v4.0\BuildCustomizations\CUDA 4.0.targets(76,9): error MSB4062: The “Nvda.Build.CudaTasks.SanitizePaths” task could not be loaded from the assembly C:\Program Files (x86)\MSBuild\Microsoft.Cpp\v4.0\BuildCustomizations\Nvda.Build.CudaTasks.v4.0.dll. Could not load file or assembly ‘file:///C:\Program Files (x86)\MSBuild\Microsoft.Cpp\v4.0\BuildCustomizations\Nvda.Build.CudaTasks.v4.0.dll’ or one of its dependencies. The system cannot find the file specified. Confirm that the declaration is correct, that the assembly and all its dependencies are available, and that the task contains a public class that implements Microsoft.Build.Framework.ITask.

35>------ Rebuild All started: Project: simpleLayeredTexture, Configuration: Debug x64 ------

36>------ Rebuild All started: Project: simpleGL, Configuration: Debug x64 ------

37>------ Rebuild All started: Project: simpleD3D11Texture, Configuration: Debug x64 ------

35>C:\Program Files (x86)\MSBuild\Microsoft.Cpp\v4.0\BuildCustomizations\CUDA 4.0.targets(76,9): error MSB4062: The “Nvda.Build.CudaTasks.SanitizePaths” task could not be loaded from the assembly C:\Program Files (x86)\MSBuild\Microsoft.Cpp\v4.0\BuildCustomizations\Nvda.Build.CudaTasks.v4.0.dll. Could not load file or assembly ‘file:///C:\Program Files (x86)\MSBuild\Microsoft.Cpp\v4.0\BuildCustomizations\Nvda.Build.CudaTasks.v4.0.dll’ or one of its dependencies. The system cannot find the file specified. Confirm that the declaration is correct, that the assembly and all its dependencies are available, and that the task contains a public class that implements Microsoft.Build.Framework.ITask.

38>------ Rebuild All started: Project: simpleD3D10Texture, Configuration: Debug x64 ------

36>C:\Program Files (x86)\MSBuild\Microsoft.Cpp\v4.0\BuildCustomizations\CUDA 4.0.targets(76,9): error MSB4062: The “Nvda.Build.CudaTasks.SanitizePaths” task could not be loaded from the assembly C:\Program Files (x86)\MSBuild\Microsoft.Cpp\v4.0\BuildCustomizations\Nvda.Build.CudaTasks.v4.0.dll. Could not load file or assembly ‘file:///C:\Program Files (x86)\MSBuild\Microsoft.Cpp\v4.0\BuildCustomizations\Nvda.Build.CudaTasks.v4.0.dll’ or one of its dependencies. The system cannot find the file specified. Confirm that the declaration is correct, that the assembly and all its dependencies are available, and that the task contains a public class that implements Microsoft.Build.Framework.ITask.

37>C:\Program Files (x86)\MSBuild\Microsoft.Cpp\v4.0\BuildCustomizations\CUDA 4.0.targets(76,9): error MSB4062: The “Nvda.Build.CudaTasks.SanitizePaths” task could not be loaded from the assembly C:\Program Files (x86)\MSBuild\Microsoft.Cpp\v4.0\BuildCustomizations\Nvda.Build.CudaTasks.v4.0.dll. Could not load file or assembly ‘file:///C:\Program Files (x86)\MSBuild\Microsoft.Cpp\v4.0\BuildCustomizations\Nvda.Build.CudaTasks.v4.0.dll’ or one of its dependencies. The system cannot find the file specified. Confirm that the declaration is correct, that the assembly and all its dependencies are available, and that the task contains a public class that implements Microsoft.Build.Framework.ITask.

39>------ Rebuild All started: Project: simpleD3D10, Configuration: Debug x64 ------

39>C:\Program Files (x86)\MSBuild\Microsoft.Cpp\v4.0\BuildCustomizations\CUDA 4.0.targets(76,9): error MSB4062: The “Nvda.Build.CudaTasks.SanitizePaths” task could not be loaded from the assembly C:\Program Files (x86)\MSBuild\Microsoft.Cpp\v4.0\BuildCustomizations\Nvda.Build.CudaTasks.v4.0.dll. Could not load file or assembly ‘file:///C:\Program Files (x86)\MSBuild\Microsoft.Cpp\v4.0\BuildCustomizations\Nvda.Build.CudaTasks.v4.0.dll’ or one of its dependencies. The system cannot find the file specified. Confirm that the declaration is correct, that the assembly and all its dependencies are available, and that the task contains a public class that implements Microsoft.Build.Framework.ITask.

38>C:\Program Files (x86)\MSBuild\Microsoft.Cpp\v4.0\BuildCustomizations\CUDA 4.0.targets(76,9): error MSB4062: The “Nvda.Build.CudaTasks.SanitizePaths” task could not be loaded from the assembly C:\Program Files (x86)\MSBuild\Microsoft.Cpp\v4.0\BuildCustomizations\Nvda.Build.CudaTasks.v4.0.dll. Could not load file or assembly ‘file:///C:\Program Files (x86)\MSBuild\Microsoft.Cpp\v4.0\BuildCustomizations\Nvda.Build.CudaTasks.v4.0.dll’ or one of its dependencies. The system cannot find the file specified. Confirm that the declaration is correct, that the assembly and all its dependencies are available, and that the task contains a public class that implements Microsoft.Build.Framework.ITask.

40>------ Rebuild All started: Project: simpleD3D9Texture, Configuration: Debug x64 ------

41>------ Rebuild All started: Project: simpleD3D9, Configuration: Debug x64 ------

40>C:\Program Files (x86)\MSBuild\Microsoft.Cpp\v4.0\BuildCustomizations\CUDA 4.0.targets(76,9): error MSB4062: The “Nvda.Build.CudaTasks.SanitizePaths” task could not be loaded from the assembly C:\Program Files (x86)\MSBuild\Microsoft.Cpp\v4.0\BuildCustomizations\Nvda.Build.CudaTasks.v4.0.dll. Could not load file or assembly ‘file:///C:\Program Files (x86)\MSBuild\Microsoft.Cpp\v4.0\BuildCustomizations\Nvda.Build.CudaTasks.v4.0.dll’ or one of its dependencies. The system cannot find the file specified. Confirm that the declaration is correct, that the assembly and all its dependencies are available, and that the task contains a public class that implements Microsoft.Build.Framework.ITask.

42>------ Rebuild All started: Project: simpleAtomicIntrinsics, Configuration: Debug x64 ------

41>C:\Program Files (x86)\MSBuild\Microsoft.Cpp\v4.0\BuildCustomizations\CUDA 4.0.targets(76,9): error MSB4062: The “Nvda.Build.CudaTasks.SanitizePaths” task could not be loaded from the assembly C:\Program Files (x86)\MSBuild\Microsoft.Cpp\v4.0\BuildCustomizations\Nvda.Build.CudaTasks.v4.0.dll. Could not load file or assembly ‘file:///C:\Program Files (x86)\MSBuild\Microsoft.Cpp\v4.0\BuildCustomizations\Nvda.Build.CudaTasks.v4.0.dll’ or one of its dependencies. The system cannot find the file specified. Confirm that the declaration is correct, that the assembly and all its dependencies are available, and that the task contains a public class that implements Microsoft.Build.Framework.ITask.

43>------ Rebuild All started: Project: scan, Configuration: Debug x64 ------

44>------ Rebuild All started: Project: scalarProd, Configuration: Debug x64 ------

42>C:\Program Files (x86)\MSBuild\Microsoft.Cpp\v4.0\BuildCustomizations\CUDA 4.0.targets(76,9): error MSB4062: The “Nvda.Build.CudaTasks.SanitizePaths” task could not be loaded from the assembly C:\Program Files (x86)\MSBuild\Microsoft.Cpp\v4.0\BuildCustomizations\Nvda.Build.CudaTasks.v4.0.dll. Could not load file or assembly ‘file:///C:\Program Files (x86)\MSBuild\Microsoft.Cpp\v4.0\BuildCustomizations\Nvda.Build.CudaTasks.v4.0.dll’ or one of its dependencies. The system cannot find the file specified. Confirm that the declaration is correct, that the assembly and all its dependencies are available, and that the task contains a public class that implements Microsoft.Build.Framework.ITask.

45>------ Rebuild All started: Project: reduction, Configuration: Debug x64 ------

43>C:\Program Files (x86)\MSBuild\Microsoft.Cpp\v4.0\BuildCustomizations\CUDA 4.0.targets(76,9): error MSB4062: The “Nvda.Build.CudaTasks.SanitizePaths” task could not be loaded from the assembly C:\Program Files (x86)\MSBuild\Microsoft.Cpp\v4.0\BuildCustomizations\Nvda.Build.CudaTasks.v4.0.dll. Could not load file or assembly ‘file:///C:\Program Files (x86)\MSBuild\Microsoft.Cpp\v4.0\BuildCustomizations\Nvda.Build.CudaTasks.v4.0.dll’ or one of its dependencies. The system cannot find the file specified. Confirm that the declaration is correct, that the assembly and all its dependencies are available, and that the task contains a public class that implements Microsoft.Build.Framework.ITask.

46>------ Rebuild All started: Project: recursiveGaussian, Configuration: Debug x64 ------

47>------ Rebuild All started: Project: radixSortThrust, Configuration: Debug x64 ------

44>C:\Program Files (x86)\MSBuild\Microsoft.Cpp\v4.0\BuildCustomizations\CUDA 4.0.targets(76,9): error MSB4062: The “Nvda.Build.CudaTasks.SanitizePaths” task could not be loaded from the assembly C:\Program Files (x86)\MSBuild\Microsoft.Cpp\v4.0\BuildCustomizations\Nvda.Build.CudaTasks.v4.0.dll. Could not load file or assembly ‘file:///C:\Program Files (x86)\MSBuild\Microsoft.Cpp\v4.0\BuildCustomizations\Nvda.Build.CudaTasks.v4.0.dll’ or one of its dependencies. The system cannot find the file specified. Confirm that the declaration is correct, that the assembly and all its dependencies are available, and that the task contains a public class that implements Microsoft.Build.Framework.ITask.

45>C:\Program Files (x86)\MSBuild\Microsoft.Cpp\v4.0\BuildCustomizations\CUDA 4.0.targets(76,9): error MSB4062: The “Nvda.Build.CudaTasks.SanitizePaths” task could not be loaded from the assembly C:\Program Files (x86)\MSBuild\Microsoft.Cpp\v4.0\BuildCustomizations\Nvda.Build.CudaTasks.v4.0.dll. Could not load file or assembly ‘file:///C:\Program Files (x86)\MSBuild\Microsoft.Cpp\v4.0\BuildCustomizations\Nvda.Build.CudaTasks.v4.0.dll’ or one of its dependencies. The system cannot find the file specified. Confirm that the declaration is correct, that the assembly and all its dependencies are available, and that the task contains a public class that implements Microsoft.Build.Framework.ITask.

48>------ Rebuild All started: Project: quasirandomGenerator, Configuration: Debug x64 ------

47>C:\Program Files (x86)\MSBuild\Microsoft.Cpp\v4.0\BuildCustomizations\CUDA 4.0.targets(76,9): error MSB4062: The “Nvda.Build.CudaTasks.SanitizePaths” task could not be loaded from the assembly C:\Program Files (x86)\MSBuild\Microsoft.Cpp\v4.0\BuildCustomizations\Nvda.Build.CudaTasks.v4.0.dll. Could not load file or assembly ‘file:///C:\Program Files (x86)\MSBuild\Microsoft.Cpp\v4.0\BuildCustomizations\Nvda.Build.CudaTasks.v4.0.dll’ or one of its dependencies. The system cannot find the file specified. Confirm that the declaration is correct, that the assembly and all its dependencies are available, and that the task contains a public class that implements Microsoft.Build.Framework.ITask.

46>C:\Program Files (x86)\MSBuild\Microsoft.Cpp\v4.0\BuildCustomizations\CUDA 4.0.targets(76,9): error MSB4062: The “Nvda.Build.CudaTasks.SanitizePaths” task could not be loaded from the assembly C:\Program Files (x86)\MSBuild\Microsoft.Cpp\v4.0\BuildCustomizations\Nvda.Build.CudaTasks.v4.0.dll. Could not load file or assembly ‘file:///C:\Program Files (x86)\MSBuild\Microsoft.Cpp\v4.0\BuildCustomizations\Nvda.Build.CudaTasks.v4.0.dll’ or one of its dependencies. The system cannot find the file specified. Confirm that the declaration is correct, that the assembly and all its dependencies are available, and that the task contains a public class that implements Microsoft.Build.Framework.ITask.

48>C:\Program Files (x86)\MSBuild\Microsoft.Cpp\v4.0\BuildCustomizations\CUDA 4.0.targets(76,9): error MSB4062: The “Nvda.Build.CudaTasks.SanitizePaths” task could not be loaded from the assembly C:\Program Files (x86)\MSBuild\Microsoft.Cpp\v4.0\BuildCustomizations\Nvda.Build.CudaTasks.v4.0.dll. Could not load file or assembly ‘file:///C:\Program Files (x86)\MSBuild\Microsoft.Cpp\v4.0\BuildCustomizations\Nvda.Build.CudaTasks.v4.0.dll’ or one of its dependencies. The system cannot find the file specified. Confirm that the declaration is correct, that the assembly and all its dependencies are available, and that the task contains a public class that implements Microsoft.Build.Framework.ITask.

49>------ Rebuild All started: Project: ptxjit, Configuration: Debug x64 ------

50>------ Rebuild All started: Project: postProcessGL, Configuration: Debug x64 ------

51>------ Rebuild All started: Project: particles, Configuration: Debug x64 ------

52>------ Rebuild All started: Project: oceanFFT, Configuration: Debug x64 ------

52>C:\Program Files (x86)\MSBuild\Microsoft.Cpp\v4.0\BuildCustomizations\CUDA 4.0.targets(76,9): error MSB4062: The “Nvda.Build.CudaTasks.SanitizePaths” task could not be loaded from the assembly C:\Program Files (x86)\MSBuild\Microsoft.Cpp\v4.0\BuildCustomizations\Nvda.Build.CudaTasks.v4.0.dll. Could not load file or assembly ‘file:///C:\Program Files (x86)\MSBuild\Microsoft.Cpp\v4.0\BuildCustomizations\Nvda.Build.CudaTasks.v4.0.dll’ or one of its dependencies. The system cannot find the file specified. Confirm that the declaration is correct, that the assembly and all its dependencies are available, and that the task contains a public class that implements Microsoft.Build.Framework.ITask.

50>C:\Program Files (x86)\MSBuild\Microsoft.Cpp\v4.0\BuildCustomizations\CUDA 4.0.targets(76,9): error MSB4062: The “Nvda.Build.CudaTasks.SanitizePaths” task could not be loaded from the assembly C:\Program Files (x86)\MSBuild\Microsoft.Cpp\v4.0\BuildCustomizations\Nvda.Build.CudaTasks.v4.0.dll. Could not load file or assembly ‘file:///C:\Program Files (x86)\MSBuild\Microsoft.Cpp\v4.0\BuildCustomizations\Nvda.Build.CudaTasks.v4.0.dll’ or one of its dependencies. The system cannot find the file specified. Confirm that the declaration is correct, that the assembly and all its dependencies are available, and that the task contains a public class that implements Microsoft.Build.Framework.ITask.

51>C:\Program Files (x86)\MSBuild\Microsoft.Cpp\v4.0\BuildCustomizations\CUDA 4.0.targets(76,9): error MSB4062: The “Nvda.Build.CudaTasks.SanitizePaths” task could not be loaded from the assembly C:\Program Files (x86)\MSBuild\Microsoft.Cpp\v4.0\BuildCustomizations\Nvda.Build.CudaTasks.v4.0.dll. Could not load file or assembly ‘file:///C:\Program Files (x86)\MSBuild\Microsoft.Cpp\v4.0\BuildCustomizations\Nvda.Build.CudaTasks.v4.0.dll’ or one of its dependencies. The system cannot find the file specified. Confirm that the declaration is correct, that the assembly and all its dependencies are available, and that the task contains a public class that implements Microsoft.Build.Framework.ITask.

49> ptxjit.cpp

53>------ Rebuild All started: Project: nbody, Configuration: Debug x64 ------

54>------ Rebuild All started: Project: newdelete, Configuration: Debug x64 ------

53>C:\Program Files (x86)\MSBuild\Microsoft.Cpp\v4.0\BuildCustomizations\CUDA 4.0.targets(76,9): error MSB4062: The “Nvda.Build.CudaTasks.SanitizePaths” task could not be loaded from the assembly C:\Program Files (x86)\MSBuild\Microsoft.Cpp\v4.0\BuildCustomizations\Nvda.Build.CudaTasks.v4.0.dll. Could not load file or assembly ‘file:///C:\Program Files (x86)\MSBuild\Microsoft.Cpp\v4.0\BuildCustomizations\Nvda.Build.CudaTasks.v4.0.dll’ or one of its dependencies. The system cannot find the file specified. Confirm that the declaration is correct, that the assembly and all its dependencies are available, and that the task contains a public class that implements Microsoft.Build.Framework.ITask.

54>C:\Program Files (x86)\MSBuild\Microsoft.Cpp\v4.0\BuildCustomizations\CUDA 4.0.targets(76,9): error MSB4062: The “Nvda.Build.CudaTasks.SanitizePaths” task could not be loaded from the assembly C:\Program Files (x86)\MSBuild\Microsoft.Cpp\v4.0\BuildCustomizations\Nvda.Build.CudaTasks.v4.0.dll. Could not load file or assembly ‘file:///C:\Program Files (x86)\MSBuild\Microsoft.Cpp\v4.0\BuildCustomizations\Nvda.Build.CudaTasks.v4.0.dll’ or one of its dependencies. The system cannot find the file specified. Confirm that the declaration is correct, that the assembly and all its dependencies are available, and that the task contains a public class that implements Microsoft.Build.Framework.ITask.

55>------ Rebuild All started: Project: MonteCarloMultiGPU, Configuration: Debug x64 ------

55>C:\Program Files (x86)\MSBuild\Microsoft.Cpp\v4.0\BuildCustomizations\CUDA 4.0.targets(76,9): error MSB4062: The “Nvda.Build.CudaTasks.SanitizePaths” task could not be loaded from the assembly C:\Program Files (x86)\MSBuild\Microsoft.Cpp\v4.0\BuildCustomizations\Nvda.Build.CudaTasks.v4.0.dll. Could not load file or assembly ‘file:///C:\Program Files (x86)\MSBuild\Microsoft.Cpp\v4.0\BuildCustomizations\Nvda.Build.CudaTasks.v4.0.dll’ or one of its dependencies. The system cannot find the file specified. Confirm that the declaration is correct, that the assembly and all its dependencies are available, and that the task contains a public class that implements Microsoft.Build.Framework.ITask.

56>------ Rebuild All started: Project: MonteCarlo, Configuration: Debug x64 ------

57>------ Rebuild All started: Project: MersenneTwister, Configuration: Debug x64 ------

57>C:\Program Files (x86)\MSBuild\Microsoft.Cpp\v4.0\BuildCustomizations\CUDA 4.0.targets(76,9): error MSB4062: The “Nvda.Build.CudaTasks.SanitizePaths” task could not be loaded from the assembly C:\Program Files (x86)\MSBuild\Microsoft.Cpp\v4.0\BuildCustomizations\Nvda.Build.CudaTasks.v4.0.dll. Could not load file or assembly ‘file:///C:\Program Files (x86)\MSBuild\Microsoft.Cpp\v4.0\BuildCustomizations\Nvda.Build.CudaTasks.v4.0.dll’ or one of its dependencies. The system cannot find the file specified. Confirm that the declaration is correct, that the assembly and all its dependencies are available, and that the task contains a public class that implements Microsoft.Build.Framework.ITask.

56>C:\Program Files (x86)\MSBuild\Microsoft.Cpp\v4.0\BuildCustomizations\CUDA 4.0.targets(76,9): error MSB4062: The “Nvda.Build.CudaTasks.SanitizePaths” task could not be loaded from the assembly C:\Program Files (x86)\MSBuild\Microsoft.Cpp\v4.0\BuildCustomizations\Nvda.Build.CudaTasks.v4.0.dll. Could not load file or assembly ‘file:///C:\Program Files (x86)\MSBuild\Microsoft.Cpp\v4.0\BuildCustomizations\Nvda.Build.CudaTasks.v4.0.dll’ or one of its dependencies. The system cannot find the file specified. Confirm that the declaration is correct, that the assembly and all its dependencies are available, and that the task contains a public class that implements Microsoft.Build.Framework.ITask.

58>------ Rebuild All started: Project: matrixMulDynlinkJIT, Configuration: Debug x64 ------

58> matrixMul_kernel_64_ptxdump.c

59>------ Rebuild All started: Project: matrixMulDrv, Configuration: Debug x64 ------

60>------ Rebuild All started: Project: matrixMul, Configuration: Debug x64 ------

58> matrixMul_kernel_32_ptxdump.c

59>C:\Program Files (x86)\MSBuild\Microsoft.Cpp\v4.0\BuildCustomizations\CUDA 4.0.targets(76,9): error MSB4062: The “Nvda.Build.CudaTasks.SanitizePaths” task could not be loaded from the assembly C:\Program Files (x86)\MSBuild\Microsoft.Cpp\v4.0\BuildCustomizations\Nvda.Build.CudaTasks.v4.0.dll. Could not load file or assembly ‘file:///C:\Program Files (x86)\MSBuild\Microsoft.Cpp\v4.0\BuildCustomizations\Nvda.Build.CudaTasks.v4.0.dll’ or one of its dependencies. The system cannot find the file specified. Confirm that the declaration is correct, that the assembly and all its dependencies are available, and that the task contains a public class that implements Microsoft.Build.Framework.ITask.

60>C:\Program Files (x86)\MSBuild\Microsoft.Cpp\v4.0\BuildCustomizations\CUDA 4.0.targets(76,9): error MSB4062: The “Nvda.Build.CudaTasks.SanitizePaths” task could not be loaded from the assembly C:\Program Files (x86)\MSBuild\Microsoft.Cpp\v4.0\BuildCustomizations\Nvda.Build.CudaTasks.v4.0.dll. Could not load file or assembly ‘file:///C:\Program Files (x86)\MSBuild\Microsoft.Cpp\v4.0\BuildCustomizations\Nvda.Build.CudaTasks.v4.0.dll’ or one of its dependencies. The system cannot find the file specified. Confirm that the declaration is correct, that the assembly and all its dependencies are available, and that the task contains a public class that implements Microsoft.Build.Framework.ITask.

58> cuda_drvapi_dynlink.c

61>------ Rebuild All started: Project: marchingCubes, Configuration: Debug x64 ------

61>C:\Program Files (x86)\MSBuild\Microsoft.Cpp\v4.0\BuildCustomizations\CUDA 4.0.targets(76,9): error MSB4062: The “Nvda.Build.CudaTasks.SanitizePaths” task could not be loaded from the assembly C:\Program Files (x86)\MSBuild\Microsoft.Cpp\v4.0\BuildCustomizations\Nvda.Build.CudaTasks.v4.0.dll. Could not load file or assembly ‘file:///C:\Program Files (x86)\MSBuild\Microsoft.Cpp\v4.0\BuildCustomizations\Nvda.Build.CudaTasks.v4.0.dll’ or one of its dependencies. The system cannot find the file specified. Confirm that the declaration is correct, that the assembly and all its dependencies are available, and that the task contains a public class that implements Microsoft.Build.Framework.ITask.

62>------ Rebuild All started: Project: Mandelbrot, Configuration: Debug x64 ------

62>C:\Program Files (x86)\MSBuild\Microsoft.Cpp\v4.0\BuildCustomizations\CUDA 4.0.targets(76,9): error MSB4062: The “Nvda.Build.CudaTasks.SanitizePaths” task could not be loaded from the assembly C:\Program Files (x86)\MSBuild\Microsoft.Cpp\v4.0\BuildCustomizations\Nvda.Build.CudaTasks.v4.0.dll. Could not load file or assembly ‘file:///C:\Program Files (x86)\MSBuild\Microsoft.Cpp\v4.0\BuildCustomizations\Nvda.Build.CudaTasks.v4.0.dll’ or one of its dependencies. The system cannot find the file specified. Confirm that the declaration is correct, that the assembly and all its dependencies are available, and that the task contains a public class that implements Microsoft.Build.Framework.ITask.

63>------ Rebuild All started: Project: lineOfSight, Configuration: Debug x64 ------

63>C:\Program Files (x86)\MSBuild\Microsoft.Cpp\v4.0\BuildCustomizations\CUDA 4.0.targets(76,9): error MSB4062: The “Nvda.Build.CudaTasks.SanitizePaths” task could not be loaded from the assembly C:\Program Files (x86)\MSBuild\Microsoft.Cpp\v4.0\BuildCustomizations\Nvda.Build.CudaTasks.v4.0.dll. Could not load file or assembly ‘file:///C:\Program Files (x86)\MSBuild\Microsoft.Cpp\v4.0\BuildCustomizations\Nvda.Build.CudaTasks.v4.0.dll’ or one of its dependencies. The system cannot find the file specified. Confirm that the declaration is correct, that the assembly and all its dependencies are available, and that the task contains a public class that implements Microsoft.Build.Framework.ITask.

64>------ Rebuild All started: Project: Interval, Configuration: Debug x64 ------

64>C:\Program Files (x86)\MSBuild\Microsoft.Cpp\v4.0\BuildCustomizations\CUDA 4.0.targets(76,9): error MSB4062: The “Nvda.Build.CudaTasks.SanitizePaths” task could not be loaded from the assembly C:\Program Files (x86)\MSBuild\Microsoft.Cpp\v4.0\BuildCustomizations\Nvda.Build.CudaTasks.v4.0.dll. Could not load file or assembly ‘file:///C:\Program Files (x86)\MSBuild\Microsoft.Cpp\v4.0\BuildCustomizations\Nvda.Build.CudaTasks.v4.0.dll’ or one of its dependencies. The system cannot find the file specified. Confirm that the declaration is correct, that the assembly and all its dependencies are available, and that the task contains a public class that implements Microsoft.Build.Framework.ITask.

65>------ Rebuild All started: Project: inlinePTX, Configuration: Debug x64 ------

65>C:\Program Files (x86)\MSBuild\Microsoft.Cpp\v4.0\BuildCustomizations\CUDA 4.0.targets(76,9): error MSB4062: The “Nvda.Build.CudaTasks.SanitizePaths” task could not be loaded from the assembly C:\Program Files (x86)\MSBuild\Microsoft.Cpp\v4.0\BuildCustomizations\Nvda.Build.CudaTasks.v4.0.dll. Could not load file or assembly ‘file:///C:\Program Files (x86)\MSBuild\Microsoft.Cpp\v4.0\BuildCustomizations\Nvda.Build.CudaTasks.v4.0.dll’ or one of its dependencies. The system cannot find the file specified. Confirm that the declaration is correct, that the assembly and all its dependencies are available, and that the task contains a public class that implements Microsoft.Build.Framework.ITask.

66>------ Rebuild All started: Project: imageDenoising, Configuration: Debug x64 ------

66>C:\Program Files (x86)\MSBuild\Microsoft.Cpp\v4.0\BuildCustomizations\CUDA 4.0.targets(76,9): error MSB4062: The “Nvda.Build.CudaTasks.SanitizePaths” task could not be loaded from the assembly C:\Program Files (x86)\MSBuild\Microsoft.Cpp\v4.0\BuildCustomizations\Nvda.Build.CudaTasks.v4.0.dll. Could not load file or assembly ‘file:///C:\Program Files (x86)\MSBuild\Microsoft.Cpp\v4.0\BuildCustomizations\Nvda.Build.CudaTasks.v4.0.dll’ or one of its dependencies. The system cannot find the file specified. Confirm that the declaration is correct, that the assembly and all its dependencies are available, and that the task contains a public class that implements Microsoft.Build.Framework.ITask.

67>------ Rebuild All started: Project: histogram, Configuration: Debug x64 ------

67>C:\Program Files (x86)\MSBuild\Microsoft.Cpp\v4.0\BuildCustomizations\CUDA 4.0.targets(76,9): error MSB4062: The “Nvda.Build.CudaTasks.SanitizePaths” task could not be loaded from the assembly C:\Program Files (x86)\MSBuild\Microsoft.Cpp\v4.0\BuildCustomizations\Nvda.Build.CudaTasks.v4.0.dll. Could not load file or assembly ‘file:///C:\Program Files (x86)\MSBuild\Microsoft.Cpp\v4.0\BuildCustomizations\Nvda.Build.CudaTasks.v4.0.dll’ or one of its dependencies. The system cannot find the file specified. Confirm that the declaration is correct, that the assembly and all its dependencies are available, and that the task contains a public class that implements Microsoft.Build.Framework.ITask.

68>------ Rebuild All started: Project: FunctionPointers, Configuration: Debug x64 ------

58> Generating Code…

68>C:\Program Files (x86)\MSBuild\Microsoft.Cpp\v4.0\BuildCustomizations\CUDA 4.0.targets(76,9): error MSB4062: The “Nvda.Build.CudaTasks.SanitizePaths” task could not be loaded from the assembly C:\Program Files (x86)\MSBuild\Microsoft.Cpp\v4.0\BuildCustomizations\Nvda.Build.CudaTasks.v4.0.dll. Could not load file or assembly ‘file:///C:\Program Files (x86)\MSBuild\Microsoft.Cpp\v4.0\BuildCustomizations\Nvda.Build.CudaTasks.v4.0.dll’ or one of its dependencies. The system cannot find the file specified. Confirm that the declaration is correct, that the assembly and all its dependencies are available, and that the task contains a public class that implements Microsoft.Build.Framework.ITask.

69>------ Rebuild All started: Project: fluidsGL, Configuration: Debug x64 ------

70>------ Rebuild All started: Project: fluidsD3D9, Configuration: Debug x64 ------

69>C:\Program Files (x86)\MSBuild\Microsoft.Cpp\v4.0\BuildCustomizations\CUDA 4.0.targets(76,9): error MSB4062: The “Nvda.Build.CudaTasks.SanitizePaths” task could not be loaded from the assembly C:\Program Files (x86)\MSBuild\Microsoft.Cpp\v4.0\BuildCustomizations\Nvda.Build.CudaTasks.v4.0.dll. Could not load file or assembly ‘file:///C:\Program Files (x86)\MSBuild\Microsoft.Cpp\v4.0\BuildCustomizations\Nvda.Build.CudaTasks.v4.0.dll’ or one of its dependencies. The system cannot find the file specified. Confirm that the declaration is correct, that the assembly and all its dependencies are available, and that the task contains a public class that implements Microsoft.Build.Framework.ITask.

70>C:\Program Files (x86)\MSBuild\Microsoft.Cpp\v4.0\BuildCustomizations\CUDA 4.0.targets(76,9): error MSB4062: The “Nvda.Build.CudaTasks.SanitizePaths” task could not be loaded from the assembly C:\Program Files (x86)\MSBuild\Microsoft.Cpp\v4.0\BuildCustomizations\Nvda.Build.CudaTasks.v4.0.dll. Could not load file or assembly ‘file:///C:\Program Files (x86)\MSBuild\Microsoft.Cpp\v4.0\BuildCustomizations\Nvda.Build.CudaTasks.v4.0.dll’ or one of its dependencies. The system cannot find the file specified. Confirm that the declaration is correct, that the assembly and all its dependencies are available, and that the task contains a public class that implements Microsoft.Build.Framework.ITask.

58> matrixMul_gold.cpp

71>------ Rebuild All started: Project: FDTD3d, Configuration: Debug x64 ------

71>C:\Program Files (x86)\MSBuild\Microsoft.Cpp\v4.0\BuildCustomizations\CUDA 4.0.targets(76,9): error MSB4062: The “Nvda.Build.CudaTasks.SanitizePaths” task could not be loaded from the assembly C:\Program Files (x86)\MSBuild\Microsoft.Cpp\v4.0\BuildCustomizations\Nvda.Build.CudaTasks.v4.0.dll. Could not load file or assembly ‘file:///C:\Program Files (x86)\MSBuild\Microsoft.Cpp\v4.0\BuildCustomizations\Nvda.Build.CudaTasks.v4.0.dll’ or one of its dependencies. The system cannot find the file specified. Confirm that the declaration is correct, that the assembly and all its dependencies are available, and that the task contains a public class that implements Microsoft.Build.Framework.ITask.

58> matrixMulDynlinkJIT.cpp

72>------ Rebuild All started: Project: fastWalshTransform, Configuration: Debug x64 ------

73>------ Rebuild All started: Project: eigenvalues, Configuration: Debug x64 ------

72>C:\Program Files (x86)\MSBuild\Microsoft.Cpp\v4.0\BuildCustomizations\CUDA 4.0.targets(76,9): error MSB4062: The "Nvda.Build.CudaTasks.Sanitize

I remember that I had to copy some of these stopwatch files from one folder to another to compile the common code to get the SDK samples compiled. In the end I was successful in running some CUDA 4.0 samples

I have VS2010 installed, as well as VS2008. Compilation was done on VS2010, but I do not know if nvcc calls the VS2008 compiler internally.