Nvargus-daemon errors when using nvarguscamerasrc at boot

Hello,
I am running Jetpack 4.6 and L4T 32.6.1.
I have a docker container that starts 6 gstreamer streams with nvarguscamerasrc with different sensor-id.
But I get this error repeatedly in /var/log/syslog :

Dec 13 12:03:11 jetson-rogue-carrier nvargus-daemon[6577]: message repeated 4 times: [ (Argus) Error OverFlow: Too many pending events, ignoring new events (in src/api/EventProviderImpl.cpp, function addEvent(), line 158)]
Dec 13 12:03:11 jetson-rogue-carrier nvargus-daemon[6577]: SCF: Error InvalidState: Sequence order error (9427 received, 9424 expected, channel 0) (in src/services/capture/NvCaptureViCsiHw.cpp, function waitCsiFrameEnd(), line 937)
Dec 13 12:03:11 jetson-rogue-carrier nvargus-daemon[6577]: (Argus) Error OverFlow: Too many pending events, ignoring new events (in src/api/EventProviderImpl.cpp, function addEvent(), line 158)

Here’s the result of sudo journalctl -u nvargus-daemon :

-- Logs begin at Mon 2021-12-13 12:44:42 EET, end at Mon 2021-12-13 12:45:40 EET. --
dets  13 12:44:51 jetson-rogue-carrier systemd[1]: Started Argus daemon.
dets  13 12:45:00 jetson-rogue-carrier nvargus-daemon[6538]: === NVIDIA Libargus Camera Service (0.98.3)=== Listening for connections...=== gstd[1]: Connection established (7F74C9A1D0)OFParserListModules: module list: /proc/device-tree/tegra-camera-platform/modules/module0
dets  13 12:45:00 jetson-rogue-carrier nvargus-daemon[6538]: OFParserListModules: module list: /proc/device-tree/tegra-camera-platform/modules/module1
dets  13 12:45:00 jetson-rogue-carrier nvargus-daemon[6538]: OFParserListModules: module list: /proc/device-tree/tegra-camera-platform/modules/module2
dets  13 12:45:00 jetson-rogue-carrier nvargus-daemon[6538]: OFParserListModules: module list: /proc/device-tree/tegra-camera-platform/modules/module3
dets  13 12:45:00 jetson-rogue-carrier nvargus-daemon[6538]: OFParserListModules: module list: /proc/device-tree/tegra-camera-platform/modules/module4
dets  13 12:45:00 jetson-rogue-carrier nvargus-daemon[6538]: OFParserListModules: module list: /proc/device-tree/tegra-camera-platform/modules/module5
dets  13 12:45:00 jetson-rogue-carrier nvargus-daemon[6538]: OFParserListModules: module list: /proc/device-tree/tegra-camera-platform/modules/module6
dets  13 12:45:00 jetson-rogue-carrier nvargus-daemon[6538]: OFParserListModules: module list: /proc/device-tree/tegra-camera-platform/modules/module7
dets  13 12:45:00 jetson-rogue-carrier nvargus-daemon[6538]: NvPclHwGetModuleList: WARNING: Could not map module to ISP config string
dets  13 12:45:00 jetson-rogue-carrier nvargus-daemon[6538]: NvPclHwGetModuleList: No module data found
dets  13 12:45:00 jetson-rogue-carrier nvargus-daemon[6538]: NvPclHwGetModuleList: WARNING: Could not map module to ISP config string
dets  13 12:45:00 jetson-rogue-carrier nvargus-daemon[6538]: NvPclHwGetModuleList: No module data found
dets  13 12:45:00 jetson-rogue-carrier nvargus-daemon[6538]: NvPclHwGetModuleList: WARNING: Could not map module to ISP config string
dets  13 12:45:00 jetson-rogue-carrier nvargus-daemon[6538]: NvPclHwGetModuleList: No module data found
dets  13 12:45:00 jetson-rogue-carrier nvargus-daemon[6538]: NvPclHwGetModuleList: WARNING: Could not map module to ISP config string
dets  13 12:45:00 jetson-rogue-carrier nvargus-daemon[6538]: NvPclHwGetModuleList: No module data found
dets  13 12:45:00 jetson-rogue-carrier nvargus-daemon[6538]: NvPclHwGetModuleList: WARNING: Could not map module to ISP config string
dets  13 12:45:00 jetson-rogue-carrier nvargus-daemon[6538]: NvPclHwGetModuleList: No module data found
dets  13 12:45:00 jetson-rogue-carrier nvargus-daemon[6538]: NvPclHwGetModuleList: WARNING: Could not map module to ISP config string
dets  13 12:45:00 jetson-rogue-carrier nvargus-daemon[6538]: NvPclHwGetModuleList: No module data found
dets  13 12:45:00 jetson-rogue-carrier nvargus-daemon[6538]: NvPclHwGetModuleList: WARNING: Could not map module to ISP config string
dets  13 12:45:00 jetson-rogue-carrier nvargus-daemon[6538]: NvPclHwGetModuleList: No module data found
dets  13 12:45:00 jetson-rogue-carrier nvargus-daemon[6538]: NvPclHwGetModuleList: WARNING: Could not map module to ISP config string
dets  13 12:45:00 jetson-rogue-carrier nvargus-daemon[6538]: NvPclHwGetModuleList: No module data found
dets  13 12:45:00 jetson-rogue-carrier nvargus-daemon[6538]: OFParserGetVirtualDevice: NVIDIA Camera virtual enumerator not found in proc device-tree
dets  13 12:45:00 jetson-rogue-carrier nvargus-daemon[6538]: ---- imager: Found override file [/var/nvidia/nvcam/settings/camera_overrides.isp]. ----
dets  13 12:45:00 jetson-rogue-carrier nvargus-daemon[6538]: CAM: serial no file already exists, skips storing againLSC: LSC surface is not based on full res!
dets  13 12:45:00 jetson-rogue-carrier nvargus-daemon[6538]: ---- imager: Found override file [/var/nvidia/nvcam/settings/camera_overrides.isp]. ----
dets  13 12:45:00 jetson-rogue-carrier nvargus-daemon[6538]: CAM: serial no file already exists, skips storing againLSC: LSC surface is not based on full res!
dets  13 12:45:00 jetson-rogue-carrier nvargus-daemon[6538]: ---- imager: Found override file [/var/nvidia/nvcam/settings/camera_overrides.isp]. ----
dets  13 12:45:00 jetson-rogue-carrier nvargus-daemon[6538]: CAM: serial no file already exists, skips storing againLSC: LSC surface is not based on full res!
dets  13 12:45:00 jetson-rogue-carrier nvargus-daemon[6538]: ---- imager: Found override file [/var/nvidia/nvcam/settings/camera_overrides.isp]. ----
dets  13 12:45:00 jetson-rogue-carrier nvargus-daemon[6538]: CAM: serial no file already exists, skips storing againLSC: LSC surface is not based on full res!
dets  13 12:45:00 jetson-rogue-carrier nvargus-daemon[6538]: ---- imager: Found override file [/var/nvidia/nvcam/settings/camera_overrides.isp]. ----
dets  13 12:45:00 jetson-rogue-carrier nvargus-daemon[6538]: CAM: serial no file already exists, skips storing againLSC: LSC surface is not based on full res!
dets  13 12:45:00 jetson-rogue-carrier nvargus-daemon[6538]: ---- imager: Found override file [/var/nvidia/nvcam/settings/camera_overrides.isp]. ----
dets  13 12:45:00 jetson-rogue-carrier nvargus-daemon[6538]: CAM: serial no file already exists, skips storing againLSC: LSC surface is not based on full res!
dets  13 12:45:00 jetson-rogue-carrier nvargus-daemon[6538]: ---- imager: Found override file [/var/nvidia/nvcam/settings/camera_overrides.isp]. ----
dets  13 12:45:00 jetson-rogue-carrier nvargus-daemon[6538]: (NvCamV4l2) Error ModuleNotPresent: V4L2Device not available (in /dvs/git/dirty/git-master_linux/camera/utils/nvcamv4l2/v4l2_device.cpp, function findDevice(), line 256)
dets  13 12:45:00 jetson-rogue-carrier nvargus-daemon[6538]: (NvCamV4l2) Error ModuleNotPresent:  (propagating from /dvs/git/dirty/git-master_linux/camera/utils/nvcamv4l2/v4l2_device.cpp, function initialize(), line 60)
dets  13 12:45:00 jetson-rogue-carrier nvargus-daemon[6538]: (NvOdmDevice) Error ModuleNotPresent:  (propagating from dvs/git/dirty/git-master_linux/camera-partner/imager/src/devices/V4L2SensorViCsi.cpp, function initialize(), line 107)
dets  13 12:45:00 jetson-rogue-carrier nvargus-daemon[6538]: NvPclDriverInitializeData: Unable to initialize driver v4l2_sensor
dets  13 12:45:00 jetson-rogue-carrier nvargus-daemon[6538]: NvPclInitializeDrivers: error: Failed to init camera sub module v4l2_sensor
dets  13 12:45:00 jetson-rogue-carrier nvargus-daemon[6538]: NvPclStartPlatformDrivers: Failed to start module drivers
dets  13 12:45:00 jetson-rogue-carrier nvargus-daemon[6538]: NvPclStateControllerOpen: Failed ImagerGUID 6. (error 0xA000E)
dets  13 12:45:00 jetson-rogue-carrier nvargus-daemon[6538]: NvPclOpen: PCL Open Failed. Error: 0xf
dets  13 12:45:00 jetson-rogue-carrier nvargus-daemon[6538]: SCF: Error BadParameter: Sensor could not be opened. (in src/services/capture/CaptureServiceDeviceSensor.cpp, function getSourceFromGuid(), line 582)
dets  13 12:45:00 jetson-rogue-carrier nvargus-daemon[6538]: SCF: Error BadParameter:  (propagating from src/services/capture/CaptureService.cpp, function addSourceByGuid(), line 437)
dets  13 12:45:00 jetson-rogue-carrier nvargus-daemon[6538]: SCF: Error BadParameter:  (propagating from src/api/CameraDriver.cpp, function addSourceByIndex(), line 305)
dets  13 12:45:00 jetson-rogue-carrier nvargus-daemon[6538]: SCF: Error BadParameter:  (propagating from src/api/CameraDriver.cpp, function getSource(), line 471)
dets  13 12:45:00 jetson-rogue-carrier nvargus-daemon[6538]: Acquiring SCF Camera device source via index 6 has failed. ---- imager: Found override file [/var/nvidia/nvcam/settings/camera_overrides.isp]. ----
dets  13 12:45:00 jetson-rogue-carrier nvargus-daemon[6538]: (NvCamV4l2) Error ModuleNotPresent: V4L2Device not available (in /dvs/git/dirty/git-master_linux/camera/utils/nvcamv4l2/v4l2_device.cpp, function findDevice(), line 256)
dets  13 12:45:00 jetson-rogue-carrier nvargus-daemon[6538]: (NvCamV4l2) Error ModuleNotPresent:  (propagating from /dvs/git/dirty/git-master_linux/camera/utils/nvcamv4l2/v4l2_device.cpp, function initialize(), line 60)
dets  13 12:45:00 jetson-rogue-carrier nvargus-daemon[6538]: (NvOdmDevice) Error ModuleNotPresent:  (propagating from dvs/git/dirty/git-master_linux/camera-partner/imager/src/devices/V4L2SensorViCsi.cpp, function initialize(), line 107)
dets  13 12:45:00 jetson-rogue-carrier nvargus-daemon[6538]: NvPclDriverInitializeData: Unable to initialize driver v4l2_sensor
dets  13 12:45:00 jetson-rogue-carrier nvargus-daemon[6538]: NvPclInitializeDrivers: error: Failed to init camera sub module v4l2_sensor
dets  13 12:45:00 jetson-rogue-carrier nvargus-daemon[6538]: NvPclStartPlatformDrivers: Failed to start module drivers
dets  13 12:45:00 jetson-rogue-carrier nvargus-daemon[6538]: NvPclStateControllerOpen: Failed ImagerGUID 7. (error 0xA000E)
dets  13 12:45:00 jetson-rogue-carrier nvargus-daemon[6538]: NvPclOpen: PCL Open Failed. Error: 0xf
dets  13 12:45:00 jetson-rogue-carrier nvargus-daemon[6538]: SCF: Error BadParameter: Sensor could not be opened. (in src/services/capture/CaptureServiceDeviceSensor.cpp, function getSourceFromGuid(), line 582)
dets  13 12:45:00 jetson-rogue-carrier nvargus-daemon[6538]: SCF: Error BadParameter:  (propagating from src/services/capture/CaptureService.cpp, function addSourceByGuid(), line 437)
dets  13 12:45:00 jetson-rogue-carrier nvargus-daemon[6538]: SCF: Error BadParameter:  (propagating from src/api/CameraDriver.cpp, function addSourceByIndex(), line 305)
dets  13 12:45:00 jetson-rogue-carrier nvargus-daemon[6538]: SCF: Error BadParameter:  (propagating from src/api/CameraDriver.cpp, function getSource(), line 471)
dets  13 12:45:00 jetson-rogue-carrier nvargus-daemon[6538]: Acquiring SCF Camera device source via index 7 has failed. === gstd[1]: CameraProvider initialized (0x7f70c76fe0)CAM: serial no file already exists, skips storing againLSC: LSC surface is not based on full res!
dets  13 12:45:03 jetson-rogue-carrier nvargus-daemon[6538]: CAM: serial no file already exists, skips storing againLSC: LSC surface is not based on full res!
dets  13 12:45:04 jetson-rogue-carrier nvargus-daemon[6538]: (NvCapture) Error Timeout: capture waiting for status timeout (in /dvs/git/dirty/git-master_linux/camera/capture/nvcapture/capture_hw_linux.c, function NvCaptureLinuxGetCaptureStatus(), line 362)
dets  13 12:45:04 jetson-rogue-carrier nvargus-daemon[6538]: (NvCapture) Error Timeout:  (propagating from /dvs/git/dirty/git-master_linux/camera/capture/nvcapture/capture.c, function NvCaptureDequeue(), line 1055)
dets  13 12:45:04 jetson-rogue-carrier nvargus-daemon[6538]: SCF: Error Timeout:  (propagating from src/services/capture/NvCaptureViCsiHw.cpp, function waitCsiFrameEnd(), line 898)
dets  13 12:45:04 jetson-rogue-carrier nvargus-daemon[6538]: SCF: Error InvalidState: Timeout waiting on frame end sensor guid 0, capture sequence ID = 1, channel = 1/1 (in src/services/capture/NvCaptureViCsiHw.cpp, function waitCsiFrameEnd(), line 905)
dets  13 12:45:04 jetson-rogue-carrier nvargus-daemon[6538]: SCF: Error InvalidState: Timeout waiting on frame start sensor guid 0, capture sequence ID = 1 (in src/services/capture/NvCaptureViCsiHw.cpp, function waitCsiFrameStart(), line 1018)
dets  13 12:45:04 jetson-rogue-carrier nvargus-daemon[6538]: SCF: Error InvalidState: Something went wrong with waiting on frame end (in src/services/capture/NvCaptureViCsiHw.cpp, function waitCsiFrameEnd(), line 991)
dets  13 12:45:04 jetson-rogue-carrier nvargus-daemon[6538]: SCF: Error InvalidState: Something went wrong with waiting on frame end (in src/services/capture/NvCaptureViCsiHw.cpp, function waitCsiFrameEnd(), line 991)
dets  13 12:45:04 jetson-rogue-carrier nvargus-daemon[6538]: SCF: Error InvalidState: Something went wrong with waiting on frame start (in src/services/capture/NvCaptureViCsiHw.cpp, function waitCsiFrameStart(), line 1077)
dets  13 12:45:04 jetson-rogue-carrier nvargus-daemon[6538]: SCF: Error InvalidState: Something went wrong with waiting on frame start (in src/services/capture/NvCaptureViCsiHw.cpp, function waitCsiFrameStart(), line 1077)
dets  13 12:45:05 jetson-rogue-carrier nvargus-daemon[6538]: PowerServiceCore:handleRequests: timePassed = 2898
dets  13 12:45:05 jetson-rogue-carrier nvargus-daemon[6538]: NvCaptureStatusErrorDecode Stream 5.1 failed: sof_ts 42771183168 eof_ts 1368965815296 frame 0 error 14 data 0x00020000
dets  13 12:45:05 jetson-rogue-carrier nvargus-daemon[6538]: NvCaptureStatusErrorDecode Capture-Error: FALCON_ERROR (0x0000000e)
dets  13 12:45:05 jetson-rogue-carrier nvargus-daemon[6538]: SCF: Error InvalidState: Capture error with status 14 (channel 0) (in src/services/capture/NvCaptureViCsiHw.cpp, function waitCsiFrameEnd(), line 930)
dets  13 12:45:06 jetson-rogue-carrier nvargus-daemon[6538]: PowerServiceCore:handleRequests: timePassed = 1401
dets  13 12:45:06 jetson-rogue-carrier nvargus-daemon[6538]: NvCaptureStatusErrorDecode Stream 5.0 failed: sof_ts 42771172928 eof_ts 1369066206208 frame 0 error 14 data 0x00020000
dets  13 12:45:06 jetson-rogue-carrier nvargus-daemon[6538]: NvCaptureStatusErrorDecode Capture-Error: FALCON_ERROR (0x0000000e)
dets  13 12:45:06 jetson-rogue-carrier nvargus-daemon[6538]: SCF: Error InvalidState: Capture error with status 14 (channel 0) (in src/services/capture/NvCaptureViCsiHw.cpp, function waitCsiFrameEnd(), line 930)
dets  13 12:45:06 jetson-rogue-carrier nvargus-daemon[6538]: SCF: Error InvalidState: Sequence order error (4 received, 1 expected, channel 0) (in src/services/capture/NvCaptureViCsiHw.cpp, function waitCsiFrameEnd(), line 937)
dets  13 12:45:06 jetson-rogue-carrier nvargus-daemon[6538]: SCF: Error InvalidState: Sequence order error (5 received, 2 expected, channel 0) (in src/services/capture/NvCaptureViCsiHw.cpp, function waitCsiFrameEnd(), line 937)
dets  13 12:45:06 jetson-rogue-carrier nvargus-daemon[6538]: SCF: Error InvalidState: Sequence order error (6 received, 3 expected, channel 0) (in src/services/capture/NvCaptureViCsiHw.cpp, function waitCsiFrameEnd(), line 937)
dets  13 12:45:07 jetson-rogue-carrier nvargus-daemon[6538]: SCF: Error InvalidState: Sequence order error (7 received, 4 expected, channel 0) (in src/services/capture/NvCaptureViCsiHw.cpp, function waitCsiFrameEnd(), line 937)
dets  13 12:45:07 jetson-rogue-carrier nvargus-daemon[6538]: CAM: serial no file already exists, skips storing againLSC: LSC surface is not based on full res!
dets  13 12:45:07 jetson-rogue-carrier nvargus-daemon[6538]: SCF: Error InvalidState: Sequence order error (8 received, 5 expected, channel 0) (in src/services/capture/NvCaptureViCsiHw.cpp, function waitCsiFrameEnd(), line 937)
dets  13 12:45:07 jetson-rogue-carrier nvargus-daemon[6538]: SCF: Error InvalidState: Sequence order error (9 received, 6 expected, channel 0) (in src/services/capture/NvCaptureViCsiHw.cpp, function waitCsiFrameEnd(), line 937)
dets  13 12:45:07 jetson-rogue-carrier nvargus-daemon[6538]: SCF: Error InvalidState: Sequence order error (10 received, 7 expected, channel 0) (in src/services/capture/NvCaptureViCsiHw.cpp, function waitCsiFrameEnd(), line 937)
dets  13 12:45:08 jetson-rogue-carrier nvargus-daemon[6538]: PowerServiceCore:handleRequests: timePassed = 1476
dets  13 12:45:08 jetson-rogue-carrier nvargus-daemon[6538]: SCF: Error InvalidState: Sequence order error (11 received, 8 expected, channel 0) (in src/services/capture/NvCaptureViCsiHw.cpp, function waitCsiFrameEnd(), line 937)
dets  13 12:45:08 jetson-rogue-carrier nvargus-daemon[6538]: SCF: Error InvalidState: Sequence order error (12 received, 9 expected, channel 0) (in src/services/capture/NvCaptureViCsiHw.cpp, function waitCsiFrameEnd(), line 937)
dets  13 12:45:08 jetson-rogue-carrier nvargus-daemon[6538]: SCF: Error InvalidState: Sequence order error (13 received, 10 expected, channel 0) (in src/services/capture/NvCaptureViCsiHw.cpp, function waitCsiFrameEnd(), line 937)
dets  13 12:45:08 jetson-rogue-carrier nvargus-daemon[6538]: SCF: Error InvalidState: Sequence order error (14 received, 11 expected, channel 0) (in src/services/capture/NvCaptureViCsiHw.cpp, function waitCsiFrameEnd(), line 937)
dets  13 12:45:08 jetson-rogue-carrier nvargus-daemon[6538]: SCF: Error InvalidState: Sequence order error (15 received, 12 expected, channel 0) (in src/services/capture/NvCaptureViCsiHw.cpp, function waitCsiFrameEnd(), line 937)
dets  13 12:45:08 jetson-rogue-carrier nvargus-daemon[6538]: SCF: Error InvalidState: Sequence order error (16 received, 13 expected, channel 0) (in src/services/capture/NvCaptureViCsiHw.cpp, function waitCsiFrameEnd(), line 937)
dets  13 12:45:08 jetson-rogue-carrier nvargus-daemon[6538]: SCF: Error InvalidState: Sequence order error (17 received, 14 expected, channel 0) (in src/services/capture/NvCaptureViCsiHw.cpp, function waitCsiFrameEnd(), line 937)
dets  13 12:45:08 jetson-rogue-carrier nvargus-daemon[6538]: SCF: Error InvalidState: Sequence order error (18 received, 15 expected, channel 0) (in src/services/capture/NvCaptureViCsiHw.cpp, function waitCsiFrameEnd(), line 937)
dets  13 12:45:08 jetson-rogue-carrier nvargus-daemon[6538]: SCF: Error InvalidState: Sequence order error (19 received, 16 expected, channel 0) (in src/services/capture/NvCaptureViCsiHw.cpp, function waitCsiFrameEnd(), line 937)
dets  13 12:45:08 jetson-rogue-carrier nvargus-daemon[6538]: SCF: Error InvalidState: Sequence order error (20 received, 17 expected, channel 0) (in src/services/capture/NvCaptureViCsiHw.cpp, function waitCsiFrameEnd(), line 937)
dets  13 12:45:08 jetson-rogue-carrier nvargus-daemon[6538]: SCF: Error InvalidState: Sequence order error (21 received, 18 expected, channel 0) (in src/services/capture/NvCaptureViCsiHw.cpp, function waitCsiFrameEnd(), line 937)
dets  13 12:45:08 jetson-rogue-carrier nvargus-daemon[6538]: SCF: Error InvalidState: Sequence order error (22 received, 19 expected, channel 0) (in src/services/capture/NvCaptureViCsiHw.cpp, function waitCsiFrameEnd(), line 937)
dets  13 12:45:08 jetson-rogue-carrier nvargus-daemon[6538]: SCF: Error InvalidState: Sequence order error (23 received, 20 expected, channel 0) (in src/services/capture/NvCaptureViCsiHw.cpp, function waitCsiFrameEnd(), line 937)
dets  13 12:45:09 jetson-rogue-carrier nvargus-daemon[6538]: SCF: Error InvalidState: Sequence order error (24 received, 21 expected, channel 0) (in src/services/capture/NvCaptureViCsiHw.cpp, function waitCsiFrameEnd(), line 937)
dets  13 12:45:09 jetson-rogue-carrier nvargus-daemon[6538]: SCF: Error InvalidState: Sequence order error (25 received, 22 expected, channel 0) (in src/services/capture/NvCaptureViCsiHw.cpp, function waitCsiFrameEnd(), line 937)
dets  13 12:45:09 jetson-rogue-carrier nvargus-daemon[6538]: SCF: Error InvalidState: Sequence order error (26 received, 23 expected, channel 0) (in src/services/capture/NvCaptureViCsiHw.cpp, function waitCsiFrameEnd(), line 937)
dets  13 12:45:09 jetson-rogue-carrier nvargus-daemon[6538]: SCF: Error InvalidState: Sequence order error (27 received, 24 expected, channel 0) (in src/services/capture/NvCaptureViCsiHw.cpp, function waitCsiFrameEnd(), line 937)
dets  13 12:45:09 jetson-rogue-carrier nvargus-daemon[6538]: SCF: Error InvalidState: Sequence order error (28 received, 25 expected, channel 0) (in src/services/capture/NvCaptureViCsiHw.cpp, function waitCsiFrameEnd(), line 937)
dets  13 12:45:09 jetson-rogue-carrier nvargus-daemon[6538]: SCF: Error InvalidState: Sequence order error (29 received, 26 expected, channel 0) (in src/services/capture/NvCaptureViCsiHw.cpp, function waitCsiFrameEnd(), line 937)
dets  13 12:45:09 jetson-rogue-carrier nvargus-daemon[6538]: SCF: Error InvalidState: Sequence order error (30 received, 27 expected, channel 0) (in src/services/capture/NvCaptureViCsiHw.cpp, function waitCsiFrameEnd(), line 937)
dets  13 12:45:09 jetson-rogue-carrier nvargus-daemon[6538]: SCF: Error InvalidState: Sequence order error (31 received, 28 expected, channel 0) (in src/services/capture/NvCaptureViCsiHw.cpp, function waitCsiFrameEnd(), line 937)
dets  13 12:45:09 jetson-rogue-carrier nvargus-daemon[6538]: SCF: Error InvalidState: Sequence order error (32 received, 29 expected, channel 0) (in src/services/capture/NvCaptureViCsiHw.cpp, function waitCsiFrameEnd(), line 937)
dets  13 12:45:09 jetson-rogue-carrier nvargus-daemon[6538]: SCF: Error InvalidState: Sequence order error (33 received, 30 expected, channel 0) (in src/services/capture/NvCaptureViCsiHw.cpp, function waitCsiFrameEnd(), line 937)
dets  13 12:45:09 jetson-rogue-carrier nvargus-daemon[6538]: SCF: Error InvalidState: Sequence order error (34 received, 31 expected, channel 0) (in src/services/capture/NvCaptureViCsiHw.cpp, function waitCsiFrameEnd(), line 937)
dets  13 12:45:09 jetson-rogue-carrier nvargus-daemon[6538]: SCF: Error InvalidState: Sequence order error (35 received, 32 expected, channel 0) (in src/services/capture/NvCaptureViCsiHw.cpp, function waitCsiFrameEnd(), line 937)
dets  13 12:45:09 jetson-rogue-carrier nvargus-daemon[6538]: SCF: Error InvalidState: Sequence order error (36 received, 33 expected, channel 0) (in src/services/capture/NvCaptureViCsiHw.cpp, function waitCsiFrameEnd(), line 937)
dets  13 12:45:09 jetson-rogue-carrier nvargus-daemon[6538]: SCF: Error InvalidState: Sequence order error (37 received, 34 expected, channel 0) (in src/services/capture/NvCaptureViCsiHw.cpp, function waitCsiFrameEnd(), line 937)
dets  13 12:45:09 jetson-rogue-carrier nvargus-daemon[6538]: SCF: Error InvalidState: Sequence order error (38 received, 35 expected, channel 0) (in src/services/capture/NvCaptureViCsiHw.cpp, function waitCsiFrameEnd(), line 937)
dets  13 12:45:09 jetson-rogue-carrier nvargus-daemon[6538]: SCF: Error InvalidState: Sequence order error (39 received, 36 expected, channel 0) (in src/services/capture/NvCaptureViCsiHw.cpp, function waitCsiFrameEnd(), line 937)
dets  13 12:45:09 jetson-rogue-carrier nvargus-daemon[6538]: SCF: Error InvalidState: Sequence order error (40 received, 37 expected, channel 0) (in src/services/capture/NvCaptureViCsiHw.cpp, function waitCsiFrameEnd(), line 937)
dets  13 12:45:09 jetson-rogue-carrier nvargus-daemon[6538]: SCF: Error InvalidState: Sequence order error (41 received, 38 expected, channel 0) (in src/services/capture/NvCaptureViCsiHw.cpp, function waitCsiFrameEnd(), line 937)
dets  13 12:45:09 jetson-rogue-carrier nvargus-daemon[6538]: SCF: Error InvalidState: Sequence order error (42 received, 39 expected, channel 0) (in src/services/capture/NvCaptureViCsiHw.cpp, function waitCsiFrameEnd(), line 937)
dets  13 12:45:09 jetson-rogue-carrier nvargus-daemon[6538]: SCF: Error InvalidState: Sequence order error (43 received, 40 expected, channel 0) (in src/services/capture/NvCaptureViCsiHw.cpp, function waitCsiFrameEnd(), line 937)
dets  13 12:45:09 jetson-rogue-carrier nvargus-daemon[6538]: SCF: Error InvalidState: Sequence order error (44 received, 41 expected, channel 0) (in src/services/capture/NvCaptureViCsiHw.cpp, function waitCsiFrameEnd(), line 937)
dets  13 12:45:09 jetson-rogue-carrier nvargus-daemon[6538]: SCF: Error InvalidState: Sequence order error (45 received, 42 expected, channel 0) (in src/services/capture/NvCaptureViCsiHw.cpp, function waitCsiFrameEnd(), line 937)
dets  13 12:45:09 jetson-rogue-carrier nvargus-daemon[6538]: SCF: Error InvalidState: Sequence order error (46 received, 43 expected, channel 0) (in src/services/capture/NvCaptureViCsiHw.cpp, function waitCsiFrameEnd(), line 937)
dets  13 12:45:09 jetson-rogue-carrier nvargus-daemon[6538]: SCF: Error InvalidState: Sequence order error (47 received, 44 expected, channel 0) (in src/services/capture/NvCaptureViCsiHw.cpp, function waitCsiFrameEnd(), line 937)
dets  13 12:45:09 jetson-rogue-carrier nvargus-daemon[6538]: SCF: Error InvalidState: Sequence order error (48 received, 45 expected, channel 0) (in src/services/capture/NvCaptureViCsiHw.cpp, function waitCsiFrameEnd(), line 937)
dets  13 12:45:09 jetson-rogue-carrier nvargus-daemon[6538]: SCF: Error InvalidState: Sequence order error (49 received, 46 expected, channel 0) (in src/services/capture/NvCaptureViCsiHw.cpp, function waitCsiFrameEnd(), line 937)
dets  13 12:45:09 jetson-rogue-carrier nvargus-daemon[6538]: SCF: Error InvalidState: Sequence order error (50 received, 47 expected, channel 0) (in src/services/capture/NvCaptureViCsiHw.cpp, function waitCsiFrameEnd(), line 937)
dets  13 12:45:09 jetson-rogue-carrier nvargus-daemon[6538]: SCF: Error InvalidState: Sequence order error (51 received, 48 expected, channel 0) (in src/services/capture/NvCaptureViCsiHw.cpp, function waitCsiFrameEnd(), line 937)
dets  13 12:45:09 jetson-rogue-carrier nvargus-daemon[6538]: SCF: Error InvalidState: Sequence order error (52 received, 49 expected, channel 0) (in src/services/capture/NvCaptureViCsiHw.cpp, function waitCsiFrameEnd(), line 937)
dets  13 12:45:09 jetson-rogue-carrier nvargus-daemon[6538]: SCF: Error InvalidState: Sequence order error (53 received, 50 expected, channel 0) (in src/services/capture/NvCaptureViCsiHw.cpp, function waitCsiFrameEnd(), line 937)
dets  13 12:45:10 jetson-rogue-carrier nvargus-daemon[6538]: SCF: Error InvalidState: Sequence order error (54 received, 51 expected, channel 0) (in src/services/capture/NvCaptureViCsiHw.cpp, function waitCsiFrameEnd(), line 937)
dets  13 12:45:10 jetson-rogue-carrier nvargus-daemon[6538]: CAM: serial no file already exists, skips storing againLSC: LSC surface is not based on full res!
dets  13 12:45:10 jetson-rogue-carrier nvargus-daemon[6538]: SCF: Error InvalidState: Sequence order error (55 received, 52 expected, channel 0) (in src/services/capture/NvCaptureViCsiHw.cpp, function waitCsiFrameEnd(), line 937)
dets  13 12:45:10 jetson-rogue-carrier nvargus-daemon[6538]: SCF: Error InvalidState: Sequence order error (56 received, 53 expected, channel 0) (in src/services/capture/NvCaptureViCsiHw.cpp, function waitCsiFrameEnd(), line 937)
dets  13 12:45:10 jetson-rogue-carrier nvargus-daemon[6538]: (NvCapture) Error Timeout: capture waiting for status timeout (in /dvs/git/dirty/git-master_linux/camera/capture/nvcapture/capture_hw_linux.c, function NvCaptureLinuxGetCaptureStatus(), line 362)
dets  13 12:45:10 jetson-rogue-carrier nvargus-daemon[6538]: (NvCapture) Error Timeout:  (propagating from /dvs/git/dirty/git-master_linux/camera/capture/nvcapture/capture.c, function NvCaptureDequeue(), line 1055)
dets  13 12:45:10 jetson-rogue-carrier nvargus-daemon[6538]: SCF: Error Timeout:  (propagating from src/services/capture/NvCaptureViCsiHw.cpp, function waitCsiFrameEnd(), line 898)
dets  13 12:45:10 jetson-rogue-carrier nvargus-daemon[6538]: SCF: Error InvalidState: Timeout waiting on frame start sensor guid 2, capture sequence ID = 1 (in src/services/capture/NvCaptureViCsiHw.cpp, function waitCsiFrameStart(), line 1018)
dets  13 12:45:10 jetson-rogue-carrier nvargus-daemon[6538]: SCF: Error InvalidState: Timeout waiting on frame end sensor guid 2, capture sequence ID = 1, channel = 1/1 (in src/services/capture/NvCaptureViCsiHw.cpp, function waitCsiFrameEnd(), line 905)
dets  13 12:45:10 jetson-rogue-carrier nvargus-daemon[6538]: SCF: Error InvalidState: Something went wrong with waiting on frame end (in src/services/capture/NvCaptureViCsiHw.cpp, function waitCsiFrameEnd(), line 991)
dets  13 12:45:10 jetson-rogue-carrier nvargus-daemon[6538]: SCF: Error InvalidState: Something went wrong with waiting on frame start (in src/services/capture/NvCaptureViCsiHw.cpp, function waitCsiFrameStart(), line 1077)
dets  13 12:45:10 jetson-rogue-carrier nvargus-daemon[6538]: SCF: Error InvalidState: Sequence order error (57 received, 54 expected, channel 0) (in src/services/capture/NvCaptureViCsiHw.cpp, function waitCsiFrameEnd(), line 937)
dets  13 12:45:11 jetson-rogue-carrier nvargus-daemon[6538]: PowerServiceCore:handleRequests: timePassed = 1406
dets  13 12:45:11 jetson-rogue-carrier nvargus-daemon[6538]: NvCaptureStatusErrorDecode Stream 4.0 failed: sof_ts 47331396640 eof_ts 1514788344832 frame 0 error 14 data 0x00020000
dets  13 12:45:11 jetson-rogue-carrier nvargus-daemon[6538]: NvCaptureStatusErrorDecode Capture-Error: FALCON_ERROR (0x0000000e)
dets  13 12:45:11 jetson-rogue-carrier nvargus-daemon[6538]: SCF: Error InvalidState: Capture error with status 14 (channel 0) (in src/services/capture/NvCaptureViCsiHw.cpp, function waitCsiFrameEnd(), line 930)
dets  13 12:45:11 jetson-rogue-carrier nvargus-daemon[6538]: SCF: Error InvalidState: Sequence order error (4 received, 1 expected, channel 0) (in src/services/capture/NvCaptureViCsiHw.cpp, function waitCsiFrameEnd(), line 937)
dets  13 12:45:11 jetson-rogue-carrier nvargus-daemon[6538]: SCF: Error InvalidState: Sequence order error (5 received, 2 expected, channel 0) (in src/services/capture/NvCaptureViCsiHw.cpp, function waitCsiFrameEnd(), line 937)
dets  13 12:45:11 jetson-rogue-carrier nvargus-daemon[6538]: SCF: Error InvalidState: Sequence order error (58 received, 55 expected, channel 0) (in src/services/capture/NvCaptureViCsiHw.cpp, function waitCsiFrameEnd(), line 937)
dets  13 12:45:11 jetson-rogue-carrier nvargus-daemon[6538]: SCF: Error InvalidState: Sequence order error (59 received, 56 expected, channel 0) (in src/services/capture/NvCaptureViCsiHw.cpp, function waitCsiFrameEnd(), line 937)
dets  13 12:45:11 jetson-rogue-carrier nvargus-daemon[6538]: SCF: Error Timeout:  (propagating from src/components/amr/Snapshot.cpp, function waitForNewerSample(), line 92)
dets  13 12:45:11 jetson-rogue-carrier nvargus-daemon[6538]: SCF_AutocontrolACSync failed to wait for an earlier frame to complete.
dets  13 12:45:11 jetson-rogue-carrier nvargus-daemon[6538]: SCF: Error Timeout:  (propagating from src/components/ac_stages/ACSynchronizeStage.cpp, function doHandleRequest(), line 126)
dets  13 12:45:11 jetson-rogue-carrier nvargus-daemon[6538]: SCF: Error Timeout:  (propagating from src/components/stages/OrderedStage.cpp, function doExecute(), line 137)
dets  13 12:45:11 jetson-rogue-carrier nvargus-daemon[6538]: SCF: Error Timeout: Sending critical error event (in src/api/Session.cpp, function sendErrorEvent(), line 997)
dets  13 12:45:12 jetson-rogue-carrier nvargus-daemon[6538]: PowerServiceCore:handleRequests: timePassed = 1452
dets  13 12:45:13 jetson-rogue-carrier nvargus-daemon[6538]: SCF: Error InvalidState: Sequence order error (6 received, 3 expected, channel 0) (in src/services/capture/NvCaptureViCsiHw.cpp, function waitCsiFrameEnd(), line 937)
dets  13 12:45:13 jetson-rogue-carrier nvargus-daemon[6538]: SCF: Error InvalidState: Sequence order error (60 received, 57 expected, channel 0) (in src/services/capture/NvCaptureViCsiHw.cpp, function waitCsiFrameEnd(), line 937)
dets  13 12:45:13 jetson-rogue-carrier nvargus-daemon[6538]: SCF: Error InvalidState: Sequence order error (61 received, 58 expected, channel 0) (in src/services/capture/NvCaptureViCsiHw.cpp, function waitCsiFrameEnd(), line 937)
dets  13 12:45:13 jetson-rogue-carrier nvargus-daemon[6538]: CAM: serial no file already exists, skips storing againLSC: LSC surface is not based on full res!
dets  13 12:45:13 jetson-rogue-carrier nvargus-daemon[6538]: SCF: Error InvalidState: Sequence order error (7 received, 4 expected, channel 0) (in src/services/capture/NvCaptureViCsiHw.cpp, function waitCsiFrameEnd(), line 937)
dets  13 12:45:13 jetson-rogue-carrier nvargus-daemon[6538]: SCF: Error InvalidState: Sequence order error (62 received, 59 expected, channel 0) (in src/services/capture/NvCaptureViCsiHw.cpp, function waitCsiFrameEnd(), line 937)
dets  13 12:45:13 jetson-rogue-carrier nvargus-daemon[6538]: SCF: Error InvalidState: Sequence order error (63 received, 60 expected, channel 0) (in src/services/capture/NvCaptureViCsiHw.cpp, function waitCsiFrameEnd(), line 937)
dets  13 12:45:13 jetson-rogue-carrier nvargus-daemon[6538]: SCF: Error InvalidState: Sequence order error (64 received, 61 expected, channel 0) (in src/services/capture/NvCaptureViCsiHw.cpp, function waitCsiFrameEnd(), line 937)
dets  13 12:45:14 jetson-rogue-carrier nvargus-daemon[6538]: (NvCapture) Error Timeout: capture waiting for status timeout (in /dvs/git/dirty/git-master_linux/camera/capture/nvcapture/capture_hw_linux.c, function NvCaptureLinuxGetCaptureStatus(), line 362)
dets  13 12:45:14 jetson-rogue-carrier nvargus-daemon[6538]: (NvCapture) Error Timeout:  (propagating from /dvs/git/dirty/git-master_linux/camera/capture/nvcapture/capture.c, function NvCaptureDequeue(), line 1055)
dets  13 12:45:14 jetson-rogue-carrier nvargus-daemon[6538]: SCF: Error Timeout:  (propagating from src/services/capture/NvCaptureViCsiHw.cpp, function waitCsiFrameEnd(), line 898)
dets  13 12:45:14 jetson-rogue-carrier nvargus-daemon[6538]: SCF: Error InvalidState: Timeout waiting on frame end sensor guid 3, capture sequence ID = 1, channel = 1/1 (in src/services/capture/NvCaptureViCsiHw.cpp, function waitCsiFrameEnd(), line 905)
dets  13 12:45:14 jetson-rogue-carrier nvargus-daemon[6538]: SCF: Error InvalidState: Something went wrong with waiting on frame end (in src/services/capture/NvCaptureViCsiHw.cpp, function waitCsiFrameEnd(), line 991)
dets  13 12:45:14 jetson-rogue-carrier nvargus-daemon[6538]: SCF: Error InvalidState: Timeout waiting on frame start sensor guid 3, capture sequence ID = 1 (in src/services/capture/NvCaptureViCsiHw.cpp, function waitCsiFrameStart(), line 1018)
dets  13 12:45:14 jetson-rogue-carrier nvargus-daemon[6538]: SCF: Error InvalidState: Something went wrong with waiting on frame start (in src/services/capture/NvCaptureViCsiHw.cpp, function waitCsiFrameStart(), line 1077)
dets  13 12:45:14 jetson-rogue-carrier nvargus-daemon[6538]: SCF: Error InvalidState: Timeout waiting on frame start sensor guid 2, capture sequence ID = 6 (in src/services/capture/NvCaptureViCsiHw.cpp, function waitCsiFrameStart(), line 1018)
dets  13 12:45:14 jetson-rogue-carrier nvargus-daemon[6538]: SCF: Error Timeout: Sending critical error event (in src/api/Session.cpp, function sendErrorEvent(), line 997)
dets  13 12:45:14 jetson-rogue-carrier nvargus-daemon[6538]: SCF: Error InvalidState: Something went wrong with waiting on frame start (in src/services/capture/NvCaptureViCsiHw.cpp, function waitCsiFrameStart(), line 1077)
dets  13 12:45:14 jetson-rogue-carrier nvargus-daemon[6538]: PowerServiceCore:handleRequests: timePassed = 1471
dets  13 12:45:14 jetson-rogue-carrier nvargus-daemon[6538]: SCF: Error InvalidState: Sequence order error (65 received, 62 expected, channel 0) (in src/services/capture/NvCaptureViCsiHw.cpp, function waitCsiFrameEnd(), line 937)
dets  13 12:45:14 jetson-rogue-carrier nvargus-daemon[6538]: SCF: Error InvalidState: Sequence order error (66 received, 63 expected, channel 0) (in src/services/capture/NvCaptureViCsiHw.cpp, function waitCsiFrameEnd(), line 937)
dets  13 12:45:14 jetson-rogue-carrier nvargus-daemon[6538]: (NvCamV4l2) Error IoctlFailed:  (in /dvs/git/dirty/git-master_linux/camera/utils/nvcamv4l2/v4l2_device.cpp, function streamControl(), line 1661)
dets  13 12:45:14 jetson-rogue-carrier nvargus-daemon[6538]: (NvOdmDevice) Error IoctlFailed:  (propagating from dvs/git/dirty/git-master_linux/camera-partner/imager/src/devices/V4L2SensorViCsi.cpp, function apply(), line 206)
dets  13 12:45:15 jetson-rogue-carrier nvargus-daemon[6538]: NvCaptureStatusErrorDecode Stream 4.1 failed: sof_ts 51880796704 eof_ts 1660662051840 frame 0 error 14 data 0x00020000
dets  13 12:45:15 jetson-rogue-carrier nvargus-daemon[6538]: NvCaptureStatusErrorDecode Capture-Error: FALCON_ERROR (0x0000000e)
dets  13 12:45:15 jetson-rogue-carrier nvargus-daemon[6538]: SCF: Error InvalidState: Capture error with status 14 (channel 0) (in src/services/capture/NvCaptureViCsiHw.cpp, function waitCsiFrameEnd(), line 930)
dets  13 12:45:15 jetson-rogue-carrier nvargus-daemon[6538]: SCF: Error InvalidState: Sequence order error (4 received, 1 expected, channel 0) (in src/services/capture/NvCaptureViCsiHw.cpp, function waitCsiFrameEnd(), line 937)
dets  13 12:45:16 jetson-rogue-carrier nvargus-daemon[6538]: CAM: serial no file already exists, skips storing againLSC: LSC surface is not based on full res!
dets  13 12:45:16 jetson-rogue-carrier nvargus-daemon[6538]: PowerServiceCore:handleRequests: timePassed = 1435
dets  13 12:45:16 jetson-rogue-carrier nvargus-daemon[6538]: SCF: Error InvalidState: Sequence order error (5 received, 2 expected, channel 0) (in src/services/capture/NvCaptureViCsiHw.cpp, function waitCsiFrameEnd(), line 937)
dets  13 12:45:16 jetson-rogue-carrier nvargus-daemon[6538]: (NvCapture) Error Timeout: capture waiting for status timeout (in /dvs/git/dirty/git-master_linux/camera/capture/nvcapture/capture_hw_linux.c, function NvCaptureLinuxGetCaptureStatus(), line 362)
dets  13 12:45:16 jetson-rogue-carrier nvargus-daemon[6538]: (NvCapture) Error Timeout:  (propagating from /dvs/git/dirty/git-master_linux/camera/capture/nvcapture/capture.c, function NvCaptureDequeue(), line 1055)
dets  13 12:45:16 jetson-rogue-carrier nvargus-daemon[6538]: SCF: Error Timeout:  (propagating from src/services/capture/NvCaptureViCsiHw.cpp, function waitCsiFrameEnd(), line 898)
dets  13 12:45:16 jetson-rogue-carrier nvargus-daemon[6538]: SCF: Error InvalidState: Timeout waiting on frame end sensor guid 4, capture sequence ID = 1, channel = 1/1 (in src/services/capture/NvCaptureViCsiHw.cpp, function waitCsiFrameEnd(), line 905)
dets  13 12:45:16 jetson-rogue-carrier nvargus-daemon[6538]: SCF: Error InvalidState: Something went wrong with waiting on frame end (in src/services/capture/NvCaptureViCsiHw.cpp, function waitCsiFrameEnd(), line 991)
dets  13 12:45:16 jetson-rogue-carrier nvargus-daemon[6538]: SCF: Error InvalidState: Timeout waiting on frame start sensor guid 4, capture sequence ID = 1 (in src/services/capture/NvCaptureViCsiHw.cpp, function waitCsiFrameStart(), line 1018)
dets  13 12:45:16 jetson-rogue-carrier nvargus-daemon[6538]: SCF: Error InvalidState: Something went wrong with waiting on frame start (in src/services/capture/NvCaptureViCsiHw.cpp, function waitCsiFrameStart(), line 1077)
dets  13 12:45:17 jetson-rogue-carrier nvargus-daemon[6538]: PowerServiceCore:handleRequests: timePassed = 1387
dets  13 12:45:17 jetson-rogue-carrier nvargus-daemon[6538]: SCF: Error InvalidState: Sequence order error (8 received, 5 expected, channel 0) (in src/services/capture/NvCaptureViCsiHw.cpp, function waitCsiFrameEnd(), line 937)
dets  13 12:45:17 jetson-rogue-carrier nvargus-daemon[6538]: NvCaptureStatusErrorDecode Stream 4.0 failed: sof_ts 0 eof_ts 53287442816 frame 0 error 2 data 0x000000a4
dets  13 12:45:17 jetson-rogue-carrier nvargus-daemon[6538]: NvCaptureStatusErrorDecode Capture-Error: CSIMUX_FRAME (0x00000002)
dets  13 12:45:17 jetson-rogue-carrier nvargus-daemon[6538]: CsimuxFrameError_Regular : 0x000000a4
dets  13 12:45:17 jetson-rogue-carrier nvargus-daemon[6538]:     Stream ID                [ 2: 0]: 4
dets  13 12:45:17 jetson-rogue-carrier nvargus-daemon[6538]:         
dets  13 12:45:17 jetson-rogue-carrier nvargus-daemon[6538]:     VPR state from fuse block    [ 3]: 0
dets  13 12:45:17 jetson-rogue-carrier nvargus-daemon[6538]:         
dets  13 12:45:17 jetson-rogue-carrier nvargus-daemon[6538]:     Frame end (FE)              [ 5]: 1
dets  13 12:45:17 jetson-rogue-carrier nvargus-daemon[6538]:         A frame end has been found on a regular mode stream.
dets  13 12:45:17 jetson-rogue-carrier nvargus-daemon[6538]:     FS_FAULT                    [ 7]: 1
dets  13 12:45:17 jetson-rogue-carrier nvargus-daemon[6538]:         A FS packet was found for a virtual channel that was already in frame.An errored FE packet was injected before FS was allowed through.
dets  13 12:45:17 jetson-rogue-carrier nvargus-daemon[6538]:     Binary VC number [3:2]   [27:26]: 0
dets  13 12:45:17 jetson-rogue-carrier nvargus-daemon[6538]:         To get full binary VC number, user need to concatenate VC[3:2] and VC[1:0] together.
dets  13 12:45:17 jetson-rogue-carrier nvargus-daemon[6538]: SCF: Error InvalidState: Capture error with status 2 (channel 0) (in src/services/capture/NvCaptureViCsiHw.cpp, function waitCsiFrameEnd(), line 930)
dets  13 12:45:17 jetson-rogue-carrier nvargus-daemon[6538]: SCF: Error InvalidState: Sequence order error (9 received, 6 expected, channel 0) (in src/services/capture/NvCaptureViCsiHw.cpp, function waitCsiFrameEnd(), line 937)
dets  13 12:45:17 jetson-rogue-carrier nvargus-daemon[6538]: SCF: Error InvalidState: Sequence order error (67 received, 64 expected, channel 0) (in src/services/capture/NvCaptureViCsiHw.cpp, function waitCsiFrameEnd(), line 937)
dets  13 12:45:17 jetson-rogue-carrier nvargus-daemon[6538]: SCF: Error InvalidState: Sequence order error (68 received, 65 expected, channel 0) (in src/services/capture/NvCaptureViCsiHw.cpp, function waitCsiFrameEnd(), line 937)
dets  13 12:45:17 jetson-rogue-carrier nvargus-daemon[6538]: SCF: Error InvalidState: Sequence order error (6 received, 3 expected, channel 0) (in src/services/capture/NvCaptureViCsiHw.cpp, function waitCsiFrameEnd(), line 937)
dets  13 12:45:17 jetson-rogue-carrier nvargus-daemon[6538]: SCF: Error InvalidState: Sequence order error (7 received, 4 expected, channel 0) (in src/services/capture/NvCaptureViCsiHw.cpp, function waitCsiFrameEnd(), line 937)
dets  13 12:45:17 jetson-rogue-carrier nvargus-daemon[6538]: SCF: Error InvalidState: Sequence order error (10 received, 7 expected, channel 0) (in src/services/capture/NvCaptureViCsiHw.cpp, function waitCsiFrameEnd(), line 937)
dets  13 12:45:17 jetson-rogue-carrier nvargus-daemon[6538]: SCF: Error InvalidState: Sequence order error (69 received, 66 expected, channel 0) (in src/services/capture/NvCaptureViCsiHw.cpp, function waitCsiFrameEnd(), line 937)
dets  13 12:45:18 jetson-rogue-carrier nvargus-daemon[6538]: PowerServiceCore:handleRequests: timePassed = 1394
dets  13 12:45:18 jetson-rogue-carrier nvargus-daemon[6538]: NvCaptureStatusErrorDecode Stream 2.0 failed: sof_ts 54755309664 eof_ts 1752234027008 frame 0 error 14 data 0x00020000
dets  13 12:45:18 jetson-rogue-carrier nvargus-daemon[6538]: NvCaptureStatusErrorDecode Capture-Error: FALCON_ERROR (0x0000000e)
dets  13 12:45:18 jetson-rogue-carrier nvargus-daemon[6538]: SCF: Error InvalidState: Capture error with status 14 (channel 0) (in src/services/capture/NvCaptureViCsiHw.cpp, function waitCsiFrameEnd(), line 930)
dets  13 12:45:18 jetson-rogue-carrier nvargus-daemon[6538]: SCF: Error InvalidState: Sequence order error (4 received, 1 expected, channel 0) (in src/services/capture/NvCaptureViCsiHw.cpp, function waitCsiFrameEnd(), line 937)
dets  13 12:45:18 jetson-rogue-carrier nvargus-daemon[6538]: SCF: Error InvalidState: Sequence order error (5 received, 2 expected, channel 0) (in src/services/capture/NvCaptureViCsiHw.cpp, function waitCsiFrameEnd(), line 937)
dets  13 12:45:20 jetson-rogue-carrier nvargus-daemon[6538]: PowerServiceCore:handleRequests: timePassed = 1451
dets  13 12:45:20 jetson-rogue-carrier nvargus-daemon[6538]: SCF: Error InvalidState: Sequence order error (70 received, 67 expected, channel 0) (in src/services/capture/NvCaptureViCsiHw.cpp, function waitCsiFrameEnd(), line 937)
dets  13 12:45:20 jetson-rogue-carrier nvargus-daemon[6538]: SCF: Error InvalidState: Sequence order error (71 received, 68 expected, channel 0) (in src/services/capture/NvCaptureViCsiHw.cpp, function waitCsiFrameEnd(), line 937)
dets  13 12:45:20 jetson-rogue-carrier nvargus-daemon[6538]: SCF: Error InvalidState: Sequence order error (8 received, 5 expected, channel 0) (in src/services/capture/NvCaptureViCsiHw.cpp, function waitCsiFrameEnd(), line 937)
dets  13 12:45:20 jetson-rogue-carrier nvargus-daemon[6538]: SCF: Error InvalidState: Sequence order error (9 received, 6 expected, channel 0) (in src/services/capture/NvCaptureViCsiHw.cpp, function waitCsiFrameEnd(), line 937)
dets  13 12:45:20 jetson-rogue-carrier nvargus-daemon[6538]: SCF: Error InvalidState: Sequence order error (6 received, 3 expected, channel 0) (in src/services/capture/NvCaptureViCsiHw.cpp, function waitCsiFrameEnd(), line 937)
dets  13 12:45:20 jetson-rogue-carrier nvargus-daemon[6538]: SCF: Error InvalidState: Sequence order error (7 received, 4 expected, channel 0) (in src/services/capture/NvCaptureViCsiHw.cpp, function waitCsiFrameEnd(), line 937)
dets  13 12:45:20 jetson-rogue-carrier nvargus-daemon[6538]: SCF: Error InvalidState: Sequence order error (11 received, 8 expected, channel 0) (in src/services/capture/NvCaptureViCsiHw.cpp, function waitCsiFrameEnd(), line 937)
dets  13 12:45:20 jetson-rogue-carrier nvargus-daemon[6538]: SCF: Error InvalidState: Sequence order error (12 received, 9 expected, channel 0) (in src/services/capture/NvCaptureViCsiHw.cpp, function waitCsiFrameEnd(), line 937)
dets  13 12:45:20 jetson-rogue-carrier nvargus-daemon[6538]: SCF: Error InvalidState: Sequence order error (72 received, 69 expected, channel 0) (in src/services/capture/NvCaptureViCsiHw.cpp, function waitCsiFrameEnd(), line 937)
dets  13 12:45:20 jetson-rogue-carrier nvargus-daemon[6538]: SCF: Error InvalidState: Sequence order error (13 received, 10 expected, channel 0) (in src/services/capture/NvCaptureViCsiHw.cpp, function waitCsiFrameEnd(), line 937)
dets  13 12:45:20 jetson-rogue-carrier nvargus-daemon[6538]: SCF: Error InvalidState: Sequence order error (10 received, 7 expected, channel 0) (in src/services/capture/NvCaptureViCsiHw.cpp, function waitCsiFrameEnd(), line 937)
dets  13 12:45:20 jetson-rogue-carrier nvargus-daemon[6538]: SCF: Error InvalidState: Sequence order error (73 received, 70 expected, channel 0) (in src/services/capture/NvCaptureViCsiHw.cpp, function waitCsiFrameEnd(), line 937)
dets  13 12:45:20 jetson-rogue-carrier nvargus-daemon[6538]: SCF: Error InvalidState: Sequence order error (14 received, 11 expected, channel 0) (in src/services/capture/NvCaptureViCsiHw.cpp, function waitCsiFrameEnd(), line 937)
dets  13 12:45:20 jetson-rogue-carrier nvargus-daemon[6538]: SCF: Error InvalidState: Sequence order error (11 received, 8 expected, channel 0) (in src/services/capture/NvCaptureViCsiHw.cpp, function waitCsiFrameEnd(), line 937)
dets  13 12:45:20 jetson-rogue-carrier nvargus-daemon[6538]: SCF: Error InvalidState: Sequence order error (74 received, 71 expected, channel 0) (in src/services/capture/NvCaptureViCsiHw.cpp, function waitCsiFrameEnd(), line 937)
dets  13 12:45:20 jetson-rogue-carrier nvargus-daemon[6538]: SCF: Error InvalidState: Sequence order error (15 received, 12 expected, channel 0) (in src/services/capture/NvCaptureViCsiHw.cpp, function waitCsiFrameEnd(), line 937)
dets  13 12:45:20 jetson-rogue-carrier nvargus-daemon[6538]: SCF: Error InvalidState: Sequence order error (12 received, 9 expected, channel 0) (in src/services/capture/NvCaptureViCsiHw.cpp, function waitCsiFrameEnd(), line 937)
dets  13 12:45:20 jetson-rogue-carrier nvargus-daemon[6538]: SCF: Error InvalidState: Sequence order error (75 received, 72 expected, channel 0) (in src/services/capture/NvCaptureViCsiHw.cpp, function waitCsiFrameEnd(), line 937)
dets  13 12:45:20 jetson-rogue-carrier nvargus-daemon[6538]: SCF: Error InvalidState: Sequence order error (16 received, 13 expected, channel 0) (in src/services/capture/NvCaptureViCsiHw.cpp, function waitCsiFrameEnd(), line 937)
dets  13 12:45:20 jetson-rogue-carrier nvargus-daemon[6538]: SCF: Error InvalidState: Sequence order error (13 received, 10 expected, channel 0) (in src/services/capture/NvCaptureViCsiHw.cpp, function waitCsiFrameEnd(), line 937)
dets  13 12:45:20 jetson-rogue-carrier nvargus-daemon[6538]: SCF: Error InvalidState: Sequence order error (76 received, 73 expected, channel 0) (in src/services/capture/NvCaptureViCsiHw.cpp, function waitCsiFrameEnd(), line 937)
dets  13 12:45:20 jetson-rogue-carrier nvargus-daemon[6538]: SCF: Error InvalidState: Sequence order error (17 received, 14 expected, channel 0) (in src/services/capture/NvCaptureViCsiHw.cpp, function waitCsiFrameEnd(), line 937)
dets  13 12:45:20 jetson-rogue-carrier nvargus-daemon[6538]: SCF: Error InvalidState: Sequence order error (14 received, 11 expected, channel 0) (in src/services/capture/NvCaptureViCsiHw.cpp, function waitCsiFrameEnd(), line 937)
dets  13 12:45:20 jetson-rogue-carrier nvargus-daemon[6538]: SCF: Error InvalidState: Sequence order error (77 received, 74 expected, channel 0) (in src/services/capture/NvCaptureViCsiHw.cpp, function waitCsiFrameEnd(), line 937)
dets  13 12:45:20 jetson-rogue-carrier nvargus-daemon[6538]: SCF: Error InvalidState: Sequence order error (18 received, 15 expected, channel 0) (in src/services/capture/NvCaptureViCsiHw.cpp, function waitCsiFrameEnd(), line 937)
dets  13 12:45:20 jetson-rogue-carrier nvargus-daemon[6538]: SCF: Error InvalidState: Sequence order error (15 received, 12 expected, channel 0) (in src/services/capture/NvCaptureViCsiHw.cpp, function waitCsiFrameEnd(), line 937)
dets  13 12:45:20 jetson-rogue-carrier nvargus-daemon[6538]: SCF: Error InvalidState: Sequence order error (78 received, 75 expected, channel 0) (in src/services/capture/NvCaptureViCsiHw.cpp, function waitCsiFrameEnd(), line 937)
dets  13 12:45:20 jetson-rogue-carrier nvargus-daemon[6538]: SCF: Error InvalidState: Sequence order error (19 received, 16 expected, channel 0) (in src/services/capture/NvCaptureViCsiHw.cpp, function waitCsiFrameEnd(), line 937)
dets  13 12:45:20 jetson-rogue-carrier nvargus-daemon[6538]: SCF: Error InvalidState: Sequence order error (16 received, 13 expected, channel 0) (in src/services/capture/NvCaptureViCsiHw.cpp, function waitCsiFrameEnd(), line 937)
dets  13 12:45:20 jetson-rogue-carrier nvargus-daemon[6538]: SCF: Error InvalidState: Sequence order error (79 received, 76 expected, channel 0) (in src/services/capture/NvCaptureViCsiHw.cpp, function waitCsiFrameEnd(), line 937)
dets  13 12:45:20 jetson-rogue-carrier nvargus-daemon[6538]: SCF: Error InvalidState: Sequence order error (20 received, 17 expected, channel 0) (in src/services/capture/NvCaptureViCsiHw.cpp, function waitCsiFrameEnd(), line 937)
dets  13 12:45:20 jetson-rogue-carrier nvargus-daemon[6538]: SCF: Error InvalidState: Sequence order error (17 received, 14 expected, channel 0) (in src/services/capture/NvCaptureViCsiHw.cpp, function waitCsiFrameEnd(), line 937)
dets  13 12:45:20 jetson-rogue-carrier nvargus-daemon[6538]: SCF: Error InvalidState: Sequence order error (80 received, 77 expected, channel 0) (in src/services/capture/NvCaptureViCsiHw.cpp, function waitCsiFrameEnd(), line 937)
dets  13 12:45:20 jetson-rogue-carrier nvargus-daemon[6538]: SCF: Error InvalidState: Sequence order error (21 received, 18 expected, channel 0) (in src/services/capture/NvCaptureViCsiHw.cpp, function waitCsiFrameEnd(), line 937)
dets  13 12:45:20 jetson-rogue-carrier nvargus-daemon[6538]: SCF: Error InvalidState: Sequence order error (18 received, 15 expected, channel 0) (in src/services/capture/NvCaptureViCsiHw.cpp, function waitCsiFrameEnd(), line 937)
dets  13 12:45:20 jetson-rogue-carrier nvargus-daemon[6538]: SCF: Error InvalidState: Sequence order error (81 received, 78 expected, channel 0) (in src/services/capture/NvCaptureViCsiHw.cpp, function waitCsiFrameEnd(), line 937)
dets  13 12:45:20 jetson-rogue-carrier nvargus-daemon[6538]: SCF: Error InvalidState: Sequence order error (22 received, 19 expected, channel 0) (in src/services/capture/NvCaptureViCsiHw.cpp, function waitCsiFrameEnd(), line 937)
dets  13 12:45:20 jetson-rogue-carrier nvargus-daemon[6538]: SCF: Error InvalidState: Sequence order error (19 received, 16 expected, channel 0) (in src/services/capture/NvCaptureViCsiHw.cpp, function waitCsiFrameEnd(), line 937)
dets  13 12:45:20 jetson-rogue-carrier nvargus-daemon[6538]: SCF: Error InvalidState: Sequence order error (82 received, 79 expected, channel 0) (in src/services/capture/NvCaptureViCsiHw.cpp, function waitCsiFrameEnd(), line 937)
dets  13 12:45:20 jetson-rogue-carrier nvargus-daemon[6538]: SCF: Error InvalidState: Sequence order error (23 received, 20 expected, channel 0) (in src/services/capture/NvCaptureViCsiHw.cpp, function waitCsiFrameEnd(), line 937)
dets  13 12:45:20 jetson-rogue-carrier nvargus-daemon[6538]: SCF: Error InvalidState: Sequence order error (20 received, 17 expected, channel 0) (in src/services/capture/NvCaptureViCsiHw.cpp, function waitCsiFrameEnd(), line 937)
dets  13 12:45:20 jetson-rogue-carrier nvargus-daemon[6538]: SCF: Error InvalidState: Sequence order error (83 received, 80 expected, channel 0) (in src/services/capture/NvCaptureViCsiHw.cpp, function waitCsiFrameEnd(), line 937)
dets  13 12:45:20 jetson-rogue-carrier nvargus-daemon[6538]: SCF: Error InvalidState: Sequence order error (24 received, 21 expected, channel 0) (in src/services/capture/NvCaptureViCsiHw.cpp, function waitCsiFrameEnd(), line 937)
dets  13 12:45:20 jetson-rogue-carrier nvargus-daemon[6538]: SCF: Error InvalidState: Sequence order error (21 received, 18 expected, channel 0) (in src/services/capture/NvCaptureViCsiHw.cpp, function waitCsiFrameEnd(), line 937)
dets  13 12:45:20 jetson-rogue-carrier nvargus-daemon[6538]: SCF: Error InvalidState: Sequence order error (84 received, 81 expected, channel 0) (in src/services/capture/NvCaptureViCsiHw.cpp, function waitCsiFrameEnd(), line 937)
dets  13 12:45:20 jetson-rogue-carrier nvargus-daemon[6538]: SCF: Error InvalidState: Sequence order error (25 received, 22 expected, channel 0) (in src/services/capture/NvCaptureViCsiHw.cpp, function waitCsiFrameEnd(), line 937)
dets  13 12:45:20 jetson-rogue-carrier nvargus-daemon[6538]: SCF: Error InvalidState: Sequence order error (22 received, 19 expected, channel 0) (in src/services/capture/NvCaptureViCsiHw.cpp, function waitCsiFrameEnd(), line 937)
dets  13 12:45:20 jetson-rogue-carrier nvargus-daemon[6538]: SCF: Error InvalidState: Sequence order error (85 received, 82 expected, channel 0) (in src/services/capture/NvCaptureViCsiHw.cpp, function waitCsiFrameEnd(), line 937)
dets  13 12:45:20 jetson-rogue-carrier nvargus-daemon[6538]: SCF: Error InvalidState: Sequence order error (26 received, 23 expected, channel 0) (in src/services/capture/NvCaptureViCsiHw.cpp, function waitCsiFrameEnd(), line 937)
dets  13 12:45:20 jetson-rogue-carrier nvargus-daemon[6538]: SCF: Error InvalidState: Sequence order error (23 received, 20 expected, channel 0) (in src/services/capture/NvCaptureViCsiHw.cpp, function waitCsiFrameEnd(), line 937)
dets  13 12:45:20 jetson-rogue-carrier nvargus-daemon[6538]: SCF: Error InvalidState: Sequence order error (86 received, 83 expected, channel 0) (in src/services/capture/NvCaptureViCsiHw.cpp, function waitCsiFrameEnd(), line 937)
dets  13 12:45:20 jetson-rogue-carrier nvargus-daemon[6538]: SCF: Error InvalidState: Sequence order error (27 received, 24 expected, channel 0) (in src/services/capture/NvCaptureViCsiHw.cpp, function waitCsiFrameEnd(), line 937)
dets  13 12:45:20 jetson-rogue-carrier nvargus-daemon[6538]: SCF: Error InvalidState: Sequence order error (24 received, 21 expected, channel 0) (in src/services/capture/NvCaptureViCsiHw.cpp, function waitCsiFrameEnd(), line 937)
dets  13 12:45:20 jetson-rogue-carrier nvargus-daemon[6538]: SCF: Error InvalidState: Sequence order error (87 received, 84 expected, channel 0) (in src/services/capture/NvCaptureViCsiHw.cpp, function waitCsiFrameEnd(), line 937)
dets  13 12:45:20 jetson-rogue-carrier nvargus-daemon[6538]: SCF: Error InvalidState: Sequence order error (28 received, 25 expected, channel 0) (in src/services/capture/NvCaptureViCsiHw.cpp, function waitCsiFrameEnd(), line 937)
dets  13 12:45:20 jetson-rogue-carrier nvargus-daemon[6538]: SCF: Error InvalidState: Sequence order error (25 received, 22 expected, channel 0) (in src/services/capture/NvCaptureViCsiHw.cpp, function waitCsiFrameEnd(), line 937)
dets  13 12:45:21 jetson-rogue-carrier nvargus-daemon[6538]: SCF: Error InvalidState: Sequence order error (88 received, 85 expected, channel 0) (in src/services/capture/NvCaptureViCsiHw.cpp, function waitCsiFrameEnd(), line 937)
dets  13 12:45:21 jetson-rogue-carrier nvargus-daemon[6538]: SCF: Error InvalidState: Sequence order error (29 received, 26 expected, channel 0) (in src/services/capture/NvCaptureViCsiHw.cpp, function waitCsiFrameEnd(), line 937)
dets  13 12:45:21 jetson-rogue-carrier nvargus-daemon[6538]: SCF: Error InvalidState: Sequence order error (26 received, 23 expected, channel 0) (in src/services/capture/NvCaptureViCsiHw.cpp, function waitCsiFrameEnd(), line 937)
dets  13 12:45:21 jetson-rogue-carrier nvargus-daemon[6538]: SCF: Error InvalidState: Sequence order error (89 received, 86 expected, channel 0) (in src/services/capture/NvCaptureViCsiHw.cpp, function waitCsiFrameEnd(), line 937)
dets  13 12:45:21 jetson-rogue-carrier nvargus-daemon[6538]: SCF: Error InvalidState: Sequence order error (30 received, 27 expected, channel 0) (in src/services/capture/NvCaptureViCsiHw.cpp, function waitCsiFrameEnd(), line 937)
dets  13 12:45:21 jetson-rogue-carrier nvargus-daemon[6538]: SCF: Error InvalidState: Sequence order error (27 received, 24 expected, channel 0) (in src/services/capture/NvCaptureViCsiHw.cpp, function waitCsiFrameEnd(), line 937)
dets  13 12:45:21 jetson-rogue-carrier nvargus-daemon[6538]: SCF: Error InvalidState: Sequence order error (90 received, 87 expected, channel 0) (in src/services/capture/NvCaptureViCsiHw.cpp, function waitCsiFrameEnd(), line 937)
dets  13 12:45:21 jetson-rogue-carrier nvargus-daemon[6538]: SCF: Error InvalidState: Sequence order error (31 received, 28 expected, channel 0) (in src/services/capture/NvCaptureViCsiHw.cpp, function waitCsiFrameEnd(), line 937)
dets  13 12:45:21 jetson-rogue-carrier nvargus-daemon[6538]: SCF: Error InvalidState: Sequence order error (28 received, 25 expected, channel 0) (in src/services/capture/NvCaptureViCsiHw.cpp, function waitCsiFrameEnd(), line 937)
dets  13 12:45:21 jetson-rogue-carrier nvargus-daemon[6538]: SCF: Error InvalidState: Sequence order error (91 received, 88 expected, channel 0) (in src/services/capture/NvCaptureViCsiHw.cpp, function waitCsiFrameEnd(), line 937)
dets  13 12:45:21 jetson-rogue-carrier nvargus-daemon[6538]: SCF: Error InvalidState: Sequence order error (32 received, 29 expected, channel 0) (in src/services/capture/NvCaptureViCsiHw.cpp, function waitCsiFrameEnd(), line 937)
dets  13 12:45:21 jetson-rogue-carrier nvargus-daemon[6538]: SCF: Error InvalidState: Sequence order error (29 received, 26 expected, channel 0) (in src/services/capture/NvCaptureViCsiHw.cpp, function waitCsiFrameEnd(), line 937)
dets  13 12:45:21 jetson-rogue-carrier nvargus-daemon[6538]: SCF: Error InvalidState: Sequence order error (92 received, 89 expected, channel 0) (in src/services/capture/NvCaptureViCsiHw.cpp, function waitCsiFrameEnd(), line 937)
dets  13 12:45:21 jetson-rogue-carrier nvargus-daemon[6538]: SCF: Error InvalidState: Sequence order error (33 received, 30 expected, channel 0) (in src/services/capture/NvCaptureViCsiHw.cpp, function waitCsiFrameEnd(), line 937)
dets  13 12:45:21 jetson-rogue-carrier nvargus-daemon[6538]: SCF: Error InvalidState: Sequence order error (30 received, 27 expected, channel 0) (in src/services/capture/NvCaptureViCsiHw.cpp, function waitCsiFrameEnd(), line 937)
dets  13 12:45:21 jetson-rogue-carrier nvargus-daemon[6538]: SCF: Error InvalidState: Sequence order error (93 received, 90 expected, channel 0) (in src/services/capture/NvCaptureViCsiHw.cpp, function waitCsiFrameEnd(), line 937)
dets  13 12:45:21 jetson-rogue-carrier nvargus-daemon[6538]: SCF: Error InvalidState: Sequence order error (34 received, 31 expected, channel 0) (in src/services/capture/NvCaptureViCsiHw.cpp, function waitCsiFrameEnd(), line 937)
dets  13 12:45:21 jetson-rogue-carrier nvargus-daemon[6538]: SCF: Error InvalidState: Sequence order error (31 received, 28 expected, channel 0) (in src/services/capture/NvCaptureViCsiHw.cpp, function waitCsiFrameEnd(), line 937)
dets  13 12:45:21 jetson-rogue-carrier nvargus-daemon[6538]: SCF: Error InvalidState: Sequence order error (94 received, 91 expected, channel 0) (in src/services/capture/NvCaptureViCsiHw.cpp, function waitCsiFrameEnd(), line 937)
dets  13 12:45:21 jetson-rogue-carrier nvargus-daemon[6538]: SCF: Error InvalidState: Sequence order error (35 received, 32 expected, channel 0) (in src/services/capture/NvCaptureViCsiHw.cpp, function waitCsiFrameEnd(), line 937)
dets  13 12:45:21 jetson-rogue-carrier nvargus-daemon[6538]: SCF: Error InvalidState: Sequence order error (32 received, 29 expected, channel 0) (in src/services/capture/NvCaptureViCsiHw.cpp, function waitCsiFrameEnd(), line 937)
dets  13 12:45:21 jetson-rogue-carrier nvargus-daemon[6538]: SCF: Error InvalidState: Sequence order error (95 received, 92 expected, channel 0) (in src/services/capture/NvCaptureViCsiHw.cpp, function waitCsiFrameEnd(), line 937)
dets  13 12:45:21 jetson-rogue-carrier nvargus-daemon[6538]: SCF: Error InvalidState: Sequence order error (36 received, 33 expected, channel 0) (in src/services/capture/NvCaptureViCsiHw.cpp, function waitCsiFrameEnd(), line 937)
dets  13 12:45:21 jetson-rogue-carrier nvargus-daemon[6538]: SCF: Error InvalidState: Sequence order error (33 received, 30 expected, channel 0) (in src/services/capture/NvCaptureViCsiHw.cpp, function waitCsiFrameEnd(), line 937)
dets  13 12:45:21 jetson-rogue-carrier nvargus-daemon[6538]: SCF: Error InvalidState: Sequence order error (96 received, 93 expected, channel 0) (in src/services/capture/NvCaptureViCsiHw.cpp, function waitCsiFrameEnd(), line 937)
dets  13 12:45:21 jetson-rogue-carrier nvargus-daemon[6538]: SCF: Error InvalidState: Sequence order error (37 received, 34 expected, channel 0) (in src/services/capture/NvCaptureViCsiHw.cpp, function waitCsiFrameEnd(), line 937)
dets  13 12:45:21 jetson-rogue-carrier nvargus-daemon[6538]: SCF: Error InvalidState: Sequence order error (34 received, 31 expected, channel 0) (in src/services/capture/NvCaptureViCsiHw.cpp, function waitCsiFrameEnd(), line 937)
dets  13 12:45:21 jetson-rogue-carrier nvargus-daemon[6538]: SCF: Error InvalidState: Sequence order error (97 received, 94 expected, channel 0) (in src/services/capture/NvCaptureViCsiHw.cpp, function waitCsiFrameEnd(), line 937)
dets  13 12:45:21 jetson-rogue-carrier nvargus-daemon[6538]: SCF: Error InvalidState: Sequence order error (38 received, 35 expected, channel 0) (in src/services/capture/NvCaptureViCsiHw.cpp, function waitCsiFrameEnd(), line 937)
dets  13 12:45:21 jetson-rogue-carrier nvargus-daemon[6538]: SCF: Error InvalidState: Sequence order error (35 received, 32 expected, channel 0) (in src/services/capture/NvCaptureViCsiHw.cpp, function waitCsiFrameEnd(), line 937)
dets  13 12:45:21 jetson-rogue-carrier nvargus-daemon[6538]: SCF: Error InvalidState: Sequence order error (98 received, 95 expected, channel 0) (in src/services/capture/NvCaptureViCsiHw.cpp, function waitCsiFrameEnd(), line 937)
dets  13 12:45:21 jetson-rogue-carrier nvargus-daemon[6538]: SCF: Error InvalidState: Sequence order error (39 received, 36 expected, channel 0) (in src/services/capture/NvCaptureViCsiHw.cpp, function waitCsiFrameEnd(), line 937)
dets  13 12:45:21 jetson-rogue-carrier nvargus-daemon[6538]: SCF: Error InvalidState: Sequence order error (36 received, 33 expected, channel 0) (in src/services/capture/NvCaptureViCsiHw.cpp, function waitCsiFrameEnd(), line 937)
dets  13 12:45:21 jetson-rogue-carrier nvargus-daemon[6538]: SCF: Error InvalidState: Sequence order error (99 received, 96 expected, channel 0) (in src/services/capture/NvCaptureViCsiHw.cpp, function waitCsiFrameEnd(), line 937)
dets  13 12:45:21 jetson-rogue-carrier nvargus-daemon[6538]: SCF: Error InvalidState: Sequence order error (40 received, 37 expected, channel 0) (in src/services/capture/NvCaptureViCsiHw.cpp, function waitCsiFrameEnd(), line 937)
dets  13 12:45:21 jetson-rogue-carrier nvargus-daemon[6538]: SCF: Error InvalidState: Sequence order error (37 received, 34 expected, channel 0) (in src/services/capture/NvCaptureViCsiHw.cpp, function waitCsiFrameEnd(), line 937)
dets  13 12:45:21 jetson-rogue-carrier nvargus-daemon[6538]: SCF: Error InvalidState: Sequence order error (100 received, 97 expected, channel 0) (in src/services/capture/NvCaptureViCsiHw.cpp, function waitCsiFrameEnd(), line 937)
dets  13 12:45:21 jetson-rogue-carrier nvargus-daemon[6538]: SCF: Error InvalidState: Sequence order error (41 received, 38 expected, channel 0) (in src/services/capture/NvCaptureViCsiHw.cpp, function waitCsiFrameEnd(), line 937)
dets  13 12:45:21 jetson-rogue-carrier nvargus-daemon[6538]: SCF: Error InvalidState: Sequence order error (38 received, 35 expected, channel 0) (in src/services/capture/NvCaptureViCsiHw.cpp, function waitCsiFrameEnd(), line 937)
dets  13 12:45:21 jetson-rogue-carrier nvargus-daemon[6538]: SCF: Error InvalidState: Sequence order error (101 received, 98 expected, channel 0) (in src/services/capture/NvCaptureViCsiHw.cpp, function waitCsiFrameEnd(), line 937)
dets  13 12:45:21 jetson-rogue-carrier nvargus-daemon[6538]: SCF: Error InvalidState: Sequence order error (42 received, 39 expected, channel 0) (in src/services/capture/NvCaptureViCsiHw.cpp, function waitCsiFrameEnd(), line 937)
dets  13 12:45:21 jetson-rogue-carrier nvargus-daemon[6538]: SCF: Error InvalidState: Sequence order error (39 received, 36 expected, channel 0) (in src/services/capture/NvCaptureViCsiHw.cpp, function waitCsiFrameEnd(), line 937)
dets  13 12:45:21 jetson-rogue-carrier nvargus-daemon[6538]: SCF: Error InvalidState: Sequence order error (102 received, 99 expected, channel 0) (in src/services/capture/NvCaptureViCsiHw.cpp, function waitCsiFrameEnd(), line 937)
dets  13 12:45:21 jetson-rogue-carrier nvargus-daemon[6538]: SCF: Error InvalidState: Sequence order error (43 received, 40 expected, channel 0) (in src/services/capture/NvCaptureViCsiHw.cpp, function waitCsiFrameEnd(), line 937)
dets  13 12:45:21 jetson-rogue-carrier nvargus-daemon[6538]: SCF: Error InvalidState: Sequence order error (40 received, 37 expected, channel 0) (in src/services/capture/NvCaptureViCsiHw.cpp, function waitCsiFrameEnd(), line 937)
dets  13 12:45:21 jetson-rogue-carrier nvargus-daemon[6538]: SCF: Error InvalidState: Sequence order error (103 received, 100 expected, channel 0) (in src/services/capture/NvCaptureViCsiHw.cpp, function waitCsiFrameEnd(), line 937)
dets  13 12:45:21 jetson-rogue-carrier nvargus-daemon[6538]: SCF: Error InvalidState: Sequence order error (44 received, 41 expected, channel 0) (in src/services/capture/NvCaptureViCsiHw.cpp, function waitCsiFrameEnd(), line 937)
dets  13 12:45:21 jetson-rogue-carrier nvargus-daemon[6538]: SCF: Error InvalidState: Sequence order error (41 received, 38 expected, channel 0) (in src/services/capture/NvCaptureViCsiHw.cpp, function waitCsiFrameEnd(), line 937)
dets  13 12:45:21 jetson-rogue-carrier nvargus-daemon[6538]: SCF: Error InvalidState: Sequence order error (104 received, 101 expected, channel 0) (in src/services/capture/NvCaptureViCsiHw.cpp, function waitCsiFrameEnd(), line 937)
dets  13 12:45:21 jetson-rogue-carrier nvargus-daemon[6538]: SCF: Error InvalidState: Sequence order error (45 received, 42 expected, channel 0) (in src/services/capture/NvCaptureViCsiHw.cpp, function waitCsiFrameEnd(), line 937)
dets  13 12:45:21 jetson-rogue-carrier nvargus-daemon[6538]: SCF: Error InvalidState: Sequence order error (42 received, 39 expected, channel 0) (in src/services/capture/NvCaptureViCsiHw.cpp, function waitCsiFrameEnd(), line 937)
dets  13 12:45:21 jetson-rogue-carrier nvargus-daemon[6538]: SCF: Error InvalidState: Sequence order error (105 received, 102 expected, channel 0) (in src/services/capture/NvCaptureViCsiHw.cpp, function waitCsiFrameEnd(), line 937)
dets  13 12:45:21 jetson-rogue-carrier nvargus-daemon[6538]: SCF: Error InvalidState: Sequence order error (46 received, 43 expected, channel 0) (in src/services/capture/NvCaptureViCsiHw.cpp, function waitCsiFrameEnd(), line 937)
dets  13 12:45:21 jetson-rogue-carrier nvargus-daemon[6538]: SCF: Error InvalidState: Sequence order error (43 received, 40 expected, channel 0) (in src/services/capture/NvCaptureViCsiHw.cpp, function waitCsiFrameEnd(), line 937)
dets  13 12:45:21 jetson-rogue-carrier nvargus-daemon[6538]: SCF: Error InvalidState: Sequence order error (106 received, 103 expected, channel 0) (in src/services/capture/NvCaptureViCsiHw.cpp, function waitCsiFrameEnd(), line 937)
dets  13 12:45:00 jetson-rogue-carrier nvargus-daemon[6538]: NvPclHwGetModuleList: No module data found
dets  13 12:45:00 jetson-rogue-carrier nvargus-daemon[6538]: OFParserGetVirtualDevice: NVIDIA Camera virtual enumerator not found in proc device-tree
dets  13 12:45:00 jetson-rogue-carrier nvargus-daemon[6538]: ---- imager: Found override file [/var/nvidia/nvcam/settings/camera_overrides.isp]. ----
dets  13 12:45:00 jetson-rogue-carrier nvargus-daemon[6538]: CAM: serial no file already exists, skips storing againLSC: LSC surface is not based on full res!
dets  13 12:45:00 jetson-rogue-carrier nvargus-daemon[6538]: ---- imager: Found override file [/var/nvidia/nvcam/settings/camera_overrides.isp]. ----
dets  13 12:45:00 jetson-rogue-carrier nvargus-daemon[6538]: CAM: serial no file already exists, skips storing againLSC: LSC surface is not based on full res!
dets  13 12:45:00 jetson-rogue-carrier nvargus-daemon[6538]: ---- imager: Found override file [/var/nvidia/nvcam/settings/camera_overrides.isp]. ----
dets  13 12:45:00 jetson-rogue-carrier nvargus-daemon[6538]: CAM: serial no file already exists, skips storing againLSC: LSC surface is not based on full res!
dets  13 12:45:00 jetson-rogue-carrier nvargus-daemon[6538]: ---- imager: Found override file [/var/nvidia/nvcam/settings/camera_overrides.isp]. ----
dets  13 12:45:00 jetson-rogue-carrier nvargus-daemon[6538]: CAM: serial no file already exists, skips storing againLSC: LSC surface is not based on full res!
dets  13 12:45:00 jetson-rogue-carrier nvargus-daemon[6538]: ---- imager: Found override file [/var/nvidia/nvcam/settings/camera_overrides.isp]. ----
dets  13 12:45:00 jetson-rogue-carrier nvargus-daemon[6538]: CAM: serial no file already exists, skips storing againLSC: LSC surface is not based on full res!
dets  13 12:45:00 jetson-rogue-carrier nvargus-daemon[6538]: ---- imager: Found override file [/var/nvidia/nvcam/settings/camera_overrides.isp]. ----
dets  13 12:45:00 jetson-rogue-carrier nvargus-daemon[6538]: CAM: serial no file already exists, skips storing againLSC: LSC surface is not based on full res!
dets  13 12:45:00 jetson-rogue-carrier nvargus-daemon[6538]: ---- imager: Found override file [/var/nvidia/nvcam/settings/camera_overrides.isp]. ----
dets  13 12:45:00 jetson-rogue-carrier nvargus-daemon[6538]: (NvCamV4l2) Error ModuleNotPresent: V4L2Device not available (in /dvs/git/dirty/git-master_linux/camera/utils/nvcamv4l2/v4l2_device.cpp, function findDevice(), line 256)
dets  13 12:45:00 jetson-rogue-carrier nvargus-daemon[6538]: (NvCamV4l2) Error ModuleNotPresent:  (propagating from /dvs/git/dirty/git-master_linux/camera/utils/nvcamv4l2/v4l2_device.cpp, function initialize(), line 60)
dets  13 12:45:00 jetson-rogue-carrier nvargus-daemon[6538]: (NvOdmDevice) Error ModuleNotPresent:  (propagating from dvs/git/dirty/git-master_linux/camera-partner/imager/src/devices/V4L2SensorViCsi.cpp, function initialize(), line 107)
dets  13 12:45:00 jetson-rogue-carrier nvargus-daemon[6538]: NvPclDriverInitializeData: Unable to initialize driver v4l2_sensor
dets  13 12:45:00 jetson-rogue-carrier nvargus-daemon[6538]: NvPclInitializeDrivers: error: Failed to init camera sub module v4l2_sensor
dets  13 12:45:00 jetson-rogue-carrier nvargus-daemon[6538]: NvPclStartPlatformDrivers: Failed to start module drivers
dets  13 12:45:00 jetson-rogue-carrier nvargus-daemon[6538]: NvPclStateControllerOpen: Failed ImagerGUID 6. (error 0xA000E)
dets  13 12:45:00 jetson-rogue-carrier nvargus-daemon[6538]: NvPclOpen: PCL Open Failed. Error: 0xf
dets  13 12:45:00 jetson-rogue-carrier nvargus-daemon[6538]: SCF: Error BadParameter: Sensor could not be opened. (in src/services/capture/CaptureServiceDeviceSensor.cpp, function getSourceFromGuid(), line 582)
dets  13 12:45:00 jetson-rogue-carrier nvargus-daemon[6538]: SCF: Error BadParameter:  (propagating from src/services/capture/CaptureService.cpp, function addSourceByGuid(), line 437)
dets  13 12:45:00 jetson-rogue-carrier nvargus-daemon[6538]: SCF: Error BadParameter:  (propagating from src/api/CameraDriver.cpp, function addSourceByIndex(), line 305)
dets  13 12:45:00 jetson-rogue-carrier nvargus-daemon[6538]: SCF: Error BadParameter:  (propagating from src/api/CameraDriver.cpp, function getSource(), line 471)
dets  13 12:45:00 jetson-rogue-carrier nvargus-daemon[6538]: Acquiring SCF Camera device source via index 6 has failed. ---- imager: Found override file [/var/nvidia/nvcam/settings/camera_overrides.isp]. ----
dets  13 12:45:00 jetson-rogue-carrier nvargus-daemon[6538]: (NvCamV4l2) Error ModuleNotPresent: V4L2Device not available (in /dvs/git/dirty/git-master_linux/camera/utils/nvcamv4l2/v4l2_device.cpp, function findDevice(), line 256)
dets  13 12:45:00 jetson-rogue-carrier nvargus-daemon[6538]: (NvCamV4l2) Error ModuleNotPresent:  (propagating from /dvs/git/dirty/git-master_linux/camera/utils/nvcamv4l2/v4l2_device.cpp, function initialize(), line 60)
dets  13 12:45:00 jetson-rogue-carrier nvargus-daemon[6538]: (NvOdmDevice) Error ModuleNotPresent:  (propagating from dvs/git/dirty/git-master_linux/camera-partner/imager/src/devices/V4L2SensorViCsi.cpp, function initialize(), line 107)
dets  13 12:45:00 jetson-rogue-carrier nvargus-daemon[6538]: NvPclDriverInitializeData: Unable to initialize driver v4l2_sensor
dets  13 12:45:00 jetson-rogue-carrier nvargus-daemon[6538]: NvPclInitializeDrivers: error: Failed to init camera sub module v4l2_sensor
dets  13 12:45:00 jetson-rogue-carrier nvargus-daemon[6538]: NvPclStartPlatformDrivers: Failed to start module drivers
dets  13 12:45:00 jetson-rogue-carrier nvargus-daemon[6538]: NvPclStateControllerOpen: Failed ImagerGUID 7. (error 0xA000E)
dets  13 12:45:00 jetson-rogue-carrier nvargus-daemon[6538]: NvPclOpen: PCL Open Failed. Error: 0xf
dets  13 12:45:00 jetson-rogue-carrier nvargus-daemon[6538]: SCF: Error BadParameter: Sensor could not be opened. (in src/services/capture/CaptureServiceDeviceSensor.cpp, function getSourceFromGuid(), line 582)
dets  13 12:45:00 jetson-rogue-carrier nvargus-daemon[6538]: SCF: Error BadParameter:  (propagating from src/services/capture/CaptureService.cpp, function addSourceByGuid(), line 437)
dets  13 12:45:00 jetson-rogue-carrier nvargus-daemon[6538]: SCF: Error BadParameter:  (propagating from src/api/CameraDriver.cpp, function addSourceByIndex(), line 305)
dets  13 12:45:00 jetson-rogue-carrier nvargus-daemon[6538]: SCF: Error BadParameter:  (propagating from src/api/CameraDriver.cpp, function getSource(), line 471)
dets  13 12:45:00 jetson-rogue-carrier nvargus-daemon[6538]: Acquiring SCF Camera device source via index 7 has failed. === gstd[1]: CameraProvider initialized (0x7f70c76fe0)CAM: serial no file already exists, skips storing againLSC: LSC surface is not based on full res!
dets  13 12:45:03 jetson-rogue-carrier nvargus-daemon[6538]: CAM: serial no file already exists, skips storing againLSC: LSC surface is not based on full res!
dets  13 12:45:04 jetson-rogue-carrier nvargus-daemon[6538]: (NvCapture) Error Timeout: capture waiting for status timeout (in /dvs/git/dirty/git-master_linux/camera/capture/nvcapture/capture_hw_linux.c, function NvCaptureLinuxGetCaptureStatus(), line 362)
dets  13 12:45:04 jetson-rogue-carrier nvargus-daemon[6538]: (NvCapture) Error Timeout:  (propagating from /dvs/git/dirty/git-master_linux/camera/capture/nvcapture/capture.c, function NvCaptureDequeue(), line 1055)
dets  13 12:45:04 jetson-rogue-carrier nvargus-daemon[6538]: SCF: Error Timeout:  (propagating from src/services/capture/NvCaptureViCsiHw.cpp, function waitCsiFrameEnd(), line 898)
dets  13 12:45:04 jetson-rogue-carrier nvargus-daemon[6538]: SCF: Error InvalidState: Timeout waiting on frame end sensor guid 0, capture sequence ID = 1, channel = 1/1 (in src/services/capture/NvCaptureViCsiHw.cpp, function waitCsiFrameEnd(), line 905)
dets  13 12:45:04 jetson-rogue-carrier nvargus-daemon[6538]: SCF: Error InvalidState: Timeout waiting on frame start sensor guid 0, capture sequence ID = 1 (in src/services/capture/NvCaptureViCsiHw.cpp, function waitCsiFrameStart(), line 1018)
dets  13 12:45:04 jetson-rogue-carrier nvargus-daemon[6538]: SCF: Error InvalidState: Something went wrong with waiting on frame end (in src/services/capture/NvCaptureViCsiHw.cpp, function waitCsiFrameEnd(), line 991)
dets  13 12:45:04 jetson-rogue-carrier nvargus-daemon[6538]: SCF: Error InvalidState: Something went wrong with waiting on frame end (in src/services/capture/NvCaptureViCsiHw.cpp, function waitCsiFrameEnd(), line 991)
dets  13 12:45:04 jetson-rogue-carrier nvargus-daemon[6538]: SCF: Error InvalidState: Something went wrong with waiting on frame start (in src/services/capture/NvCaptureViCsiHw.cpp, function waitCsiFrameStart(), line 1077)
dets  13 12:45:04 jetson-rogue-carrier nvargus-daemon[6538]: SCF: Error InvalidState: Something went wrong with waiting on frame start (in src/services/capture/NvCaptureViCsiHw.cpp, function waitCsiFrameStart(), line 1077)
dets  13 12:45:05 jetson-rogue-carrier nvargus-daemon[6538]: PowerServiceCore:handleRequests: timePassed = 2898
dets  13 12:45:05 jetson-rogue-carrier nvargus-daemon[6538]: NvCaptureStatusErrorDecode Stream 5.1 failed: sof_ts 42771183168 eof_ts 1368965815296 frame 0 error 14 data 0x00020000
dets  13 12:45:05 jetson-rogue-carrier nvargus-daemon[6538]: NvCaptureStatusErrorDecode Capture-Error: FALCON_ERROR (0x0000000e)
dets  13 12:45:05 jetson-rogue-carrier nvargus-daemon[6538]: SCF: Error InvalidState: Capture error with status 14 (channel 0) (in src/services/capture/NvCaptureViCsiHw.cpp, function waitCsiFrameEnd(), line 930)
dets  13 12:45:06 jetson-rogue-carrier nvargus-daemon[6538]: PowerServiceCore:handleRequests: timePassed = 1401
dets  13 12:45:06 jetson-rogue-carrier nvargus-daemon[6538]: NvCaptureStatusErrorDecode Stream 5.0 failed: sof_ts 42771172928 eof_ts 1369066206208 frame 0 error 14 data 0x00020000
dets  13 12:45:06 jetson-rogue-carrier nvargus-daemon[6538]: NvCaptureStatusErrorDecode Capture-Error: FALCON_ERROR (0x0000000e)
dets  13 12:45:06 jetson-rogue-carrier nvargus-daemon[6538]: SCF: Error InvalidState: Capture error with status 14 (channel 0) (in src/services/capture/NvCaptureViCsiHw.cpp, function waitCsiFrameEnd(), line 930)
dets  13 12:45:06 jetson-rogue-carrier nvargus-daemon[6538]: SCF: Error InvalidState: Sequence order error (4 received, 1 expected, channel 0) (in src/services/capture/NvCaptureViCsiHw.cpp, function waitCsiFrameEnd(), line 937)
dets  13 12:45:06 jetson-rogue-carrier nvargus-daemon[6538]: SCF: Error InvalidState: Sequence order error (5 received, 2 expected, channel 0) (in src/services/capture/NvCaptureViCsiHw.cpp, function waitCsiFrameEnd(), line 937)
dets  13 12:45:06 jetson-rogue-carrier nvargus-daemon[6538]: SCF: Error InvalidState: Sequence order error (6 received, 3 expected, channel 0) (in src/services/capture/NvCaptureViCsiHw.cpp, function waitCsiFrameEnd(), line 937)
dets  13 12:45:07 jetson-rogue-carrier nvargus-daemon[6538]: SCF: Error InvalidState: Sequence order error (7 received, 4 expected, channel 0) (in src/services/capture/NvCaptureViCsiHw.cpp, function waitCsiFrameEnd(), line 937)
dets  13 12:45:07 jetson-rogue-carrier nvargus-daemon[6538]: CAM: serial no file already exists, skips storing againLSC: LSC surface is not based on full res!
dets  13 12:45:07 jetson-rogue-carrier nvargus-daemon[6538]: SCF: Error InvalidState: Sequence order error (8 received, 5 expected, channel 0) (in src/services/capture/NvCaptureViCsiHw.cpp, function waitCsiFrameEnd(), line 937)
dets  13 12:45:07 jetson-rogue-carrier nvargus-daemon[6538]: SCF: Error InvalidState: Sequence order error (9 received, 6 expected, channel 0) (in src/services/capture/NvCaptureViCsiHw.cpp, function waitCsiFrameEnd(), line 937)
dets  13 12:45:07 jetson-rogue-carrier nvargus-daemon[6538]: SCF: Error InvalidState: Sequence order error (10 received, 7 expected, channel 0) (in src/services/capture/NvCaptureViCsiHw.cpp, function waitCsiFrameEnd(), line 937)
dets  13 12:45:08 jetson-rogue-carrier nvargus-daemon[6538]: PowerServiceCore:handleRequests: timePassed = 1476
dets  13 12:45:08 jetson-rogue-carrier nvargus-daemon[6538]: SCF: Error InvalidState: Sequence order error (11 received, 8 expected, channel 0) (in src/services/capture/NvCaptureViCsiHw.cpp, function waitCsiFrameEnd(), line 937)
dets  13 12:45:08 jetson-rogue-carrier nvargus-daemon[6538]: SCF: Error InvalidState: Sequence order error (12 received, 9 expected, channel 0) (in src/services/capture/NvCaptureViCsiHw.cpp, function waitCsiFrameEnd(), line 937)
dets  13 12:45:08 jetson-rogue-carrier nvargus-daemon[6538]: SCF: Error InvalidState: Sequence order error (13 received, 10 expected, channel 0) (in src/services/capture/NvCaptureViCsiHw.cpp, function waitCsiFrameEnd(), line 937)
dets  13 12:45:08 jetson-rogue-carrier nvargus-daemon[6538]: SCF: Error InvalidState: Sequence order error (14 received, 11 expected, channel 0) (in src/services/capture/NvCaptureViCsiHw.cpp, function waitCsiFrameEnd(), line 937)
dets  13 12:45:08 jetson-rogue-carrier nvargus-daemon[6538]: SCF: Error InvalidState: Sequence order error (15 received, 12 expected, channel 0) (in src/services/capture/NvCaptureViCsiHw.cpp, function waitCsiFrameEnd(), line 937)
dets  13 12:45:08 jetson-rogue-carrier nvargus-daemon[6538]: SCF: Error InvalidState: Sequence order error (16 received, 13 expected, channel 0) (in src/services/capture/NvCaptureViCsiHw.cpp, function waitCsiFrameEnd(), line 937)
dets  13 12:45:08 jetson-rogue-carrier nvargus-daemon[6538]: SCF: Error InvalidState: Sequence order error (17 received, 14 expected, channel 0) (in src/services/capture/NvCaptureViCsiHw.cpp, function waitCsiFrameEnd(), line 937)
dets  13 12:45:08 jetson-rogue-carrier nvargus-daemon[6538]: SCF: Error InvalidState: Sequence order error (18 received, 15 expected, channel 0) (in src/services/capture/NvCaptureViCsiHw.cpp, function waitCsiFrameEnd(), line 937)
dets  13 12:45:08 jetson-rogue-carrier nvargus-daemon[6538]: SCF: Error InvalidState: Sequence order error (19 received, 16 expected, channel 0) (in src/services/capture/NvCaptureViCsiHw.cpp, function waitCsiFrameEnd(), line 937)
dets  13 12:45:08 jetson-rogue-carrier nvargus-daemon[6538]: SCF: Error InvalidState: Sequence order error (20 received, 17 expected, channel 0) (in src/services/capture/NvCaptureViCsiHw.cpp, function waitCsiFrameEnd(), line 937)
dets  13 12:45:08 jetson-rogue-carrier nvargus-daemon[6538]: SCF: Error InvalidState: Sequence order error (21 received, 18 expected, channel 0) (in src/services/capture/NvCaptureViCsiHw.cpp, function waitCsiFrameEnd(), line 937)
dets  13 12:45:08 jetson-rogue-carrier nvargus-daemon[6538]: SCF: Error InvalidState: Sequence order error (22 received, 19 expected, channel 0) (in src/services/capture/NvCaptureViCsiHw.cpp, function waitCsiFrameEnd(), line 937)
dets  13 12:45:08 jetson-rogue-carrier nvargus-daemon[6538]: SCF: Error InvalidState: Sequence order error (23 received, 20 expected, channel 0) (in src/services/capture/NvCaptureViCsiHw.cpp, function waitCsiFrameEnd(), line 937)
dets  13 12:45:09 jetson-rogue-carrier nvargus-daemon[6538]: SCF: Error InvalidState: Sequence order error (24 received, 21 expected, channel 0) (in src/services/capture/NvCaptureViCsiHw.cpp, function waitCsiFrameEnd(), line 937)
dets  13 12:45:09 jetson-rogue-carrier nvargus-daemon[6538]: SCF: Error InvalidState: Sequence order error (25 received, 22 expected, channel 0) (in src/services/capture/NvCaptureViCsiHw.cpp, function waitCsiFrameEnd(), line 937)
dets  13 12:45:09 jetson-rogue-carrier nvargus-daemon[6538]: SCF: Error InvalidState: Sequence order error (26 received, 23 expected, channel 0) (in src/services/capture/NvCaptureViCsiHw.cpp, function waitCsiFrameEnd(), line 937)
dets  13 12:45:09 jetson-rogue-carrier nvargus-daemon[6538]: SCF: Error InvalidState: Sequence order error (27 received, 24 expected, channel 0) (in src/services/capture/NvCaptureViCsiHw.cpp, function waitCsiFrameEnd(), line 937)

Other symptom :
It seems that nvarguscamerasrc always fails the first time it is used. Then works. Log when failing :

nvidia@jetson-rogue-carrier:~$ gst-launch-1.0 nvarguscamerasrc sensor-id=0 ! queue ! fakesink
Setting pipeline to PAUSED ...
Pipeline is live and does not need PREROLL ...
Setting pipeline to PLAYING ...
New clock: GstSystemClock
GST_ARGUS: Creating output stream
CONSUMER: Waiting until producer is connected...
GST_ARGUS: Available Sensor modes :
GST_ARGUS: 1920 x 1080 FR = 29,999999 fps Duration = 33333334 ; Analog Gain range min 1,000000, max 31,622776; Exposure Range min 59000, max 33333000;

GST_ARGUS: Running with following settings:
   Camera index = 0 
   Camera mode  = 0 
   Output Stream W = 1920 H = 1080 
   seconds to Run    = 0 
   Frame Rate = 29,999999 
GST_ARGUS: Setup Complete, Starting captures for 0 seconds
GST_ARGUS: Starting repeat capture requests.
CONSUMER: Producer has connected; continuing.
nvbuf_utils: dmabuf_fd -1 mapped entry NOT found
nvbuf_utils: Can not get HW buffer from FD... Exiting...
CONSUMER: ERROR OCCURRED
ERROR: from element /GstPipeline:pipeline0/GstNvArgusCameraSrc:nvarguscamerasrc0: CANCELLED
Additional debug info:
Argus Error Status
Execution ended after 0:00:03.156519168
Setting pipeline to PAUSED ...
Setting pipeline to READY ...
GST_ARGUS: Cleaning up
Setting pipeline to NULL ...
Freeing pipeline ...

If I restart the docker container the logs go away.
I have tried to add the nvargus-daemon.service as a requirement for the docker service but it doesn’t solve the problem.

IT really looks like a race condition at boot, but I cannot pinpoint the problem. Any idea ?

Thanks !

There is no update from you for a period, assuming this is not an issue any more.
Hence we are closing this topic. If need further support, please open a new one.
Thanks

Sorry for the late response, is this still an issue to support?

Thanks

This topic was automatically closed 14 days after the last reply. New replies are no longer allowed.