opencv_Installation errors

nvidia@tegra-ubuntu:~/opencv_contrib/opencv/build$ make -j4
[ 2%] Built target libtiff
[ 6%] Built target libwebp
[ 9%] Built target tbb
Scanning dependencies of target opencv_core_pch_dephelp
[ 14%] Built target IlmImf
Scanning dependencies of target opencv_flann_pch_dephelp
[ 17%] Built target carotene_objs
[ 17%] Building CXX object modules/core/CMakeFiles/opencv_core_pch_dephelp.dir/opencv_core_pch_dephelp.cxx.o
Scanning dependencies of target opencv_ml_pch_dephelp
Scanning dependencies of target opencv_imgproc_pch_dephelp
[ 17%] Building CXX object modules/flann/CMakeFiles/opencv_flann_pch_dephelp.dir/opencv_flann_pch_dephelp.cxx.o
[ 17%] Building CXX object modules/imgproc/CMakeFiles/opencv_imgproc_pch_dephelp.dir/opencv_imgproc_pch_dephelp.cxx.o
[ 17%] Building CXX object modules/ml/CMakeFiles/opencv_ml_pch_dephelp.dir/opencv_ml_pch_dephelp.cxx.o
In file included from /home/nvidia/opencv_contrib/opencv/modules/core/src/precomp.hpp:55:0,
from /home/nvidia/opencv_contrib/opencv/build/modules/core/opencv_core_pch_dephelp.cxx:1:
/home/nvidia/opencv_contrib/opencv/modules/core/include/opencv2/core/private.hpp:63:23: fatal error: tbb/tbb.h: No such file or directory
compilation terminated.
modules/core/CMakeFiles/opencv_core_pch_dephelp.dir/build.make:62: recipe for target ‘modules/core/CMakeFiles/opencv_core_pch_dephelp.dir/opencv_core_pch_dephelp.cxx.o’ failed
make[2]: *** [modules/core/CMakeFiles/opencv_core_pch_dephelp.dir/opencv_core_pch_dephelp.cxx.o] Error 1
CMakeFiles/Makefile2:2159: recipe for target ‘modules/core/CMakeFiles/opencv_core_pch_dephelp.dir/all’ failed
make[1]: *** [modules/core/CMakeFiles/opencv_core_pch_dephelp.dir/all] Error 2
make[1]: *** Waiting for unfinished jobs…
In file included from /home/nvidia/opencv_contrib/opencv/modules/imgproc/src/precomp.hpp:50:0,
from /home/nvidia/opencv_contrib/opencv/build/modules/imgproc/opencv_imgproc_pch_dephelp.cxx:1:
/home/nvidia/opencv_contrib/opencv/modules/core/include/opencv2/core/private.hpp:63:23: fatal error: tbb/tbb.h: No such file or directory
compilation terminated.
In file included from /home/nvidia/opencv_contrib/opencv/modules/ml/src/precomp.hpp:49:0,
from /home/nvidia/opencv_contrib/opencv/build/modules/ml/opencv_ml_pch_dephelp.cxx:1:
/home/nvidia/opencv_contrib/opencv/modules/core/include/opencv2/core/private.hpp:63:23: fatal error: tbb/tbb.h: No such file or directory
compilation terminated.
modules/imgproc/CMakeFiles/opencv_imgproc_pch_dephelp.dir/build.make:62: recipe for target ‘modules/imgproc/CMakeFiles/opencv_imgproc_pch_dephelp.dir/opencv_imgproc_pch_dephelp.cxx.o’ failed
make[2]: *** [modules/imgproc/CMakeFiles/opencv_imgproc_pch_dephelp.dir/opencv_imgproc_pch_dephelp.cxx.o] Error 1
CMakeFiles/Makefile2:2411: recipe for target ‘modules/imgproc/CMakeFiles/opencv_imgproc_pch_dephelp.dir/all’ failed
make[1]: *** [modules/imgproc/CMakeFiles/opencv_imgproc_pch_dephelp.dir/all] Error 2
modules/ml/CMakeFiles/opencv_ml_pch_dephelp.dir/build.make:62: recipe for target ‘modules/ml/CMakeFiles/opencv_ml_pch_dephelp.dir/opencv_ml_pch_dephelp.cxx.o’ failed
make[2]: *** [modules/ml/CMakeFiles/opencv_ml_pch_dephelp.dir/opencv_ml_pch_dephelp.cxx.o] Error 1
CMakeFiles/Makefile2:2541: recipe for target ‘modules/ml/CMakeFiles/opencv_ml_pch_dephelp.dir/all’ failed
make[1]: *** [modules/ml/CMakeFiles/opencv_ml_pch_dephelp.dir/all] Error 2
In file included from /home/nvidia/opencv_contrib/opencv/modules/flann/src/precomp.hpp:23:0,
from /home/nvidia/opencv_contrib/opencv/build/modules/flann/opencv_flann_pch_dephelp.cxx:1:
/home/nvidia/opencv_contrib/opencv/modules/core/include/opencv2/core/private.hpp:63:23: fatal error: tbb/tbb.h: No such file or directory
compilation terminated.
modules/flann/CMakeFiles/opencv_flann_pch_dephelp.dir/build.make:62: recipe for target ‘modules/flann/CMakeFiles/opencv_flann_pch_dephelp.dir/opencv_flann_pch_dephelp.cxx.o’ failed
make[2]: *** [modules/flann/CMakeFiles/opencv_flann_pch_dephelp.dir/opencv_flann_pch_dephelp.cxx.o] Error 1
CMakeFiles/Makefile2:2281: recipe for target ‘modules/flann/CMakeFiles/opencv_flann_pch_dephelp.dir/all’ failed
make[1]: *** [modules/flann/CMakeFiles/opencv_flann_pch_dephelp.dir/all] Error 2
Makefile:160: recipe for target ‘all’ failed
make: *** [all] Error 2

You may try to disable precompiled headers.