attempt to update nvidia software for new kernel failed and produced this file (Fedora 17 )

ran my daily

sudo yum update a few days ago

attempt to update nvidia software for new kernel failed and produced this file (Fedora 17 )

/var/cache/akmods/nvidia/304.64-1-for-3.7.3-101.fc17.i686.failed.log

I’m new here - don’t know how to include file so I will copy it below

can someone suggest what I should do?

File follows:

25 Jan 13:20:08 akmods: Building RPM using the command ‘/bin/akmodsbuild --target i686 --kernels 3.7.3-101.fc17.i686 /usr/src/akmods/nvidia-kmod.latest’
/tmp/akmodsbuild.wM6c53eW/BUILD/nvidia-kmod-304.64/_kmod_build_3.7.3-101.fc17.i686/kernel/nv.c:1551:25: warning: passing argument 2 of ‘request_irq’ from incompatible pointer type [enabled by default]
In file included from /tmp/akmodsbuild.wM6c53eW/BUILD/nvidia-kmod-304.64/_kmod_build_3.7.3-101.fc17.i686/kernel/nv-linux.h:112:0,
from /tmp/akmodsbuild.wM6c53eW/BUILD/nvidia-kmod-304.64/_kmod_build_3.7.3-101.fc17.i686/kernel/nv.c:13:
include/linux/interrupt.h:130:1: note: expected ‘irq_handler_t’ but argument is of type ‘enum irqreturn_t (*)(int, void *, struct pt_regs *)’
/tmp/akmodsbuild.wM6c53eW/BUILD/nvidia-kmod-304.64/_kmod_build_3.7.3-101.fc17.i686/kernel/nv.c: In function ‘nv_agp_init’:
/tmp/akmodsbuild.wM6c53eW/BUILD/nvidia-kmod-304.64/_kmod_build_3.7.3-101.fc17.i686/kernel/nv.c:2911:6: warning: “NV_AGP_BACKEND_ACQUIRE_ARGUMENT_COUNT” is not defined [-Wundef]
/tmp/akmodsbuild.wM6c53eW/BUILD/nvidia-kmod-304.64/_kmod_build_3.7.3-101.fc17.i686/kernel/nv.c:2928:9: error: too few arguments to function ‘agp_backend_acquire’
In file included from /tmp/akmodsbuild.wM6c53eW/BUILD/nvidia-kmod-304.64/_kmod_build_3.7.3-101.fc17.i686/kernel/nv-linux.h:249:0,
from /tmp/akmodsbuild.wM6c53eW/BUILD/nvidia-kmod-304.64/_kmod_build_3.7.3-101.fc17.i686/kernel/nv.c:13:
include/linux/agp_backend.h:106:32: note: declared here
/tmp/akmodsbuild.wM6c53eW/BUILD/nvidia-kmod-304.64/_kmod_build_3.7.3-101.fc17.i686/kernel/nv.c:2930:13: error: too few arguments to function ‘agp_backend_release’
In file included from /tmp/akmodsbuild.wM6c53eW/BUILD/nvidia-kmod-304.64/_kmod_build_3.7.3-101.fc17.i686/kernel/nv-linux.h:249:0,
from /tmp/akmodsbuild.wM6c53eW/BUILD/nvidia-kmod-304.64/_kmod_build_3.7.3-101.fc17.i686/kernel/nv.c:13:
include/linux/agp_backend.h:107:13: note: declared here
cc1: some warnings being treated as errors
make[3]: *** [/tmp/akmodsbuild.wM6c53eW/BUILD/nvidia-kmod-304.64/_kmod_build_3.7.3-101.fc17.i686/kernel/nv-acpi.o] Error 1
make[3]: *** Waiting for unfinished jobs…
cc1: some warnings being treated as errors
make[3]: *** [/tmp/akmodsbuild.wM6c53eW/BUILD/nvidia-kmod-304.64/_kmod_build_3.7.3-101.fc17.i686/kernel/nv.o] Error 1
make[2]: *** [module/tmp/akmodsbuild.wM6c53eW/BUILD/nvidia-kmod-304.64/_kmod_build_3.7.3-101.fc17.i686/kernel] Error 2
NVIDIA: left KBUILD.
nvidia.ko failed to build!
make[1]: *** [module] Error 1
make: *** [module] Error 2
error: Bad exit status from /var/tmp/rpm-tmp.CaurXN (%build)

RPM build errors:
user mockbuild does not exist - using root
group mockbuild does not exist - using root
user mockbuild does not exist - using root
group mockbuild does not exist - using root
user mockbuild does not exist - using root
group mockbuild does not exist - using root
Bad exit status from /var/tmp/rpm-tmp.CaurXN (%build)
25 Jan 13:20:30 akmodsbuild: * Rebuilding /usr/src/akmods/nvidia-kmod.latest for kernel(s) 3.7.3-101.fc17.i686: warning: user mockbuild does not exist - using root
25 Jan 13:20:30 akmodsbuild: warning: group mockbuild does not exist - using root
25 Jan 13:20:30 akmodsbuild: warning: user mockbuild does not exist - using root
25 Jan 13:20:30 akmodsbuild: warning: group mockbuild does not exist - using root
25 Jan 13:20:30 akmodsbuild: warning: user mockbuild does not exist - using root
25 Jan 13:20:30 akmodsbuild: warning: group mockbuild does not exist - using root
25 Jan 13:20:30 akmodsbuild: Installing /usr/src/akmods/nvidia-kmod.latest
25 Jan 13:20:30 akmodsbuild: Building target platforms: i686
25 Jan 13:20:30 akmodsbuild: Building for target i686
25 Jan 13:20:30 akmodsbuild: Executing(%prep): /bin/sh -e /var/tmp/rpm-tmp.A8dQol
25 Jan 13:20:30 akmodsbuild: + umask 022
25 Jan 13:20:30 akmodsbuild: + cd /tmp/akmodsbuild.wM6c53eW//BUILD
25 Jan 13:20:30 akmodsbuild: + kmodtool --target i686 --repo rpmfusion --kmodname nvidia-kmod --filterfile /tmp/akmodsbuild.wM6c53eW/SOURCES/nvidia-kmodtool-excludekernel-filterfile --obsolete-name nvidia-newest --obsolete-version 304.64 --current --for-kernels 3.7.3-101.fc17.i686
25 Jan 13:20:30 akmodsbuild: %package -n kmod-nvidia-3.7.3-101.fc17.i686
25 Jan 13:20:30 akmodsbuild: Summary: nvidia kernel module(s) for 3.7.3-101.fc17.i686
25 Jan 13:20:30 akmodsbuild: Group: System Environment/Kernel
25 Jan 13:20:30 akmodsbuild: Provides: kernel-modules-for-kernel = 3.7.3-101.fc17.i686
25 Jan 13:20:30 akmodsbuild: Provides: nvidia-kmod = %{?epoch:%{epoch}:}%{version}-%{release}
25 Jan 13:20:30 akmodsbuild: Requires: nvidia-kmod-common >= %{?epoch:%{epoch}:}%{version}
25 Jan 13:20:30 akmodsbuild: Requires(post): /usr/sbin/depmod
25 Jan 13:20:30 akmodsbuild: Requires(postun): /usr/sbin/depmod
25 Jan 13:20:30 akmodsbuild: Provides: kmod-nvidia-newest-3.7.3-101.fc17.i686 = 304.64
25 Jan 13:20:30 akmodsbuild: Obsoletes: kmod-nvidia-newest-3.7.3-101.fc17.i686 < 304.64
25 Jan 13:20:30 akmodsbuild: Requires: kernel-uname-r = 3.7.3-101.fc17.i686
25 Jan 13:20:30 akmodsbuild: BuildRequires: kernel-devel-uname-r = 3.7.3-101.fc17.i686
25 Jan 13:20:30 akmodsbuild: %post -n kmod-nvidia-3.7.3-101.fc17.i686
25 Jan 13:20:30 akmodsbuild: /usr/sbin/depmod -aeF /boot/System.map-3.7.3-101.fc17.i686 3.7.3-101.fc17.i686 > /dev/null || :
25 Jan 13:20:30 akmodsbuild: %postun -n kmod-nvidia-3.7.3-101.fc17.i686
25 Jan 13:20:30 akmodsbuild: /usr/sbin/depmod -aF /boot/System.map-3.7.3-101.fc17.i686 3.7.3-101.fc17.i686 &> /dev/null || :
25 Jan 13:20:30 akmodsbuild:
25 Jan 13:20:30 akmodsbuild: %description -n kmod-nvidia-3.7.3-101.fc17.i686
25 Jan 13:20:30 akmodsbuild: This package provides the nvidia kernel modules built for the Linux
25 Jan 13:20:30 akmodsbuild: kernel 3.7.3-101.fc17.i686 for the %{target_cpu} family of processors.
25 Jan 13:20:30 akmodsbuild: %files -n kmod-nvidia-3.7.3-101.fc17.i686
25 Jan 13:20:30 akmodsbuild: %defattr(644,root,root,755)
25 Jan 13:20:30 akmodsbuild: /usr/lib/modules/3.7.3-101.fc17.i686/extra/nvidia/
25 Jan 13:20:30 akmodsbuild:
25 Jan 13:20:30 akmodsbuild:
25 Jan 13:20:30 akmodsbuild:
25 Jan 13:20:30 akmodsbuild: %global kmodinstdir_prefix /usr/lib/modules/
25 Jan 13:20:30 akmodsbuild: %global kmodinstdir_postfix /extra/nvidia/
25 Jan 13:20:30 akmodsbuild: %global kernel_versions 3.7.3-101.fc17.i686
__%{usrsrc}/kernels/3.7.3-101.fc17.i686
25 Jan 13:20:30 akmodsbuild:
25 Jan 13:20:30 akmodsbuild: + cd /tmp/akmodsbuild.wM6c53eW/BUILD
25 Jan 13:20:30 akmodsbuild: + rm -rf nvidia-kmod-304.64
25 Jan 13:20:30 akmodsbuild: + /usr/bin/mkdir -p nvidia-kmod-304.64
25 Jan 13:20:30 akmodsbuild: + cd nvidia-kmod-304.64
25 Jan 13:20:30 akmodsbuild: + /usr/bin/xz -dc /tmp/akmodsbuild.wM6c53eW/SOURCES/nvidia-kmod-data-304.64.tar.xz
25 Jan 13:20:30 akmodsbuild: + /usr/bin/tar -xf -
25 Jan 13:20:30 akmodsbuild: + STATUS=0
25 Jan 13:20:30 akmodsbuild: + ‘[’ 0 -ne 0 ‘]’
25 Jan 13:20:30 akmodsbuild: + /usr/bin/chmod -Rf a+rX,u+w,g-w,o-w .
25 Jan 13:20:30 akmodsbuild: + for arch in x86 x64
25 Jan 13:20:30 akmodsbuild: + pushd nvidiapkg-x86
25 Jan 13:20:30 akmodsbuild: /tmp/akmodsbuild.wM6c53eW/BUILD/nvidia-kmod-304.64/nvidiapkg-x86 /tmp/akmodsbuild.wM6c53eW/BUILD/nvidia-kmod-304.64
25 Jan 13:20:30 akmodsbuild: + echo NoPatch
25 Jan 13:20:30 akmodsbuild: NoPatch
25 Jan 13:20:30 akmodsbuild: + popd
25 Jan 13:20:30 akmodsbuild: /tmp/akmodsbuild.wM6c53eW/BUILD/nvidia-kmod-304.64
25 Jan 13:20:30 akmodsbuild: + for arch in x86 x64
25 Jan 13:20:30 akmodsbuild: + pushd nvidiapkg-x64
25 Jan 13:20:30 akmodsbuild: /tmp/akmodsbuild.wM6c53eW/BUILD/nvidia-kmod-304.64/nvidiapkg-x64 /tmp/akmodsbuild.wM6c53eW/BUILD/nvidia-kmod-304.64
25 Jan 13:20:30 akmodsbuild: + echo NoPatch
25 Jan 13:20:30 akmodsbuild: NoPatch
25 Jan 13:20:30 akmodsbuild: + popd
25 Jan 13:20:30 akmodsbuild: /tmp/akmodsbuild.wM6c53eW/BUILD/nvidia-kmod-304.64
25 Jan 13:20:30 akmodsbuild: + for kernel_version in 3.7.3-101.fc17.i686
__/usr/src/kernels/3.7.3-101.fc17.i686
25 Jan 13:20:30 akmodsbuild: + cp -a nvidiapkg-x86 kmod_build_3.7.3-101.fc17.i686
25 Jan 13:20:30 akmodsbuild: + exit 0
25 Jan 13:20:30 akmodsbuild: Executing(%build): /bin/sh -e /var/tmp/rpm-tmp.CaurXN
25 Jan 13:20:30 akmodsbuild: + umask 022
25 Jan 13:20:30 akmodsbuild: + cd /tmp/akmodsbuild.wM6c53eW//BUILD
25 Jan 13:20:30 akmodsbuild: + cd nvidia-kmod-304.64
25 Jan 13:20:30 akmodsbuild: + for kernel_version in 3.7.3-101.fc17.i686
__/usr/src/kernels/3.7.3-101.fc17.i686
25 Jan 13:20:30 akmodsbuild: + pushd _kmod_build_3.7.3-101.fc17.i686/kernel/
25 Jan 13:20:30 akmodsbuild: /tmp/akmodsbuild.wM6c53eW/BUILD/nvidia-kmod-304.64/_kmod_build_3.7.3-101.fc17.i686/kernel /tmp/akmodsbuild.wM6c53eW/BUILD/nvidia-kmod-304.64
25 Jan 13:20:30 akmodsbuild: + make -j2 SYSSRC=/usr/src/kernels/3.7.3-101.fc17.i686 module
25 Jan 13:20:30 akmodsbuild: NVIDIA: calling KBUILD…
25 Jan 13:20:30 akmodsbuild: test -e include/generated/autoconf.h -a -e include/config/auto.conf || ( echo >&2; echo >&2 " ERROR: Kernel configuration is invalid."; echo >&2 " include/generated/autoconf.h or include/config/auto.conf are missing.";echo >&2 " Run ‘make oldconfig && make prepare’ on kernel src to fix it."; echo >&2 ; /bin/false)
25 Jan 13:20:30 akmodsbuild: mkdir -p /tmp/akmodsbuild.wM6c53eW/BUILD/nvidia-kmod-304.64/_kmod_build_3.7.3-101.fc17.i686/kernel/.tmp_versions ; rm -f /tmp/akmodsbuild.wM6c53eW/BUILD/nvidia-kmod-304.64/_kmod_build_3.7.3-101.fc17.i686/kernel/.tmp_versions/*
25 Jan 13:20:30 akmodsbuild: make -f scripts/Makefile.build obj=/tmp/akmodsbuild.wM6c53eW/BUILD/nvidia-kmod-304.64/_kmod_build_3.7.3-101.fc17.i686/kernel
25 Jan 13:20:30 akmodsbuild: (cat /dev/null; echo kernel//tmp/akmodsbuild.wM6c53eW/BUILD/nvidia-kmod-304.64/kmod_build_3.7.3-101.fc17.i686/kernel/nvidia.ko;) > /tmp/akmodsbuild.wM6c53eW/BUILD/nvidia-kmod-304.64/kmod_build_3.7.3-101.fc17.i686/kernel/modules.order
25 Jan 13:20:30 akmodsbuild: cc -Wp,-MD,/tmp/akmodsbuild.wM6c53eW/BUILD/nvidia-kmod-304.64/kmod_build_3.7.3-101.fc17.i686/kernel/.nv.o.d -nostdinc -isystem /usr/lib/gcc/i686-redhat-linux/4.7.2/include -I/usr/src/kernels/3.7.3-101.fc17.i686/arch/x86/include -Iarch/x86/include/generated -Iinclude -I/usr/src/kernels/3.7.3-101.fc17.i686/arch/x86/include/uapi -Iarch/x86/include/generated/uapi -I/usr/src/kernels/3.7.3-101.fc17.i686/include/uapi -Iinclude/generated/uapi -include /usr/src/kernels/3.7.3-101.fc17.i686/include/linux/kconfig.h -D__KERNEL
-Wall -Wundef -Wstrict-prototypes -Wno-trigraphs -fno-strict-aliasing -fno-common -Werror-implicit-function-declaration -Wno-format-security -fno-delete-null-pointer-checks -O2 -m32 -msoft-float -mregparm=3 -freg-struct-return -fno-pic -mpreferred-stack-boundary=2 -march=i686 -mtune=generic -maccumulate-outgoing-args -Wa,-mtune=generic32 -ffreestanding -fstack-protector -DCONFIG_AS_CFI=1 -DCONFIG_AS_CFI_SIGNAL_FRAME=1 -DCONFIG_AS_CFI_SECTIONS=1 -DCONFIG_AS_AVX=1 -pipe -Wno-sign-compare -fno-asynchronous-unwind-tables -mno-sse -mno-mmx -mno-sse2 -mno-3dnow -mno-avx -Wframe-larger-than=1024 -Wno-unused-but-set-variable -fno-omit-frame-pointer -fno-optimize-sibling-calls -g -pg -Wdeclaration-after-statement -Wno-pointer-sign -fno-strict-overflow -fconserve-stack -DCC_HAVE_ASM_GOTO -I/tmp/akmodsbuild.wM6c53eW/BUILD/nvidia-kmod-304.64/kmod_build_3.7.3-101.fc17.i686/kernel -Wall -MD -Wsign-compare -Wno-cast-qual -Wno-error -D__KERNEL
-DMODULE -DNVRM -DNV_VERSION_STRING=“304.64” -Wno-unused-function -Wuninitialized -UDEBUG -U_DEBUG -DNDEBUG -DMODULE -D"KBUILD_STR(s)=#s" -D"KBUILD_BASENAME=KBUILD_STR(nv)" -D"KBUILD_MODNAME=KBUILD_STR(nvidia)" -c -o /tmp/akmodsbuild.wM6c53eW/BUILD/nvidia-kmod-304.64/kmod_build_3.7.3-101.fc17.i686/kernel/nv.o /tmp/akmodsbuild.wM6c53eW/BUILD/nvidia-kmod-304.64/kmod_build_3.7.3-101.fc17.i686/kernel/nv.c
25 Jan 13:20:30 akmodsbuild: cc -Wp,-MD,/tmp/akmodsbuild.wM6c53eW/BUILD/nvidia-kmod-304.64/kmod_build_3.7.3-101.fc17.i686/kernel/.nv-acpi.o.d -nostdinc -isystem /usr/lib/gcc/i686-redhat-linux/4.7.2/include -I/usr/src/kernels/3.7.3-101.fc17.i686/arch/x86/include -Iarch/x86/include/generated -Iinclude -I/usr/src/kernels/3.7.3-101.fc17.i686/arch/x86/include/uapi -Iarch/x86/include/generated/uapi -I/usr/src/kernels/3.7.3-101.fc17.i686/include/uapi -Iinclude/generated/uapi -include /usr/src/kernels/3.7.3-101.fc17.i686/include/linux/kconfig.h -D__KERNEL
-Wall -Wundef -Wstrict-prototypes -Wno-trigraphs -fno-strict-aliasing -fno-common -Werror-implicit-function-declaration -Wno-format-security -fno-delete-null-pointer-checks -O2 -m32 -msoft-float -mregparm=3 -freg-struct-return -fno-pic -mpreferred-stack-boundary=2 -march=i686 -mtune=generic -maccumulate-outgoing-args -Wa,-mtune=generic32 -ffreestanding -fstack-protector -DCONFIG_AS_CFI=1 -DCONFIG_AS_CFI_SIGNAL_FRAME=1 -DCONFIG_AS_CFI_SECTIONS=1 -DCONFIG_AS_AVX=1 -pipe -Wno-sign-compare -fno-asynchronous-unwind-tables -mno-sse -mno-mmx -mno-sse2 -mno-3dnow -mno-avx -Wframe-larger-than=1024 -Wno-unused-but-set-variable -fno-omit-frame-pointer -fno-optimize-sibling-calls -g -pg -Wdeclaration-after-statement -Wno-pointer-sign -fno-strict-overflow -fconserve-stack -DCC_HAVE_ASM_GOTO -I/tmp/akmodsbuild.wM6c53eW/BUILD/nvidia-kmod-304.64/kmod_build_3.7.3-101.fc17.i686/kernel -Wall -MD -Wsign-compare -Wno-cast-qual -Wno-error -D__KERNEL
-DMODULE -DNVRM -DNV_VERSION_STRING=“304.64” -Wno-unused-function -Wuninitialized -UDEBUG -U_DEBUG -DNDEBUG -DMODULE -D"KBUILD_STR(s)=#s" -D"KBUILD_BASENAME=KBUILD_STR(nv_acpi)" -D"KBUILD_MODNAME=KBUILD_STR(nvidia)" -c -o /tmp/akmodsbuild.wM6c53eW/BUILD/nvidia-kmod-304.64/_kmod_build_3.7.3-101.fc17.i686/kernel/nv-acpi.o /tmp/akmodsbuild.wM6c53eW/BUILD/nvidia-kmod-304.64/_kmod_build_3.7.3-101.fc17.i686/kernel/nv-acpi.c
25 Jan 13:20:30 akmodsbuild: In file included from /tmp/akmodsbuild.wM6c53eW/BUILD/nvidia-kmod-304.64/_kmod_build_3.7.3-101.fc17.i686/kernel/nv-linux.h:15:0,
25 Jan 13:20:30 akmodsbuild: from /tmp/akmodsbuild.wM6c53eW/BUILD/nvidia-kmod-304.64/_kmod_build_3.7.3-101.fc17.i686/kernel/nv.c:13:
25 Jan 13:20:30 akmodsbuild: /tmp/akmodsbuild.wM6c53eW/BUILD/nvidia-kmod-304.64/_kmod_build_3.7.3-101.fc17.i686/kernel/conftest.h:8:2: error: #error remap_page_range() conftest failed!
25 Jan 13:20:30 akmodsbuild: /tmp/akmodsbuild.wM6c53eW/BUILD/nvidia-kmod-304.64/_kmod_build_3.7.3-101.fc17.i686/kernel/conftest.h:10:2: error: #error vmap() conftest failed!
25 Jan 13:20:30 akmodsbuild: /tmp/akmodsbuild.wM6c53eW/BUILD/nvidia-kmod-304.64/_kmod_build_3.7.3-101.fc17.i686/kernel/conftest.h:11:2: error: #error agp_backend_acquire() conftest failed!
25 Jan 13:20:30 akmodsbuild: /tmp/akmodsbuild.wM6c53eW/BUILD/nvidia-kmod-304.64/_kmod_build_3.7.3-101.fc17.i686/kernel/conftest.h:27:2: error: #error kmem_cache_create() conftest failed!
25 Jan 13:20:30 akmodsbuild: /tmp/akmodsbuild.wM6c53eW/BUILD/nvidia-kmod-304.64/_kmod_build_3.7.3-101.fc17.i686/kernel/conftest.h:28:2: error: #error on_each_cpu() conftest failed!
25 Jan 13:20:30 akmodsbuild: /tmp/akmodsbuild.wM6c53eW/BUILD/nvidia-kmod-304.64/_kmod_build_3.7.3-101.fc17.i686/kernel/conftest.h:29:2: error: #error smp_call_function() conftest failed!
25 Jan 13:20:30 akmodsbuild: /tmp/akmodsbuild.wM6c53eW/BUILD/nvidia-kmod-304.64/_kmod_build_3.7.3-101.fc17.i686/kernel/conftest.h:36:2: error: #error INIT_WORK() conftest failed!
25 Jan 13:20:30 akmodsbuild: /tmp/akmodsbuild.wM6c53eW/BUILD/nvidia-kmod-304.64/_kmod_build_3.7.3-101.fc17.i686/kernel/conftest.h:37:2: error: #error acpi_walk_namespace() conftest failed!
25 Jan 13:20:30 akmodsbuild: /tmp/akmodsbuild.wM6c53eW/BUILD/nvidia-kmod-304.64/_kmod_build_3.7.3-101.fc17.i686/kernel/conftest.h:38:2: error: #error acpi_os_wait_events_complete() conftest failed!
25 Jan 13:20:30 akmodsbuild: /tmp/akmodsbuild.wM6c53eW/BUILD/nvidia-kmod-304.64/_kmod_build_3.7.3-101.fc17.i686/kernel/conftest.h:42:2: error: #error pci_dma_mapping_error() conftest failed!
25 Jan 13:20:30 akmodsbuild: In file included from /tmp/akmodsbuild.wM6c53eW/BUILD/nvidia-kmod-304.64/_kmod_build_3.7.3-101.fc17.i686/kernel/nv-linux.h:15:0,
25 Jan 13:20:30 akmodsbuild: from /tmp/akmodsbuild.wM6c53eW/BUILD/nvidia-kmod-304.64/_kmod_build_3.7.3-101.fc17.i686/kernel/nv-acpi.c:15:
25 Jan 13:20:30 akmodsbuild: /tmp/akmodsbuild.wM6c53eW/BUILD/nvidia-kmod-304.64/_kmod_build_3.7.3-101.fc17.i686/kernel/conftest.h:8:2: error: #error remap_page_range() conftest failed!
25 Jan 13:20:30 akmodsbuild: /tmp/akmodsbuild.wM6c53eW/BUILD/nvidia-kmod-304.64/_kmod_build_3.7.3-101.fc17.i686/kernel/conftest.h:10:2: error: #error vmap() conftest failed!
25 Jan 13:20:30 akmodsbuild: /tmp/akmodsbuild.wM6c53eW/BUILD/nvidia-kmod-304.64/_kmod_build_3.7.3-101.fc17.i686/kernel/conftest.h:11:2: error: #error agp_backend_acquire() conftest failed!
25 Jan 13:20:30 akmodsbuild: /tmp/akmodsbuild.wM6c53eW/BUILD/nvidia-kmod-304.64/_kmod_build_3.7.3-101.fc17.i686/kernel/conftest.h:27:2: error: #error kmem_cache_create() conftest failed!
25 Jan 13:20:30 akmodsbuild: /tmp/akmodsbuild.wM6c53eW/BUILD/nvidia-kmod-304.64/_kmod_build_3.7.3-101.fc17.i686/kernel/conftest.h:28:2: error: #error on_each_cpu() conftest failed!
25 Jan 13:20:30 akmodsbuild: /tmp/akmodsbuild.wM6c53eW/BUILD/nvidia-kmod-304.64/_kmod_build_3.7.3-101.fc17.i686/kernel/conftest.h:29:2: error: #error smp_call_function() conftest failed!
25 Jan 13:20:30 akmodsbuild: /tmp/akmodsbuild.wM6c53eW/BUILD/nvidia-kmod-304.64/_kmod_build_3.7.3-101.fc17.i686/kernel/conftest.h:36:2: error: #error INIT_WORK() conftest failed!
25 Jan 13:20:30 akmodsbuild: /tmp/akmodsbuild.wM6c53eW/BUILD/nvidia-kmod-304.64/_kmod_build_3.7.3-101.fc17.i686/kernel/conftest.h:37:2: error: #error acpi_walk_namespace() conftest failed!
25 Jan 13:20:30 akmodsbuild: /tmp/akmodsbuild.wM6c53eW/BUILD/nvidia-kmod-304.64/_kmod_build_3.7.3-101.fc17.i686/kernel/conftest.h:38:2: error: #error acpi_os_wait_events_complete() conftest failed!
25 Jan 13:20:30 akmodsbuild: /tmp/akmodsbuild.wM6c53eW/BUILD/nvidia-kmod-304.64/_kmod_build_3.7.3-101.fc17.i686/kernel/conftest.h:42:2: error: #error pci_dma_mapping_error() conftest failed!
25 Jan 13:20:30 akmodsbuild: In file included from include/linux/kernel.h:10:0,
25 Jan 13:20:30 akmodsbuild: from include/linux/sched.h:15,
25 Jan 13:20:30 akmodsbuild: from include/linux/utsname.h:5,
25 Jan 13:20:30 akmodsbuild: from /tmp/akmodsbuild.wM6c53eW/BUILD/nvidia-kmod-304.64/_kmod_build_3.7.3-101.fc17.i686/kernel/nv-linux.h:40,
25 Jan 13:20:30 akmodsbuild: from /tmp/akmodsbuild.wM6c53eW/BUILD/nvidia-kmod-304.64/_kmod_build_3.7.3-101.fc17.i686/kernel/nv-acpi.c:15:
25 Jan 13:20:30 akmodsbuild: include/linux/bitops.h: In function ‘hweight_long’:In file included from include/linux/kernel.h:10:0,
25 Jan 13:20:30 akmodsbuild: from include/linux/sched.h:15,
25 Jan 13:20:30 akmodsbuild: from include/linux/utsname.h:5,
25 Jan 13:20:30 akmodsbuild: from /tmp/akmodsbuild.wM6c53eW/BUILD/nvidia-kmod-304.64/_kmod_build_3.7.3-101.fc17.i686/kernel/nv-linux.h:40,
25 Jan 13:20:30 akmodsbuild: from /tmp/akmodsbuild.wM6c53eW/BUILD/nvidia-kmod-304.64/_kmod_build_3.7.3-101.fc17.i686/kernel/nv.c:13:
25 Jan 13:20:30 akmodsbuild: include/linux/bitops.h: In function ‘hweight_long’:
25 Jan 13:20:30 akmodsbuild: include/linux/bitops.h:66:26: warning: signed and unsigned type in conditional expression [-Wsign-compare]
25 Jan 13:20:30 akmodsbuild:
25 Jan 13:20:30 akmodsbuild: include/linux/bitops.h:66:26: warning: signed and unsigned type in conditional expression [-Wsign-compare]
25 Jan 13:20:30 akmodsbuild: In file included from /usr/src/kernels/3.7.3-101.fc17.i686/arch/x86/include/asm/uaccess.h:592:0,
25 Jan 13:20:30 akmodsbuild: from include/linux/poll.h:11,
25 Jan 13:20:30 akmodsbuild: from /tmp/akmodsbuild.wM6c53eW/BUILD/nvidia-kmod-304.64/_kmod_build_3.7.3-101.fc17.i686/kernel/nv-linux.h:99,
25 Jan 13:20:30 akmodsbuild: from /tmp/akmodsbuild.wM6c53eW/BUILD/nvidia-kmod-304.64/_kmod_build_3.7.3-101.fc17.i686/kernel/nv-acpi.c:15:
25 Jan 13:20:30 akmodsbuild: /usr/src/kernels/3.7.3-101.fc17.i686/arch/x86/include/asm/uaccess_32.h: In function ‘copy_from_user’:
25 Jan 13:20:30 akmodsbuild: /usr/src/kernels/3.7.3-101.fc17.i686/arch/x86/include/asm/uaccess_32.h:208:6: warning: comparison between signed and unsigned integer expressions [-Wsign-compare]
25 Jan 13:20:30 akmodsbuild: In file included from /usr/src/kernels/3.7.3-101.fc17.i686/arch/x86/include/asm/uaccess.h:592:0,
25 Jan 13:20:30 akmodsbuild: from include/linux/poll.h:11,
25 Jan 13:20:30 akmodsbuild: from /tmp/akmodsbuild.wM6c53eW/BUILD/nvidia-kmod-304.64/_kmod_build_3.7.3-101.fc17.i686/kernel/nv-linux.h:99,
25 Jan 13:20:30 akmodsbuild: from /tmp/akmodsbuild.wM6c53eW/BUILD/nvidia-kmod-304.64/_kmod_build_3.7.3-101.fc17.i686/kernel/nv.c:13:
25 Jan 13:20:30 akmodsbuild: /usr/src/kernels/3.7.3-101.fc17.i686/arch/x86/include/asm/uaccess_32.h: In function ‘copy_from_user’:
25 Jan 13:20:30 akmodsbuild: /usr/src/kernels/3.7.3-101.fc17.i686/arch/x86/include/asm/uaccess_32.h:208:6: warning: comparison between signed and unsigned integer expressions [-Wsign-compare]
25 Jan 13:20:30 akmodsbuild: In file included from /tmp/akmodsbuild.wM6c53eW/BUILD/nvidia-kmod-304.64/_kmod_build_3.7.3-101.fc17.i686/kernel/nv.c:13:0:
25 Jan 13:20:30 akmodsbuild: /tmp/akmodsbuild.wM6c53eW/BUILD/nvidia-kmod-304.64/_kmod_build_3.7.3-101.fc17.i686/kernel/nv-linux.h: At top level:
25 Jan 13:20:30 akmodsbuild: /tmp/akmodsbuild.wM6c53eW/BUILD/nvidia-kmod-304.64/_kmod_build_3.7.3-101.fc17.i686/kernel/nv-linux.h:135:2: error: #error “struct file_operations compile test likely failed!”
25 Jan 13:20:30 akmodsbuild: In file included from /tmp/akmodsbuild.wM6c53eW/BUILD/nvidia-kmod-304.64/_kmod_build_3.7.3-101.fc17.i686/kernel/nv-acpi.c:15:0:
25 Jan 13:20:30 akmodsbuild: /tmp/akmodsbuild.wM6c53eW/BUILD/nvidia-kmod-304.64/_kmod_build_3.7.3-101.fc17.i686/kernel/nv-linux.h: At top level:
25 Jan 13:20:30 akmodsbuild: /tmp/akmodsbuild.wM6c53eW/BUILD/nvidia-kmod-304.64/_kmod_build_3.7.3-101.fc17.i686/kernel/nv-linux.h:135:2: error: #error “struct file_operations compile test likely failed!”
25 Jan 13:20:30 akmodsbuild: In file included from /tmp/akmodsbuild.wM6c53eW/BUILD/nvidia-kmod-304.64/_kmod_build_3.7.3-101.fc17.i686/kernel/nv-acpi.c:15:0:
25 Jan 13:20:30 akmodsbuild: /tmp/akmodsbuild.wM6c53eW/BUILD/nvidia-kmod-304.64/_kmod_build_3.7.3-101.fc17.i686/kernel/nv-linux.h:294:2: error: #error "NV_PCI_DMA_MAPPING_ERROR() undefined!"In file included from /tmp/akmodsbuild.wM6c53eW/BUILD/nvidia-kmod-304.64/_kmod_build_3.7.3-101.fc17.i686/kernel/nv.c:13:0:
25 Jan 13:20:30 akmodsbuild: /tmp/akmodsbuild.wM6c53eW/BUILD/nvidia-kmod-304.64/_kmod_build_3.7.3-101.fc17.i686/kernel/nv-linux.h:294:2: error: #error “NV_PCI_DMA_MAPPING_ERROR() undefined!”
25 Jan 13:20:30 akmodsbuild: /tmp/akmodsbuild.wM6c53eW/BUILD/nvidia-kmod-304.64/_kmod_build_3.7.3-101.fc17.i686/kernel/nv-linux.h:299:4: warning: “NV_ACPI_WALK_NAMESPACE_ARGUMENT_COUNT” is not defined [-Wundef]
25 Jan 13:20:30 akmodsbuild: /tmp/akmodsbuild.wM6c53eW/BUILD/nvidia-kmod-304.64/_kmod_build_3.7.3-101.fc17.i686/kernel/nv-linux.h:301:8: warning: “NV_ACPI_WALK_NAMESPACE_ARGUMENT_COUNT” is not defined [-Wundef]
25 Jan 13:20:30 akmodsbuild: /tmp/akmodsbuild.wM6c53eW/BUILD/nvidia-kmod-304.64/_kmod_build_3.7.3-101.fc17.i686/kernel/nv-linux.h:307:2: error: #error “NV_ACPI_WALK_NAMESPACE_ARGUMENT_COUNT value unrecognized!”
25 Jan 13:20:30 akmodsbuild: /tmp/akmodsbuild.wM6c53eW/BUILD/nvidia-kmod-304.64/_kmod_build_3.7.3-101.fc17.i686/kernel/nv-linux.h:313:4: warning: “NV_ACPI_OS_WAIT_EVENTS_COMPLETE_ARGUMENT_COUNT” is not defined [-Wundef]
25 Jan 13:20:30 akmodsbuild: /tmp/akmodsbuild.wM6c53eW/BUILD/nvidia-kmod-304.64/_kmod_build_3.7.3-101.fc17.i686/kernel/nv-linux.h:316:8: warning: “NV_ACPI_OS_WAIT_EVENTS_COMPLETE_ARGUMENT_COUNT” is not defined [-Wundef]
25 Jan 13:20:30 akmodsbuild:
25 Jan 13:20:30 akmodsbuild: /tmp/akmodsbuild.wM6c53eW/BUILD/nvidia-kmod-304.64/_kmod_build_3.7.3-101.fc17.i686/kernel/nv-linux.h:299:4: warning: “NV_ACPI_WALK_NAMESPACE_ARGUMENT_COUNT” is not defined [-Wundef]
25 Jan 13:20:30 akmodsbuild: /tmp/akmodsbuild.wM6c53eW/BUILD/nvidia-kmod-304.64/_kmod_build_3.7.3-101.fc17.i686/kernel/nv-linux.h:301:8: warning: “NV_ACPI_WALK_NAMESPACE_ARGUMENT_COUNT” is not defined [-Wundef]
25 Jan 13:20:30 akmodsbuild: /tmp/akmodsbuild.wM6c53eW/BUILD/nvidia-kmod-304.64/_kmod_build_3.7.3-101.fc17.i686/kernel/nv-linux.h:307:2: error: #error “NV_ACPI_WALK_NAMESPACE_ARGUMENT_COUNT value unrecognized!”
25 Jan 13:20:30 akmodsbuild: /tmp/akmodsbuild.wM6c53eW/BUILD/nvidia-kmod-304.64/_kmod_build_3.7.3-101.fc17.i686/kernel/nv-linux.h:313:4: warning: “NV_ACPI_OS_WAIT_EVENTS_COMPLETE_ARGUMENT_COUNT” is not defined [-Wundef]
25 Jan 13:20:30 akmodsbuild: /tmp/akmodsbuild.wM6c53eW/BUILD/nvidia-kmod-304.64/_kmod_build_3.7.3-101.fc17.i686/kernel/nv-linux.h:316:8: warning: “NV_ACPI_OS_WAIT_EVENTS_COMPLETE_ARGUMENT_COUNT” is not defined [-Wundef]
25 Jan 13:20:30 akmodsbuild: /tmp/akmodsbuild.wM6c53eW/BUILD/nvidia-kmod-304.64/_kmod_build_3.7.3-101.fc17.i686/kernel/nv-linux.h:815:2: error: #error “NV_KMEM_CACHE_CREATE() undefined (kmem_cache_create() unavailable)!”
25 Jan 13:20:30 akmodsbuild: /tmp/akmodsbuild.wM6c53eW/BUILD/nvidia-kmod-304.64/_kmod_build_3.7.3-101.fc17.i686/kernel/nv-linux.h:874:2: error: #error “NV_VMAP() undefined (vmap() unavailable)!”
25 Jan 13:20:30 akmodsbuild: /tmp/akmodsbuild.wM6c53eW/BUILD/nvidia-kmod-304.64/_kmod_build_3.7.3-101.fc17.i686/kernel/nv-linux.h:815:2: error: #error “NV_KMEM_CACHE_CREATE() undefined (kmem_cache_create() unavailable)!”/tmp/akmodsbuild.wM6c53eW/BUILD/nvidia-kmod-304.64/_kmod_build_3.7.3-101.fc17.i686/kernel/nv-linux.h:946:2: error: #error “NV_SMP_CALL_FUNCTION() undefined (smp_call_function() unavailable)!”
25 Jan 13:20:30 akmodsbuild:
25 Jan 13:20:30 akmodsbuild: /tmp/akmodsbuild.wM6c53eW/BUILD/nvidia-kmod-304.64/_kmod_build_3.7.3-101.fc17.i686/kernel/nv-linux.h:966:2: error: #error “NV_ON_EACH_CPU() undefined (on_each_cpu() unavailable)!”
25 Jan 13:20:30 akmodsbuild: /tmp/akmodsbuild.wM6c53eW/BUILD/nvidia-kmod-304.64/_kmod_build_3.7.3-101.fc17.i686/kernel/nv-linux.h: In function ‘nv_execute_on_all_cpus’:
25 Jan 13:20:30 akmodsbuild: /tmp/akmodsbuild.wM6c53eW/BUILD/nvidia-kmod-304.64/_kmod_build_3.7.3-101.fc17.i686/kernel/nv-linux.h:874:2: error: #error “NV_VMAP() undefined (vmap() unavailable)!”
25 Jan 13:20:30 akmodsbuild: /tmp/akmodsbuild.wM6c53eW/BUILD/nvidia-kmod-304.64/_kmod_build_3.7.3-101.fc17.i686/kernel/nv-linux.h:984:5: error: implicit declaration of function ‘NV_ON_EACH_CPU’ [-Werror=implicit-function-declaration]
25 Jan 13:20:30 akmodsbuild: /tmp/akmodsbuild.wM6c53eW/BUILD/nvidia-kmod-304.64/_kmod_build_3.7.3-101.fc17.i686/kernel/nv-linux.h:946:2: error: #error “NV_SMP_CALL_FUNCTION() undefined (smp_call_function() unavailable)!”
25 Jan 13:20:30 akmodsbuild: /tmp/akmodsbuild.wM6c53eW/BUILD/nvidia-kmod-304.64/_kmod_build_3.7.3-101.fc17.i686/kernel/nv-linux.h:966:2: error: #error “NV_ON_EACH_CPU() undefined (on_each_cpu() unavailable)!”
25 Jan 13:20:30 akmodsbuild: /tmp/akmodsbuild.wM6c53eW/BUILD/nvidia-kmod-304.64/_kmod_build_3.7.3-101.fc17.i686/kernel/nv-linux.h: In function ‘nv_execute_on_all_cpus’:
25 Jan 13:20:30 akmodsbuild: /tmp/akmodsbuild.wM6c53eW/BUILD/nvidia-kmod-304.64/_kmod_build_3.7.3-101.fc17.i686/kernel/nv-linux.h:984:5: error: implicit declaration of function ‘NV_ON_EACH_CPU’ [-Werror=implicit-function-declaration]
25 Jan 13:20:30 akmodsbuild: /tmp/akmodsbuild.wM6c53eW/BUILD/nvidia-kmod-304.64/_kmod_build_3.7.3-101.fc17.i686/kernel/nv-linux.h: At top level:
25 Jan 13:20:30 akmodsbuild: /tmp/akmodsbuild.wM6c53eW/BUILD/nvidia-kmod-304.64/_kmod_build_3.7.3-101.fc17.i686/kernel/nv-linux.h:1243:13: error: conflicting types for ‘pm_message_t’
25 Jan 13:20:30 akmodsbuild: In file included from /usr/src/kernels/3.7.3-101.fc17.i686/arch/x86/include/asm/apic.h:5:0,
25 Jan 13:20:30 akmodsbuild: from /usr/src/kernels/3.7.3-101.fc17.i686/arch/x86/include/asm/smp.h:13,
25 Jan 13:20:30 akmodsbuild: from include/linux/smp.h:38,
25 Jan 13:20:30 akmodsbuild: from include/linux/sched.h:30,
25 Jan 13:20:30 akmodsbuild: from include/linux/utsname.h:5,
25 Jan 13:20:30 akmodsbuild: from /tmp/akmodsbuild.wM6c53eW/BUILD/nvidia-kmod-304.64/_kmod_build_3.7.3-101.fc17.i686/kernel/nv-linux.h:40,
25 Jan 13:20:30 akmodsbuild: from /tmp/akmodsbuild.wM6c53eW/BUILD/nvidia-kmod-304.64/_kmod_build_3.7.3-101.fc17.i686/kernel/nv.c:13:
25 Jan 13:20:30 akmodsbuild: include/linux/pm.h:52:3: note: previous declaration of ‘pm_message_t’ was here
25 Jan 13:20:30 akmodsbuild: /tmp/akmodsbuild.wM6c53eW/BUILD/nvidia-kmod-304.64/_kmod_build_3.7.3-101.fc17.i686/kernel/nv-linux.h: At top level:
25 Jan 13:20:30 akmodsbuild: /tmp/akmodsbuild.wM6c53eW/BUILD/nvidia-kmod-304.64/_kmod_build_3.7.3-101.fc17.i686/kernel/nv-linux.h:1243:13: error: conflicting types for ‘pm_message_t’
25 Jan 13:20:30 akmodsbuild: In file included from /usr/src/kernels/3.7.3-101.fc17.i686/arch/x86/include/asm/apic.h:5:0,
25 Jan 13:20:30 akmodsbuild: from /usr/src/kernels/3.7.3-101.fc17.i686/arch/x86/include/asm/smp.h:13,
25 Jan 13:20:30 akmodsbuild: from include/linux/smp.h:38,
25 Jan 13:20:30 akmodsbuild: from include/linux/sched.h:30,
25 Jan 13:20:30 akmodsbuild: from include/linux/utsname.h:5,
25 Jan 13:20:30 akmodsbuild: from /tmp/akmodsbuild.wM6c53eW/BUILD/nvidia-kmod-304.64/_kmod_build_3.7.3-101.fc17.i686/kernel/nv-linux.h:40,
25 Jan 13:20:30 akmodsbuild: from /tmp/akmodsbuild.wM6c53eW/BUILD/nvidia-kmod-304.64/_kmod_build_3.7.3-101.fc17.i686/kernel/nv-acpi.c:15:
25 Jan 13:20:30 akmodsbuild: include/linux/pm.h:52:3: note: previous declaration of ‘pm_message_t’ was here
25 Jan 13:20:30 akmodsbuild: In file included from /tmp/akmodsbuild.wM6c53eW/BUILD/nvidia-kmod-304.64/_kmod_build_3.7.3-101.fc17.i686/kernel/nv.c:13:0:
25 Jan 13:20:30 akmodsbuild: /tmp/akmodsbuild.wM6c53eW/BUILD/nvidia-kmod-304.64/_kmod_build_3.7.3-101.fc17.i686/kernel/nv-linux.h:1541:6: warning: “NV_INIT_WORK_ARGUMENT_COUNT” is not defined [-Wundef]
25 Jan 13:20:30 akmodsbuild: /tmp/akmodsbuild.wM6c53eW/BUILD/nvidia-kmod-304.64/_kmod_build_3.7.3-101.fc17.i686/kernel/nv-linux.h:1551:8: warning: “NV_INIT_WORK_ARGUMENT_COUNT” is not defined [-Wundef]
25 Jan 13:20:30 akmodsbuild: /tmp/akmodsbuild.wM6c53eW/BUILD/nvidia-kmod-304.64/_kmod_build_3.7.3-101.fc17.i686/kernel/nv-linux.h:1561:2: error: #error “NV_INIT_WORK_ARGUMENT_COUNT value unrecognized!”
25 Jan 13:20:30 akmodsbuild: In file included from /tmp/akmodsbuild.wM6c53eW/BUILD/nvidia-kmod-304.64/_kmod_build_3.7.3-101.fc17.i686/kernel/nv-acpi.c:15:0:
25 Jan 13:20:30 akmodsbuild: /tmp/akmodsbuild.wM6c53eW/BUILD/nvidia-kmod-304.64/_kmod_build_3.7.3-101.fc17.i686/kernel/nv-linux.h:1541:6: warning: “NV_INIT_WORK_ARGUMENT_COUNT” is not defined [-Wundef]
25 Jan 13:20:30 akmodsbuild: /tmp/akmodsbuild.wM6c53eW/BUILD/nvidia-kmod-304.64/_kmod_build_3.7.3-101.fc17.i686/kernel/nv-linux.h:1551:8: warning: “NV_INIT_WORK_ARGUMENT_COUNT” is not defined [-Wundef]
25 Jan 13:20:30 akmodsbuild: /tmp/akmodsbuild.wM6c53eW/BUILD/nvidia-kmod-304.64/_kmod_build_3.7.3-101.fc17.i686/kernel/nv-linux.h:1561:2: error: #error “NV_INIT_WORK_ARGUMENT_COUNT value unrecognized!”
25 Jan 13:20:30 akmodsbuild: In file included from /tmp/akmodsbuild.wM6c53eW/BUILD/nvidia-kmod-304.64/_kmod_build_3.7.3-101.fc17.i686/kernel/nv-linux.h:1763:0,
25 Jan 13:20:30 akmodsbuild: from /tmp/akmodsbuild.wM6c53eW/BUILD/nvidia-kmod-304.64/_kmod_build_3.7.3-101.fc17.i686/kernel/nv.c:13:
25 Jan 13:20:30 akmodsbuild: /tmp/akmodsbuild.wM6c53eW/BUILD/nvidia-kmod-304.64/_kmod_build_3.7.3-101.fc17.i686/kernel/nv-proto.h:25:29: warning: “NV_INIT_WORK_ARGUMENT_COUNT” is not defined [-Wundef]
25 Jan 13:20:30 akmodsbuild: In file included from /tmp/akmodsbuild.wM6c53eW/BUILD/nvidia-kmod-304.64/_kmod_build_3.7.3-101.fc17.i686/kernel/nv-linux.h:1763:0,
25 Jan 13:20:30 akmodsbuild: from /tmp/akmodsbuild.wM6c53eW/BUILD/nvidia-kmod-304.64/_kmod_build_3.7.3-101.fc17.i686/kernel/nv-acpi.c:15:
25 Jan 13:20:30 akmodsbuild: /tmp/akmodsbuild.wM6c53eW/BUILD/nvidia-kmod-304.64/_kmod_build_3.7.3-101.fc17.i686/kernel/nv-proto.h:25:29: warning: “NV_INIT_WORK_ARGUMENT_COUNT” is not defined [-Wundef]
25 Jan 13:20:30 akmodsbuild: /tmp/akmodsbuild.wM6c53eW/BUILD/nvidia-kmod-304.64/_kmod_build_3.7.3-101.fc17.i686/kernel/nv-acpi.c:61:5: warning: initialization from incompatible pointer type [enabled by default]
25 Jan 13:20:30 akmodsbuild: /tmp/akmodsbuild.wM6c53eW/BUILD/nvidia-kmod-304.64/_kmod_build_3.7.3-101.fc17.i686/kernel/nv-acpi.c:61:5: warning: (near initialization for ‘nv_acpi_driver_template.ids’) [enabled by default]
25 Jan 13:20:30 akmodsbuild: /tmp/akmodsbuild.wM6c53eW/BUILD/nvidia-kmod-304.64/_kmod_build_3.7.3-101.fc17.i686/kernel/nv-acpi.c: In function ‘nv_acpi_add’:
25 Jan 13:20:30 akmodsbuild: /tmp/akmodsbuild.wM6c53eW/BUILD/nvidia-kmod-304.64/_kmod_build_3.7.3-101.fc17.i686/kernel/nv-acpi.c:211:13: warning: passing argument 4 of ‘acpi_evaluate_integer’ from incompatible pointer type [enabled by default]
25 Jan 13:20:30 akmodsbuild: In file included from include/linux/acpi.h:40:0,
25 Jan 13:20:30 akmodsbuild: from include/acpi/acpi_drivers.h:29,
25 Jan 13:20:30 akmodsbuild: from /tmp/akmodsbuild.wM6c53eW/BUILD/nvidia-kmod-304.64/_kmod_build_3.7.3-101.fc17.i686/kernel/nv-linux.h:277,
25 Jan 13:20:30 akmodsbuild: from /tmp/akmodsbuild.wM6c53eW/BUILD/nvidia-kmod-304.64/_kmod_build_3.7.3-101.fc17.i686/kernel/nv-acpi.c:15:
25 Jan 13:20:30 akmodsbuild: include/acpi/acpi_bus.h:45:1: note: expected ‘long long unsigned int *’ but argument is of type ‘nv_acpi_integer_t *’
25 Jan 13:20:30 akmodsbuild: /tmp/akmodsbuild.wM6c53eW/BUILD/nvidia-kmod-304.64/_kmod_build_3.7.3-101.fc17.i686/kernel/nv-acpi.c: In function ‘nv_acpi_event’:
25 Jan 13:20:30 akmodsbuild: /tmp/akmodsbuild.wM6c53eW/BUILD/nvidia-kmod-304.64/_kmod_build_3.7.3-101.fc17.i686/kernel/nv-acpi.c:359:48: warning: passing argument 4 of ‘acpi_evaluate_integer’ from incompatible pointer type [enabled by default]
25 Jan 13:20:30 akmodsbuild: In file included from include/linux/acpi.h:40:0,
25 Jan 13:20:30 akmodsbuild: from include/acpi/acpi_drivers.h:29,
25 Jan 13:20:30 akmodsbuild: from /tmp/akmodsbuild.wM6c53eW/BUILD/nvidia-kmod-304.64/_kmod_build_3.7.3-101.fc17.i686/kernel/nv-linux.h:277,
25 Jan 13:20:30 akmodsbuild: from /tmp/akmodsbuild.wM6c53eW/BUILD/nvidia-kmod-304.64/_kmod_build_3.7.3-101.fc17.i686/kernel/nv-acpi.c:15:
25 Jan 13:20:30 akmodsbuild: include/acpi/acpi_bus.h:45:1: note: expected ‘long long unsigned int *’ but argument is of type ‘nv_acpi_integer_t *’
25 Jan 13:20:30 akmodsbuild: /tmp/akmodsbuild.wM6c53eW/BUILD/nvidia-kmod-304.64/_kmod_build_3.7.3-101.fc17.i686/kernel/nv.c:368:5: warning: initialization from incompatible pointer type [enabled by default]
25 Jan 13:20:30 akmodsbuild: /tmp/akmodsbuild.wM6c53eW/BUILD/nvidia-kmod-304.64/_kmod_build_3.7.3-101.fc17.i686/kernel/nv.c:368:5: warning: (near initialization for ‘nv_pci_driver.suspend’) [enabled by default]
25 Jan 13:20:30 akmodsbuild: /tmp/akmodsbuild.wM6c53eW/BUILD/nvidia-kmod-304.64/_kmod_build_3.7.3-101.fc17.i686/kernel/nv-acpi.c: In function ‘nv_acpi_methods_init’:
25 Jan 13:20:30 akmodsbuild: /tmp/akmodsbuild.wM6c53eW/BUILD/nvidia-kmod-304.64/_kmod_build_3.7.3-101.fc17.i686/kernel/nv-acpi.c:539:5: error: implicit declaration of function ‘NV_ACPI_WALK_NAMESPACE’ [-Werror=implicit-function-declaration]
25 Jan 13:20:30 akmodsbuild: /tmp/akmodsbuild.wM6c53eW/BUILD/nvidia-kmod-304.64/_kmod_build_3.7.3-101.fc17.i686/kernel/nv.c: In function ‘nvidia_init_module’:
25 Jan 13:20:30 akmodsbuild: /tmp/akmodsbuild.wM6c53eW/BUILD/nvidia-kmod-304.64/_kmod_build_3.7.3-101.fc17.i686/kernel/nv.c:869:5: error: implicit declaration of function ‘NV_KMEM_CACHE_CREATE’ [-Werror=implicit-function-declaration]
25 Jan 13:20:30 akmodsbuild: /tmp/akmodsbuild.wM6c53eW/BUILD/nvidia-kmod-304.64/_kmod_build_3.7.3-101.fc17.i686/kernel/nv.c:869:58: error: expected expression before ‘nv_stack_t’
25 Jan 13:20:30 akmodsbuild: /tmp/akmodsbuild.wM6c53eW/BUILD/nvidia-kmod-304.64/_kmod_build_3.7.3-101.fc17.i686/kernel/nv.c:879:9: error: implicit declaration of function ‘NV_KMEM_CACHE_DESTROY’ [-Werror=implicit-function-declaration]
25 Jan 13:20:30 akmodsbuild: /tmp/akmodsbuild.wM6c53eW/BUILD/nvidia-kmod-304.64/_kmod_build_3.7.3-101.fc17.i686/kernel/nv.c:984:54: error: expected expression before ‘nv_pte_t’
25 Jan 13:20:30 akmodsbuild: /tmp/akmodsbuild.wM6c53eW/BUILD/nvidia-kmod-304.64/_kmod_build_3.7.3-101.fc17.i686/kernel/nv.c:993:13: error: expected expression before ‘nvidia_p2p_page_t’
25 Jan 13:20:30 akmodsbuild: /tmp/akmodsbuild.wM6c53eW/BUILD/nvidia-kmod-304.64/_kmod_build_3.7.3-101.fc17.i686/kernel/nv-acpi.c: In function ‘nv_acpi_ddc_method’:
25 Jan 13:20:30 akmodsbuild: /tmp/akmodsbuild.wM6c53eW/BUILD/nvidia-kmod-304.64/_kmod_build_3.7.3-101.fc17.i686/kernel/nv-acpi.c:1139:9: warning: passing argument 4 of ‘acpi_evaluate_integer’ from incompatible pointer type [enabled by default]
25 Jan 13:20:30 akmodsbuild: In file included from include/linux/acpi.h:40:0,
25 Jan 13:20:30 akmodsbuild: from include/acpi/acpi_drivers.h:29,
25 Jan 13:20:30 akmodsbuild: from /tmp/akmodsbuild.wM6c53eW/BUILD/nvidia-kmod-304.64/_kmod_build_3.7.3-101.fc17.i686/kernel/nv-linux.h:277,
25 Jan 13:20:30 akmodsbuild: from /tmp/akmodsbuild.wM6c53eW/BUILD/nvidia-kmod-304.64/_kmod_build_3.7.3-101.fc17.i686/kernel/nv-acpi.c:15:
25 Jan 13:20:30 akmodsbuild: include/acpi/acpi_bus.h:45:1: note: expected ‘long long unsigned int *’ but argument is of type ‘nv_acpi_integer_t
25 Jan 13:20:30 akmodsbuild: /tmp/akmodsbuild.wM6c53eW/BUILD/nvidia-kmod-304.64/_kmod_build_3.7.3-101.fc17.i686/kernel/nv.c: In function ‘nv_kern_open’:
25 Jan 13:20:30 akmodsbuild: /tmp/akmodsbuild.wM6c53eW/BUILD/nvidia-kmod-304.64/_kmod_build_3.7.3-101.fc17.i686/kernel/nv.c:1535:30: warning: passing argument 2 of ‘request_irq’ from incompatible pointer type [enabled by default]
25 Jan 13:20:30 akmodsbuild: In file included from /tmp/akmodsbuild.wM6c53eW/BUILD/nvidia-kmod-304.64/_kmod_build_3.7.3-101.fc17.i686/kernel/nv-linux.h:112:0,
25 Jan 13:20:30 akmodsbuild: from /tmp/akmodsbuild.wM6c53eW/BUILD/nvidia-kmod-304.64/_kmod_build_3.7.3-101.fc17.i686/kernel/nv.c:13:
25 Jan 13:20:30 akmodsbuild: include/linux/interrupt.h:130:1: note: expected ‘irq_handler_t’ but argument is of type 'enum irqreturn_t (
)(int, void *, struct pt_regs )’
25 Jan 13:20:30 akmodsbuild: /tmp/akmodsbuild.wM6c53eW/BUILD/nvidia-kmod-304.64/_kmod_build_3.7.3-101.fc17.i686/kernel/nv.c:1539:17: error: implicit declaration of function ‘NV_TASKQUEUE_INIT’ [-Werror=implicit-function-declaration]
25 Jan 13:20:30 akmodsbuild: /tmp/akmodsbuild.wM6c53eW/BUILD/nvidia-kmod-304.64/_kmod_build_3.7.3-101.fc17.i686/kernel/nv.c:1551:25: warning: passing argument 2 of ‘request_irq’ from incompatible pointer type [enabled by default]
25 Jan 13:20:30 akmodsbuild: In file included from /tmp/akmodsbuild.wM6c53eW/BUILD/nvidia-kmod-304.64/_kmod_build_3.7.3-101.fc17.i686/kernel/nv-linux.h:112:0,
25 Jan 13:20:30 akmodsbuild: from /tmp/akmodsbuild.wM6c53eW/BUILD/nvidia-kmod-304.64/_kmod_build_3.7.3-101.fc17.i686/kernel/nv.c:13:
25 Jan 13:20:30 akmodsbuild: include/linux/interrupt.h:130:1: note: expected ‘irq_handler_t’ but argument is of type 'enum irqreturn_t (
)(int, void *, struct pt_regs *)’
25 Jan 13:20:30 akmodsbuild: /tmp/akmodsbuild.wM6c53eW/BUILD/nvidia-kmod-304.64/_kmod_build_3.7.3-101.fc17.i686/kernel/nv.c: In function ‘nv_agp_init’:
25 Jan 13:20:30 akmodsbuild: /tmp/akmodsbuild.wM6c53eW/BUILD/nvidia-kmod-304.64/_kmod_build_3.7.3-101.fc17.i686/kernel/nv.c:2911:6: warning: “NV_AGP_BACKEND_ACQUIRE_ARGUMENT_COUNT” is not defined [-Wundef]
25 Jan 13:20:30 akmodsbuild: /tmp/akmodsbuild.wM6c53eW/BUILD/nvidia-kmod-304.64/_kmod_build_3.7.3-101.fc17.i686/kernel/nv.c:2928:9: error: too few arguments to function ‘agp_backend_acquire’
25 Jan 13:20:30 akmodsbuild: In file included from /tmp/akmodsbuild.wM6c53eW/BUILD/nvidia-kmod-304.64/_kmod_build_3.7.3-101.fc17.i686/kernel/nv-linux.h:249:0,
25 Jan 13:20:30 akmodsbuild: from /tmp/akmodsbuild.wM6c53eW/BUILD/nvidia-kmod-304.64/_kmod_build_3.7.3-101.fc17.i686/kernel/nv.c:13:
25 Jan 13:20:30 akmodsbuild: include/linux/agp_backend.h:106:32: note: declared here
25 Jan 13:20:30 akmodsbuild: /tmp/akmodsbuild.wM6c53eW/BUILD/nvidia-kmod-304.64/_kmod_build_3.7.3-101.fc17.i686/kernel/nv.c:2930:13: error: too few arguments to function ‘agp_backend_release’
25 Jan 13:20:30 akmodsbuild: In file included from /tmp/akmodsbuild.wM6c53eW/BUILD/nvidia-kmod-304.64/_kmod_build_3.7.3-101.fc17.i686/kernel/nv-linux.h:249:0,
25 Jan 13:20:30 akmodsbuild: from /tmp/akmodsbuild.wM6c53eW/BUILD/nvidia-kmod-304.64/_kmod_build_3.7.3-101.fc17.i686/kernel/nv.c:13:
25 Jan 13:20:30 akmodsbuild: include/linux/agp_backend.h:107:13: note: declared here
25 Jan 13:20:30 akmodsbuild: cc1: some warnings being treated as errors
25 Jan 13:20:30 akmodsbuild: make[3]: *** [/tmp/akmodsbuild.wM6c53eW/BUILD/nvidia-kmod-304.64/_kmod_build_3.7.3-101.fc17.i686/kernel/nv-acpi.o] Error 1
25 Jan 13:20:30 akmodsbuild: make[3]: *** Waiting for unfinished jobs…
25 Jan 13:20:30 akmodsbuild: cc1: some warnings being treated as errors
25 Jan 13:20:30 akmodsbuild: make[3]: *** [/tmp/akmodsbuild.wM6c53eW/BUILD/nvidia-kmod-304.64/_kmod_build_3.7.3-101.fc17.i686/kernel/nv.o] Error 1
25 Jan 13:20:30 akmodsbuild: make[2]: *** [module/tmp/akmodsbuild.wM6c53eW/BUILD/nvidia-kmod-304.64/_kmod_build_3.7.3-101.fc17.i686/kernel] Error 2
25 Jan 13:20:30 akmodsbuild: NVIDIA: left KBUILD.
25 Jan 13:20:30 akmodsbuild: nvidia.ko failed to build!
25 Jan 13:20:30 akmodsbuild: make[1]: *** [module] Error 1
25 Jan 13:20:30 akmodsbuild: make: *** [module] Error 2
25 Jan 13:20:30 akmodsbuild: error: Bad exit status from /var/tmp/rpm-tmp.CaurXN (%build)
25 Jan 13:20:30 akmodsbuild:
25 Jan 13:20:30 akmodsbuild:
25 Jan 13:20:30 akmodsbuild: RPM build errors:
25 Jan 13:20:30 akmodsbuild: user mockbuild does not exist - using root
25 Jan 13:20:30 akmodsbuild: group mockbuild does not exist - using root
25 Jan 13:20:30 akmodsbuild: user mockbuild does not exist - using root
25 Jan 13:20:30 akmodsbuild: group mockbuild does not exist - using root
25 Jan 13:20:30 akmodsbuild: user mockbuild does not exist - using root
25 Jan 13:20:30 akmodsbuild: group mockbuild does not exist - using root
25 Jan 13:20:30 akmodsbuild: Bad exit status from /var/tmp/rpm-tmp.CaurXN (%build)
25 Jan 13:20:30 akmodsbuild:
25 Jan 13:20:30 akmods: Building rpms failed; see /var/cache/akmods/nvidia/304.64-1-for-3.7.3-101.fc17.i686.failed.log for details