Installation of target components failed using sdkmanager-0.9.8.2002 (Solved)

Hello,

I received an email saying that the version 1.0 of DRIVE software is released. Therefore the only zip file i was able to download from https://developer.nvidia.com/nvidia-drive-downloads is sdkmanager-0.9.8.2002.zip (without user guide). After unzipping i launched the SDkmanager through the console on my host machine. The installation on host is successful but the “target component” failed, please find attached the log file.

Before the installation i removed all the USB connectors and plugged an USB cable from debug port to host. I also retried after restarting my computer.

Thanks in advance,
Adrien
SDKM_logs_DRIVE_OS_5.0.10.3_SDK_with_DriveWorks_Linux_10022018_1344.zip (244 KB)

Hi AdrienBonefons,

Could you try to run sdkmanager again? (remove sdkm_downloads folder)
We can download all target component without fail.

Thanks!

Dear Carolyuu,

I deleted the folder, restarted my computer and redownloaded the SDK installation files but i’m still not able to create OS image for OSS and NV, please find attached the new logfile.

This being said, i can see the download is completed and verification doesn’t show error. The failure arrives at around 3% of the loading. I can see gcc-multilib isn’t properly installed according to the log.

Thanks,
Adrien
SDKM_logs_DRIVE_OS_5.0.10.3_SDK_with_DriveWorks_Linux_10042018_0943.zip (386 KB)

Hi,

Based on your log, this error occurs when login the download website.

2018-10-02 10:22:34.632 - info: manifest: {"name":"sdkmanager","version":"0.9.8","revision":"0","buildNumber":"2002","release":false}
2018-10-02 10:22:34.632 - info: Setting GA parameters: title SDK Manager - Beta 0.9.8.2002 version 0.9.8 dev: 0 internal: false offline false
2018-10-02 10:22:34.633 - info: mainRepoUrl: https://developer.download.nvidia.com/sdkmanager/sdkm-config/main/sdkml1_repo.json
2018-10-02 10:22:34.633 - info: logging in with l1 url: https://developer.download.nvidia.com/sdkmanager/sdkm-config/main/sdkml1_repo.json
2018-10-02 10:22:47.314 - info: Logging in with pid login method…
2018-10-02 10:22:47.316 - info: pid signIn starts...
2018-10-02 10:22:47.343 - error: request timed out or no connection. Error from pid: Error: getaddrinfo EAI_AGAIN nvonlineapi.nvidia.com:443
2018-10-02 10:22:47.344 - error: pid signIn error, took 0.028s. err: connectivity_error
2018-10-02 10:22:47.344 - error: pid sign in error:  connectivity_error

To narrow down the issue, could you help to do some experiments?
1. Verify your network functionality
2. Check if you can access this link by the browser directly.

Thanks.

Dear AastaLLL,

It seems that the log file is filled up with all the previous tries… So the error you pointed is resolved but the gcc-multilib problem still crash the installation.

Please find attached the log file of the last attempt i’ve done (without the previous attempt to make it understandable)

Concerning the Network, i’m able to access your link with my custom network but to be sure i used a regular network access.

Thanks

sdkm.log (100 KB)

Hi,

Sorry for the late reply.

Could you try to install it on a clean setup?
An unfinished installation will lock the package management and may cause an error in the following installation.

Thanks.

Dear AastaLL,

I reinstalled Ubuntu 16.04LTS yesterday, erasing all my data that i previously saved and installed the new version of DriveWorks at the first attempt! Maybe a file have been corrupted on my previous setup…

So if you have the same issue i advise you to format you host, this won’t take long (30min~ in my case)

Thanks

After having reinstalled all the required components to compile i still not able to build the default samples:

In file included from /usr/local/driveworks-1.2/targets/x86_64-Linux/include/dw/core/Types.h:53:0,
                 from /usr/local/driveworks-1.2/targets/x86_64-Linux/include/dw/image/Image.h:51,
                 from /usr/local/driveworks/samples/src/image/image_common/utils.hpp:34,
                 from /usr/local/driveworks/samples/src/image/image_common/utils.cu:31:
/usr/local/cuda/include/host_defines.h:54:2: error: #warning "host_defines.h is an internal header file and must not be used directly.  This file will be removed in a future CUDA release.  Please use cuda_runtime_api.h or cuda_runtime.h instead." [-Werror=cpp]
 #warning "host_defines.h is an internal header file and must not be used directly.  This file will be removed in a future CUDA release.  Please use cuda_runtime_api.h or cuda_runtime.h instead."
  ^
In file included from /usr/local/driveworks-1.2/targets/x86_64-Linux/include/dw/core/Types.h:53:0,
                 from /usr/local/driveworks/samples/src/stereo/stereo_common/utils.hpp:34,
                 from /usr/local/driveworks/samples/src/stereo/stereo_common/utils.cu:31:
/usr/local/cuda/include/host_defines.h:54:2: error: #warning "host_defines.h is an internal header file and must not be used directly.  This file will be removed in a future CUDA release.  Please use cuda_runtime_api.h or cuda_runtime.h instead." [-Werror=cpp]
 #warning "host_defines.h is an internal header file and must not be used directly.  This file will be removed in a future CUDA release.  Please use cuda_runtime_api.h or cuda_runtime.h instead."
  ^
cc1plus: all warnings being treated as errors
CMake Error at gen_utils.cu.o_deps.cmake:196 (message):
  Error generating
  /home/nvidia/Documents/build/src/stereo/stereo_common/CMakeFiles/dw_samples_stereo_common.dir//gen_utils.cu.o.NVCC-depend


CMakeFiles/update_cuda_deps.dir/build.make:69: recipe for target 'src/stereo/stereo_common/CMakeFiles/dw_samples_stereo_common.dir/gen_utils.cu.o.depend.stamp' failed
make[2]: *** [src/stereo/stereo_common/CMakeFiles/dw_samples_stereo_common.dir/gen_utils.cu.o.depend.stamp] Error 1
make[2]: *** Waiting for unfinished jobs....
cc1plus: all warnings being treated as errors
CMake Error at gen_utils.cu.o_deps.cmake:196 (message):
  Error generating
  /home/nvidia/Documents/build/src/image/image_common/CMakeFiles/dw_samples_image_common.dir//gen_utils.cu.o.NVCC-depend


CMakeFiles/update_cuda_deps.dir/build.make:63: recipe for target 'src/image/image_common/CMakeFiles/dw_samples_image_common.dir/gen_utils.cu.o.depend.stamp' failed
make[2]: *** [src/image/image_common/CMakeFiles/dw_samples_image_common.dir/gen_utils.cu.o.depend.stamp] Error 1
CMakeFiles/Makefile2:67: recipe for target 'CMakeFiles/update_cuda_deps.dir/all' failed
make[1]: *** [CMakeFiles/update_cuda_deps.dir/all] Error 2

what am i supposed to do?

Thanks in avance,
Adrien

Dear AdrienBonefons,
Can you check the prerequisites(file:///usr/local/driveworks-1.2/doc/nvdwx_html/dwx_devguide_getting_started.html). Make sure you have installed NVIDIA r396 drivers which is required for CUDA 9.2

Dear SivaRamaKrishma,

I also have an issue with the driver, here is my configuration: driver 396.26 and the CUDA version installed is release 10.0, V10.0.130, this CUDA version have been installed from https://developer.nvidia.com/cuda-downloads .

I’m still having errors while compiling the nvidia samples and i’m pretty sure the issue comes from a bad configuration of the .profile file. Here is what’s printed:

[  1%] Built target lodepng-src
[  2%] Dependencies for /home/nvidia/Documents/build/src/stereo/stereo_common/CMakeFiles/dw_samples_stereo_common.dir//gen_utils.cu.o.depend.stamp
[  4%] Built target glew-src
[ 15%] Built target glfw
[ 16%] Building CXX object src/framework/CMakeFiles/dw_samples_framework.dir/MathUtils.cpp.o
[ 17%] Building CXX object src/framework/CMakeFiles/dw_samples_framework.dir/Grid.cpp.o
[ 17%] Building CXX object src/framework/CMakeFiles/dw_samples_framework.dir/MouseView3D.cpp.o
[ 18%] Building CXX object src/framework/CMakeFiles/dw_samples_framework.dir/DriveWorksSample.cpp.o
[ 18%] Building CXX object src/framework/CMakeFiles/dw_samples_framework.dir/SimpleCamera.cpp.o
[ 19%] Building CXX object src/framework/CMakeFiles/dw_samples_framework.dir/Log.cpp.o
[ 20%] Building CXX object src/framework/CMakeFiles/dw_samples_framework.dir/ProfilerCUDA.cpp.o
[ 21%] Building CXX object src/framework/CMakeFiles/dw_samples_framework.dir/ScreenshotHelper.cpp.o
[ 21%] Building CXX object src/framework/CMakeFiles/dw_samples_framework.dir/SampleFramework.cpp.o
[ 22%] Building CXX object src/framework/CMakeFiles/dw_samples_framework.dir/SimpleRecordingPlayer.cpp.o
[ 22%] Building CXX object src/framework/CMakeFiles/dw_samples_framework.dir/RenderUtils.cpp.o
[ 23%] Building CXX object src/framework/CMakeFiles/dw_samples_framework.dir/SimpleRenderer.cpp.o
In file included from /usr/local/driveworks-1.2/targets/x86_64-Linux/include/dw/core/Types.h:53:0,
                 from /usr/local/driveworks/samples/src/framework/RenderUtils.hpp:34,
                 from /usr/local/driveworks/samples/src/framework/RenderUtils.cpp:1:
/usr/local/cuda/include/host_defines.h:54:2: error: #warning "host_defines.h is an internal header file and must not be used directly.  This file will be removed in a future CUDA release.  Please use cuda_runtime_api.h or cuda_runtime.h instead." [-Werror=cpp]
 #warning "host_defines.h is an internal header file and must not be used directly.  This file will be removed in a future CUDA release.  Please use cuda_runtime_api.h or cuda_runtime.h instead."
  ^
In file included from /usr/local/driveworks-1.2/targets/x86_64-Linux/include/dw/core/Types.h:53:0,
                 from /usr/local/driveworks-1.2/targets/x86_64-Linux/include/dw/core/Context.h:49,
                 from /usr/local/driveworks/samples/src/framework/SimpleRecordingPlayer.hpp:35,
                 from /usr/local/driveworks/samples/src/framework/SimpleRecordingPlayer.cpp:31:
/usr/local/cuda/include/host_defines.h:54:2: error: #warning "host_defines.h is an internal header file and must not be used directly.  This file will be removed in a future CUDA release.  Please use cuda_runtime_api.h or cuda_runtime.h instead." [-Werror=cpp]
 #warning "host_defines.h is an internal header file and must not be used directly.  This file will be removed in a future CUDA release.  Please use cuda_runtime_api.h or cuda_runtime.h instead."
  ^
In file included from /usr/local/driveworks-1.2/targets/x86_64-Linux/include/dw/core/Types.h:53:0,
                 from /usr/local/driveworks-1.2/targets/x86_64-Linux/include/dw/core/Context.h:49,
                 from /usr/local/driveworks/samples/src/framework/SimpleCamera.hpp:35,
                 from /usr/local/driveworks/samples/src/framework/SimpleCamera.cpp:31:
/usr/local/cuda/include/host_defines.h:54:2: error: #warning "host_defines.h is an internal header file and must not be used directly.  This file will be removed in a future CUDA release.  Please use cuda_runtime_api.h or cuda_runtime.h instead." [-Werror=cpp]
 #warning "host_defines.h is an internal header file and must not be used directly.  This file will be removed in a future CUDA release.  Please use cuda_runtime_api.h or cuda_runtime.h instead."
  ^
In file included from /usr/local/driveworks-1.2/targets/x86_64-Linux/include/dw/core/Types.h:53:0,
                 from /usr/local/driveworks-1.2/targets/x86_64-Linux/include/dw/renderer/Renderer.h:51,
                 from /usr/local/driveworks/samples/src/framework/Grid.hpp:35,
                 from /usr/local/driveworks/samples/src/framework/Grid.cpp:31:
/usr/local/cuda/include/host_defines.h:54:2: error: #warning "host_defines.h is an internal header file and must not be used directly.  This file will be removed in a future CUDA release.  Please use cuda_runtime_api.h or cuda_runtime.h instead." [-Werror=cpp]
 #warning "host_defines.h is an internal header file and must not be used directly.  This file will be removed in a future CUDA release.  Please use cuda_runtime_api.h or cuda_runtime.h instead."
  ^
In file included from /usr/local/driveworks-1.2/targets/x86_64-Linux/include/dw/core/Types.h:53:0,
                 from /usr/local/driveworks-1.2/targets/x86_64-Linux/include/dw/core/Logger.h:51,
                 from /usr/local/driveworks/samples/src/framework/Log.hpp:35,
                 from /usr/local/driveworks/samples/src/framework/Log.cpp:33:
/usr/local/cuda/include/host_defines.h:54:2: error: #warning "host_defines.h is an internal header file and must not be used directly.  This file will be removed in a future CUDA release.  Please use cuda_runtime_api.h or cuda_runtime.h instead." [-Werror=cpp]
 #warning "host_defines.h is an internal header file and must not be used directly.  This file will be removed in a future CUDA release.  Please use cuda_runtime_api.h or cuda_runtime.h instead."
  ^
In file included from /usr/local/driveworks-1.2/targets/x86_64-Linux/include/dw/core/Types.h:53:0,
                 from /usr/local/driveworks-1.2/targets/x86_64-Linux/include/dw/image/Image.h:51,
                 from /usr/local/driveworks/samples/src/framework/ScreenshotHelper.hpp:38,
                 from /usr/local/driveworks/samples/src/framework/ScreenshotHelper.cpp:31:
/usr/local/cuda/include/host_defines.h:54:2: error: #warning "host_defines.h is an internal header file and must not be used directly.  This file will be removed in a future CUDA release.  Please use cuda_runtime_api.h or cuda_runtime.h instead." [-Werror=cpp]
 #warning "host_defines.h is an internal header file and must not be used directly.  This file will be removed in a future CUDA release.  Please use cuda_runtime_api.h or cuda_runtime.h instead."
  ^
In file included from /usr/local/driveworks-1.2/targets/x86_64-Linux/include/dw/core/Types.h:53:0,
                 from /usr/local/driveworks-1.2/targets/x86_64-Linux/include/dw/renderer/Renderer.h:51,
                 from /usr/local/driveworks/samples/src/framework/SimpleRenderer.hpp:14,
                 from /usr/local/driveworks/samples/src/framework/SimpleRenderer.cpp:31:
/usr/local/cuda/include/host_defines.h:54:2: error: #warning "host_defines.h is an internal header file and must not be used directly.  This file will be removed in a future CUDA release.  Please use cuda_runtime_api.h or cuda_runtime.h instead." [-Werror=cpp]
 #warning "host_defines.h is an internal header file and must not be used directly.  This file will be removed in a future CUDA release.  Please use cuda_runtime_api.h or cuda_runtime.h instead."
  ^
In file included from /usr/local/driveworks-1.2/targets/x86_64-Linux/include/dw/core/Types.h:53:0,
                 from /usr/local/driveworks/samples/src/stereo/stereo_common/utils.hpp:34,
                 from /usr/local/driveworks/samples/src/stereo/stereo_common/utils.cu:31:
/usr/local/cuda/include/host_defines.h:54:2: error: #warning "host_defines.h is an internal header file and must not be used directly.  This file will be removed in a future CUDA release.  Please use cuda_runtime_api.h or cuda_runtime.h instead." [-Werror=cpp]
 #warning "host_defines.h is an internal header file and must not be used directly.  This file will be removed in a future CUDA release.  Please use cuda_runtime_api.h or cuda_runtime.h instead."
  ^
In file included from /usr/local/driveworks-1.2/targets/x86_64-Linux/include/dw/core/Types.h:53:0,
                 from /usr/local/driveworks/samples/src/framework/ProfilerCUDA.hpp:46,
                 from /usr/local/driveworks/samples/src/framework/ProfilerCUDA.cpp:11:
/usr/local/cuda/include/host_defines.h:54:2: error: #warning "host_defines.h is an internal header file and must not be used directly.  This file will be removed in a future CUDA release.  Please use cuda_runtime_api.h or cuda_runtime.h instead." [-Werror=cpp]
 #warning "host_defines.h is an internal header file and must not be used directly.  This file will be removed in a future CUDA release.  Please use cuda_runtime_api.h or cuda_runtime.h instead."
  ^
In file included from /usr/local/driveworks-1.2/targets/x86_64-Linux/include/dw/core/Types.h:53:0,
                 from /usr/local/driveworks/samples/src/framework/ProfilerCUDA.hpp:46,
                 from /usr/local/driveworks/samples/src/framework/DriveWorksSample.hpp:44,
                 from /usr/local/driveworks/samples/src/framework/DriveWorksSample.cpp:31:
/usr/local/cuda/include/host_defines.h:54:2: error: #warning "host_defines.h is an internal header file and must not be used directly.  This file will be removed in a future CUDA release.  Please use cuda_runtime_api.h or cuda_runtime.h instead." [-Werror=cpp]
 #warning "host_defines.h is an internal header file and must not be used directly.  This file will be removed in a future CUDA release.  Please use cuda_runtime_api.h or cuda_runtime.h instead."
  ^
In file included from /usr/local/driveworks-1.2/targets/x86_64-Linux/include/dw/core/Types.h:53:0,
                 from /usr/local/driveworks/samples/src/framework/MathUtils.hpp:36,
                 from /usr/local/driveworks/samples/src/framework/MathUtils.cpp:31:
/usr/local/cuda/include/host_defines.h:54:2: error: #warning "host_defines.h is an internal header file and must not be used directly.  This file will be removed in a future CUDA release.  Please use cuda_runtime_api.h or cuda_runtime.h instead." [-Werror=cpp]
 #warning "host_defines.h is an internal header file and must not be used directly.  This file will be removed in a future CUDA release.  Please use cuda_runtime_api.h or cuda_runtime.h instead."
  ^
In file included from /usr/local/driveworks-1.2/targets/x86_64-Linux/include/dw/core/Types.h:53:0,
                 from /usr/local/driveworks/samples/src/framework/MathUtils.hpp:36,
                 from /usr/local/driveworks/samples/src/framework/MouseView3D.cpp:34:
/usr/local/cuda/include/host_defines.h:54:2: error: #warning "host_defines.h is an internal header file and must not be used directly.  This file will be removed in a future CUDA release.  Please use cuda_runtime_api.h or cuda_runtime.h instead." [-Werror=cpp]
 #warning "host_defines.h is an internal header file and must not be used directly.  This file will be removed in a future CUDA release.  Please use cuda_runtime_api.h or cuda_runtime.h instead."
  ^
cc1plus: all warnings being treated as errors
cc1plus: all warnings being treated as errors
src/framework/CMakeFiles/dw_samples_framework.dir/build.make:158: recipe for target 'src/framework/CMakeFiles/dw_samples_framework.dir/Grid.cpp.o' failed
make[2]: *** [src/framework/CMakeFiles/dw_samples_framework.dir/Grid.cpp.o] Error 1
make[2]: *** Waiting for unfinished jobs....
CMake Error at gen_utils.cu.o_deps.cmake:196 (message):
  Error generating
  /home/nvidia/Documents/build/src/stereo/stereo_common/CMakeFiles/dw_samples_stereo_common.dir//gen_utils.cu.o.NVCC-depend

CMakeFiles/update_cuda_deps.dir/build.make:62: recipe for target 'src/stereo/stereo_common/CMakeFiles/dw_samples_stereo_common.dir/gen_utils.cu.o.depend.stamp' failed
make[2]: *** [src/stereo/stereo_common/CMakeFiles/dw_samples_stereo_common.dir/gen_utils.cu.o.depend.stamp] Error 1
CMakeFiles/Makefile2:67: recipe for target 'CMakeFiles/update_cuda_deps.dir/all' failed
make[1]: *** [CMakeFiles/update_cuda_deps.dir/all] Error 2
make[1]: *** Waiting for unfinished jobs....
In file included from /usr/local/driveworks-1.2/targets/x86_64-Linux/include/dw/core/Types.h:53:0,
                 from /usr/local/driveworks-1.2/targets/x86_64-Linux/include/dw/core/Logger.h:51,
                 from /usr/local/driveworks/samples/src/framework/Log.hpp:35,
                 from /usr/local/driveworks/samples/src/framework/SampleFramework.hpp:57,
                 from /usr/local/driveworks/samples/src/framework/SampleFramework.cpp:37:
/usr/local/cuda/include/host_defines.h:54:2: error: #warning "host_defines.h is an internal header file and must not be used directly.  This file will be removed in a future CUDA release.  Please use cuda_runtime_api.h or cuda_runtime.h instead." [-Werror=cpp]
 #warning "host_defines.h is an internal header file and must not be used directly.  This file will be removed in a future CUDA release.  Please use cuda_runtime_api.h or cuda_runtime.h instead."
  ^
cc1plus: all warnings being treated as errors
src/framework/CMakeFiles/dw_samples_framework.dir/build.make:254: recipe for target 'src/framework/CMakeFiles/dw_samples_framework.dir/Log.cpp.o' failed
make[2]: *** [src/framework/CMakeFiles/dw_samples_framework.dir/Log.cpp.o] Error 1
cc1plus: all warnings being treated as errors
src/framework/CMakeFiles/dw_samples_framework.dir/build.make:398: recipe for target 'src/framework/CMakeFiles/dw_samples_framework.dir/RenderUtils.cpp.o' failed
make[2]: *** [src/framework/CMakeFiles/dw_samples_framework.dir/RenderUtils.cpp.o] Error 1
cc1plus: all warnings being treated as errors
src/framework/CMakeFiles/dw_samples_framework.dir/build.make:374: recipe for target 'src/framework/CMakeFiles/dw_samples_framework.dir/ScreenshotHelper.cpp.o' failed
make[2]: *** [src/framework/CMakeFiles/dw_samples_framework.dir/ScreenshotHelper.cpp.o] Error 1
cc1plus: all warnings being treated as errors
src/framework/CMakeFiles/dw_samples_framework.dir/build.make:62: recipe for target 'src/framework/CMakeFiles/dw_samples_framework.dir/SampleFramework.cpp.o' failed
make[2]: *** [src/framework/CMakeFiles/dw_samples_framework.dir/SampleFramework.cpp.o] Error 1
cc1plus: all warnings being treated as errors
cc1plus: all warnings being treated as errors
src/framework/CMakeFiles/dw_samples_framework.dir/build.make:206: recipe for target 'src/framework/CMakeFiles/dw_samples_framework.dir/MathUtils.cpp.o' failed
make[2]: *** [src/framework/CMakeFiles/dw_samples_framework.dir/MathUtils.cpp.o] Error 1
src/framework/CMakeFiles/dw_samples_framework.dir/build.make:230: recipe for target 'src/framework/CMakeFiles/dw_samples_framework.dir/MouseView3D.cpp.o' failed
make[2]: *** [src/framework/CMakeFiles/dw_samples_framework.dir/MouseView3D.cpp.o] Error 1
cc1plus: all warnings being treated as errors
src/framework/CMakeFiles/dw_samples_framework.dir/build.make:350: recipe for target 'src/framework/CMakeFiles/dw_samples_framework.dir/SimpleRecordingPlayer.cpp.o' failed
make[2]: *** [src/framework/CMakeFiles/dw_samples_framework.dir/SimpleRecordingPlayer.cpp.o] Error 1
cc1plus: all warnings being treated as errors
src/framework/CMakeFiles/dw_samples_framework.dir/build.make:302: recipe for target 'src/framework/CMakeFiles/dw_samples_framework.dir/SimpleCamera.cpp.o' failed
make[2]: *** [src/framework/CMakeFiles/dw_samples_framework.dir/SimpleCamera.cpp.o] Error 1
cc1plus: all warnings being treated as errors
src/framework/CMakeFiles/dw_samples_framework.dir/build.make:278: recipe for target 'src/framework/CMakeFiles/dw_samples_framework.dir/ProfilerCUDA.cpp.o' failed
make[2]: *** [src/framework/CMakeFiles/dw_samples_framework.dir/ProfilerCUDA.cpp.o] Error 1
cc1plus: all warnings being treated as errors
src/framework/CMakeFiles/dw_samples_framework.dir/build.make:326: recipe for target 'src/framework/CMakeFiles/dw_samples_framework.dir/SimpleRenderer.cpp.o' failed
make[2]: *** [src/framework/CMakeFiles/dw_samples_framework.dir/SimpleRenderer.cpp.o] Error 1
cc1plus: all warnings being treated as errors
src/framework/CMakeFiles/dw_samples_framework.dir/build.make:86: recipe for target 'src/framework/CMakeFiles/dw_samples_framework.dir/DriveWorksSample.cpp.o' failed
make[2]: *** [src/framework/CMakeFiles/dw_samples_framework.dir/DriveWorksSample.cpp.o] Error 1
CMakeFiles/Makefile2:325: recipe for target 'src/framework/CMakeFiles/dw_samples_framework.dir/all' failed
make[1]: *** [src/framework/CMakeFiles/dw_samples_framework.dir/all] Error 2
Makefile:127: recipe for target 'all' failed

Could you remind me what is the exact code i have to put in .profile?

Thanks

Dear AdrienBonefons,
It looks like you have multiple CUDA versions are installed on machine. Can you please check which CUDA version is picked by Driveworks. It should use CUDA-9.2. Can you please check Cmake log file.

Since my host is only used for the Drive PX2 i deleted the folder of CUDA 10.0 and uninstalled and then reinstalled the CUDA 9.2 with SDKmanager.

When i compile i have an error using nvcc, a i supposed to use the version 7.5?( version installed with apt install)

Could you als remind me what is the exact code i have to put in .profile?

Thanks

Dear AdrienBonefons,
Nothing is required to change. If you have nvidia-396 drivers and install CUDA using sdkmanager, you should not notice any issues in compiling

OK, i’m able to build the folder samples.

Thanks

Hello,

I have downloaded from https://developer.nvidia.com/nvidia-drive-downloads NVIDIA SDK Manager (sdkmanager-0.9.8.2002) and have tried to install the DRIVE OS 5.0.13.0 QNX PDK for E3550 on VM with Ubuntu 16.04.
However, the installation consistently fails. Moreover, no single file is actually downloaded from nvonlineapi.nvidia.com.
I have verified Internet access from the mentioned VM and I am able to download other (not related to NVIDIA) files.
The logs look as follows:

DETAILS TERMINAL
Component Name:  All
Message Type:  All

Filter text

15:11:13 INFO : null
15:11:22 WARNING : GNU Toolchains : download https://nvonlineapi.nvidia.com/NVOnlineAPI/api/downloadfile?docid=1034487 failed, retrying 1...
15:11:22 WARNING : DRIVE Foundation Packages : download https://nvonlineapi.nvidia.com/NVOnlineAPI/api/downloadfile?docid=1034484 failed, retrying 1...
15:11:22 WARNING : DRIVE Foundation OSS Packages : download https://nvonlineapi.nvidia.com/NVOnlineAPI/api/downloadfile?docid=1034488 failed, retrying 1...
15:11:22 WARNING : GNU Toolchains : download https://nvonlineapi.nvidia.com/NVOnlineAPI/api/downloadfile?docid=1034487 failed, retrying 2...
15:11:23 WARNING : DRIVE Foundation Packages : download https://nvonlineapi.nvidia.com/NVOnlineAPI/api/downloadfile?docid=1034484 failed, retrying 2...
15:11:23 WARNING : DRIVE Foundation OSS Packages : download https://nvonlineapi.nvidia.com/NVOnlineAPI/api/downloadfile?docid=1034488 failed, retrying 2...
15:11:23 ERROR : GNU Toolchains : download 'GNU Toolchains' failure
15:11:23 ERROR : GNU Toolchains : cannot download file https://nvonlineapi.nvidia.com/NVOnlineAPI/api/downloadfile?docid=1034487 with error Error: getaddrinfo ENOTFOUND nvonlineapi.nvidia.com nvonlineapi.nvidia.com:443
15:11:23 ERROR : GNU Toolchains : install 'GNU Toolchains' failure, no file is available to install
15:11:23 ERROR : DRIVE Foundation Packages : download 'DRIVE Foundation Packages' failure
15:11:23 ERROR : DRIVE Foundation Packages : cannot download file https://nvonlineapi.nvidia.com/NVOnlineAPI/api/downloadfile?docid=1034484 with error Error: getaddrinfo ENOTFOUND nvonlineapi.nvidia.com nvonlineapi.nvidia.com:443
15:11:23 ERROR : DRIVE Foundation OSS Packages : download 'DRIVE Foundation OSS Packages' failure
15:11:23 ERROR : DRIVE Foundation OSS Packages : cannot download file https://nvonlineapi.nvidia.com/NVOnlineAPI/api/downloadfile?docid=1034488 with error Error: getaddrinfo ENOTFOUND nvonlineapi.nvidia.com nvonlineapi.nvidia.com:443
15:11:24 WARNING : E3550 specific package : download https://nvonlineapi.nvidia.com/NVOnlineAPI/api/downloadfile?docid=1034489 failed, retrying 1...
15:11:24 WARNING : DRIVE QNX SDK : download https://nvonlineapi.nvidia.com/NVOnlineAPI/api/downloadfile?docid=1034498 failed, retrying 1...
15:11:24 WARNING : DRIVE QNX SDK : download https://nvonlineapi.nvidia.com/NVOnlineAPI/api/downloadfile?docid=1034503 failed, retrying 1...
15:11:24 WARNING : E3550 specific package : download https://nvonlineapi.nvidia.com/NVOnlineAPI/api/downloadfile?docid=1034489 failed, retrying 2...
15:11:24 WARNING : DRIVE QNX SDK : download https://nvonlineapi.nvidia.com/NVOnlineAPI/api/downloadfile?docid=1034498 failed, retrying 2...
15:11:24 WARNING : DRIVE QNX SDK : download https://nvonlineapi.nvidia.com/NVOnlineAPI/api/downloadfile?docid=1034503 failed, retrying 2...
15:11:24 ERROR : E3550 specific package : download 'E3550 specific package' failure
15:11:24 ERROR : E3550 specific package : cannot download file https://nvonlineapi.nvidia.com/NVOnlineAPI/api/downloadfile?docid=1034489 with error Error: getaddrinfo ENOTFOUND nvonlineapi.nvidia.com nvonlineapi.nvidia.com:443
15:11:25 ERROR : DRIVE QNX SDK : download 'DRIVE QNX SDK' failure
15:11:25 ERROR : DRIVE QNX SDK : cannot download file https://nvonlineapi.nvidia.com/NVOnlineAPI/api/downloadfile?docid=1034498 with error Error: getaddrinfo ENOTFOUND nvonlineapi.nvidia.com nvonlineapi.nvidia.com:443
15:11:25 ERROR : DRIVE QNX SDK : download 'DRIVE QNX SDK' failure
15:11:25 ERROR : DRIVE QNX SDK : cannot download file https://nvonlineapi.nvidia.com/NVOnlineAPI/api/downloadfile?docid=1034498 with error Error: getaddrinfo ENOTFOUND nvonlineapi.nvidia.com nvonlineapi.nvidia.com:443
15:11:26 WARNING : CUDA on Target : download https://nvonlineapi.nvidia.com/NVOnlineAPI/api/downloadfile?docid=1034494 failed, retrying 1...
15:11:26 WARNING : cuDNN on Target : download https://nvonlineapi.nvidia.com/NVOnlineAPI/api/downloadfile?docid=1034497 failed, retrying 1...
15:11:26 WARNING : TensorRT on Target : download https://nvonlineapi.nvidia.com/NVOnlineAPI/api/downloadfile?docid=1034733 failed, retrying 1...
15:11:26 WARNING : CUDA on Target : download https://nvonlineapi.nvidia.com/NVOnlineAPI/api/downloadfile?docid=1034494 failed, retrying 2...
15:11:26 WARNING : cuDNN on Target : download https://nvonlineapi.nvidia.com/NVOnlineAPI/api/downloadfile?docid=1034497 failed, retrying 2...
15:11:26 WARNING : TensorRT on Target : download https://nvonlineapi.nvidia.com/NVOnlineAPI/api/downloadfile?docid=1034733 failed, retrying 2...
15:11:26 ERROR : CUDA on Target : download 'CUDA on Target' failure
15:11:26 ERROR : CUDA on Target : cannot download file https://nvonlineapi.nvidia.com/NVOnlineAPI/api/downloadfile?docid=1034494 with error Error: getaddrinfo ENOTFOUND nvonlineapi.nvidia.com nvonlineapi.nvidia.com:443
15:11:27 ERROR : cuDNN on Target : download 'cuDNN on Target' failure
15:11:27 ERROR : cuDNN on Target : cannot download file https://nvonlineapi.nvidia.com/NVOnlineAPI/api/downloadfile?docid=1034497 with error Error: getaddrinfo ENOTFOUND nvonlineapi.nvidia.com nvonlineapi.nvidia.com:443
15:11:28 ERROR : TensorRT on Target : download 'TensorRT on Target' failure
15:11:28 ERROR : TensorRT on Target : cannot download file https://nvonlineapi.nvidia.com/NVOnlineAPI/api/downloadfile?docid=1034733 with error Error: getaddrinfo ENOTFOUND nvonlineapi.nvidia.com nvonlineapi.nvidia.com:443
15:11:29 WARNING : DRIVE QNX AURIX UPDATER : download https://nvonlineapi.nvidia.com/NVOnlineAPI/api/downloadfile?docid=1034504 failed, retrying 1...
15:11:29 WARNING : QNX Platform : download https://nvonlineapi.nvidia.com/NVOnlineAPI/api/downloadfile?docid=1034502 failed, retrying 1...
15:11:29 WARNING : DRIVE QNX AURIX UPDATER : download https://nvonlineapi.nvidia.com/NVOnlineAPI/api/downloadfile?docid=1034504 failed, retrying 2...
15:11:29 WARNING : QNX Platform : download https://nvonlineapi.nvidia.com/NVOnlineAPI/api/downloadfile?docid=1034502 failed, retrying 2...
15:11:29 WARNING : DDS : download https://nvonlineapi.nvidia.com/NVOnlineAPI/api/downloadfile?docid=1034490 failed, retrying 1...
15:11:29 ERROR : DRIVE QNX AURIX UPDATER : download 'DRIVE QNX AURIX UPDATER' failure
15:11:29 ERROR : DRIVE QNX AURIX UPDATER : cannot download file https://nvonlineapi.nvidia.com/NVOnlineAPI/api/downloadfile?docid=1034504 with error Error: getaddrinfo ENOTFOUND nvonlineapi.nvidia.com nvonlineapi.nvidia.com:443
15:11:30 ERROR : QNX Platform : download 'QNX Platform' failure
15:11:30 ERROR : QNX Platform : cannot download file https://nvonlineapi.nvidia.com/NVOnlineAPI/api/downloadfile?docid=1034502 with error Error: getaddrinfo ENOTFOUND nvonlineapi.nvidia.com nvonlineapi.nvidia.com:443
15:11:31 WARNING : DDS : download https://nvonlineapi.nvidia.com/NVOnlineAPI/api/downloadfile?docid=1034490 failed, retrying 2...
15:11:31 WARNING : DRIVE Foundation PDK Packages : download https://nvonlineapi.nvidia.com/NVOnlineAPI/api/downloadfile?docid=1034486 failed, retrying 1...
15:11:31 WARNING : DRIVE QNX PDK : download https://nvonlineapi.nvidia.com/NVOnlineAPI/api/downloadfile?docid=1034493 failed, retrying 1...
15:11:31 ERROR : DDS : download 'DDS' failure
15:11:31 ERROR : DDS : cannot download file https://nvonlineapi.nvidia.com/NVOnlineAPI/api/downloadfile?docid=1034490 with error Error: getaddrinfo ENOTFOUND nvonlineapi.nvidia.com nvonlineapi.nvidia.com:443
15:11:32 WARNING : DRIVE Foundation PDK Packages : download https://nvonlineapi.nvidia.com/NVOnlineAPI/api/downloadfile?docid=1034486 failed, retrying 2...
15:11:32 WARNING : DRIVE QNX PDK : download https://nvonlineapi.nvidia.com/NVOnlineAPI/api/downloadfile?docid=1034493 failed, retrying 2...
15:11:32 ERROR : DRIVE Foundation PDK Packages : download 'DRIVE Foundation PDK Packages' failure
15:11:32 ERROR : DRIVE Foundation PDK Packages : cannot download file https://nvonlineapi.nvidia.com/NVOnlineAPI/api/downloadfile?docid=1034486 with error Error: getaddrinfo ENOTFOUND nvonlineapi.nvidia.com nvonlineapi.nvidia.com:443
15:11:33 WARNING : CUDA on Host : download https://nvonlineapi.nvidia.com/NVOnlineAPI/api/downloadfile?docid=1034512 failed, retrying 1...
15:11:33 ERROR : DRIVE QNX PDK : download 'DRIVE QNX PDK' failure
15:11:33 ERROR : DRIVE QNX PDK : cannot download file https://nvonlineapi.nvidia.com/NVOnlineAPI/api/downloadfile?docid=1034493 with error Error: getaddrinfo ENOTFOUND nvonlineapi.nvidia.com nvonlineapi.nvidia.com:443
15:11:34 WARNING : CUDA on Host : download https://nvonlineapi.nvidia.com/NVOnlineAPI/api/downloadfile?docid=1034495 failed, retrying 1...
15:11:34 WARNING : CUDA on Host : download https://nvonlineapi.nvidia.com/NVOnlineAPI/api/downloadfile?docid=1034512 failed, retrying 2...
15:11:34 WARNING : DRIVE OTA PDK : download https://nvonlineapi.nvidia.com/NVOnlineAPI/api/downloadfile?docid=1034501 failed, retrying 1...
15:11:34 WARNING : CUDA on Host : download https://nvonlineapi.nvidia.com/NVOnlineAPI/api/downloadfile?docid=1034495 failed, retrying 2...
15:11:34 ERROR : CUDA on Host : download 'CUDA on Host' failure
15:11:34 ERROR : CUDA on Host : cannot download file https://nvonlineapi.nvidia.com/NVOnlineAPI/api/downloadfile?docid=1034512 with error Error: getaddrinfo ENOTFOUND nvonlineapi.nvidia.com nvonlineapi.nvidia.com:443
15:11:36 WARNING : DRIVE OTA PDK : download https://nvonlineapi.nvidia.com/NVOnlineAPI/api/downloadfile?docid=1034501 failed, retrying 2...
15:11:36 ERROR : CUDA on Host : download 'CUDA on Host' failure
15:11:36 ERROR : CUDA on Host : cannot download file https://nvonlineapi.nvidia.com/NVOnlineAPI/api/downloadfile?docid=1034512 with error Error: getaddrinfo ENOTFOUND nvonlineapi.nvidia.com nvonlineapi.nvidia.com:443
15:11:37 ERROR : DRIVE OTA PDK : download 'DRIVE OTA PDK' failure
15:11:37 ERROR : DRIVE OTA PDK : cannot download file https://nvonlineapi.nvidia.com/NVOnlineAPI/api/downloadfile?docid=1034501 with error Error: getaddrinfo ENOTFOUND nvonlineapi.nvidia.com nvonlineapi.nvidia.com:443
15:11:38 WARNING : cuDNN on Host : download https://nvonlineapi.nvidia.com/NVOnlineAPI/api/downloadfile?docid=1034513 failed, retrying 1...
15:11:38 WARNING : cuDNN on Host : download https://nvonlineapi.nvidia.com/NVOnlineAPI/api/downloadfile?docid=1034513 failed, retrying 2...
15:11:38 WARNING : PerfWorks SDK : download https://nvonlineapi.nvidia.com/NVOnlineAPI/api/downloadfile?docid=1034509 failed, retrying 1...
15:11:38 WARNING : NVIDIA Nsight Systems : download https://nvonlineapi.nvidia.com/NVOnlineAPI/api/downloadfile?docid=1034508 failed, retrying 1...
15:11:38 ERROR : cuDNN on Host : download 'cuDNN on Host' failure
15:11:38 ERROR : cuDNN on Host : cannot download file https://nvonlineapi.nvidia.com/NVOnlineAPI/api/downloadfile?docid=1034513 with error Error: getaddrinfo ENOTFOUND nvonlineapi.nvidia.com nvonlineapi.nvidia.com:443
15:11:39 WARNING : PerfWorks SDK : download https://nvonlineapi.nvidia.com/NVOnlineAPI/api/downloadfile?docid=1034509 failed, retrying 2...
15:11:39 WARNING : NVIDIA Nsight Systems : download https://nvonlineapi.nvidia.com/NVOnlineAPI/api/downloadfile?docid=1034508 failed, retrying 2...
15:11:39 ERROR : PerfWorks SDK : download 'PerfWorks SDK' failure
15:11:39 ERROR : PerfWorks SDK : cannot download file https://nvonlineapi.nvidia.com/NVOnlineAPI/api/downloadfile?docid=1034509 with error Error: getaddrinfo ENOTFOUND nvonlineapi.nvidia.com nvonlineapi.nvidia.com:443
15:11:40 ERROR : PerfWorks SDK : install 'PerfWorks SDK' failure, no file is available to install
15:11:41 WARNING : DRIVE QNX Release Notes : download https://nvonlineapi.nvidia.com/NVOnlineAPI/api/downloadfile?docid=1034492 failed, retrying 1...
15:11:41 ERROR : NVIDIA Nsight Systems : download 'NVIDIA Nsight Systems' failure
15:11:41 ERROR : NVIDIA Nsight Systems : cannot download file https://nvonlineapi.nvidia.com/NVOnlineAPI/api/downloadfile?docid=1034508 with error Error: getaddrinfo ENOTFOUND nvonlineapi.nvidia.com nvonlineapi.nvidia.com:443
15:11:42 ERROR : NVIDIA Nsight Systems : install 'NVIDIA Nsight Systems' failure, no file is available to install
15:11:43 WARNING : TensorRT on Host : download https://nvonlineapi.nvidia.com/NVOnlineAPI/api/downloadfile?docid=1034510 failed, retrying 1...
15:11:43 WARNING : DRIVE QNX Release Notes : download https://nvonlineapi.nvidia.com/NVOnlineAPI/api/downloadfile?docid=1034492 failed, retrying 2...
15:11:44 WARNING : Tegra Graphics Debugger : download https://nvonlineapi.nvidia.com/NVOnlineAPI/api/downloadfile?docid=1034511 failed, retrying 1...
15:11:44 WARNING : TensorRT on Host : download https://nvonlineapi.nvidia.com/NVOnlineAPI/api/downloadfile?docid=1034510 failed, retrying 2...
15:11:44 ERROR : DRIVE QNX Release Notes : download 'DRIVE QNX Release Notes' failure
15:11:44 ERROR : DRIVE QNX Release Notes : cannot download file https://nvonlineapi.nvidia.com/NVOnlineAPI/api/downloadfile?docid=1034492 with error Error: getaddrinfo ENOTFOUND nvonlineapi.nvidia.com nvonlineapi.nvidia.com:443
15:11:45 ERROR : DRIVE QNX Release Notes : install 'DRIVE QNX Release Notes' failure, no file is available to install
15:11:46 WARNING : Tegra Graphics Debugger : download https://nvonlineapi.nvidia.com/NVOnlineAPI/api/downloadfile?docid=1034511 failed, retrying 2...
15:11:46 ERROR : TensorRT on Host : download 'TensorRT on Host' failure
15:11:46 ERROR : TensorRT on Host : cannot download file https://nvonlineapi.nvidia.com/NVOnlineAPI/api/downloadfile?docid=1034510 with error Error: getaddrinfo ENOTFOUND nvonlineapi.nvidia.com nvonlineapi.nvidia.com:443
15:11:47 WARNING : DRIVE QNX Documentation : download https://nvonlineapi.nvidia.com/NVOnlineAPI/api/downloadfile?docid=1034491 failed, retrying 1...
15:11:47 ERROR : Tegra Graphics Debugger : download 'Tegra Graphics Debugger' failure
15:11:47 ERROR : Tegra Graphics Debugger : cannot download file https://nvonlineapi.nvidia.com/NVOnlineAPI/api/downloadfile?docid=1034511 with error Error: getaddrinfo ENOTFOUND nvonlineapi.nvidia.com nvonlineapi.nvidia.com:443
15:11:48 ERROR : Tegra Graphics Debugger : install 'Tegra Graphics Debugger' failure, no file is available to install
15:11:49 WARNING : DRIVE QNX Documentation : download https://nvonlineapi.nvidia.com/NVOnlineAPI/api/downloadfile?docid=1034491 failed, retrying 2...
15:11:49 WARNING : DevTools Documentation : download https://nvonlineapi.nvidia.com/NVOnlineAPI/api/downloadfile?docid=1034514 failed, retrying 1...
15:11:49 ERROR : DRIVE QNX Documentation : download 'DRIVE QNX Documentation' failure
15:11:49 ERROR : DRIVE QNX Documentation : cannot download file https://nvonlineapi.nvidia.com/NVOnlineAPI/api/downloadfile?docid=1034491 with error Error: getaddrinfo ENOTFOUND nvonlineapi.nvidia.com nvonlineapi.nvidia.com:443
15:11:50 ERROR : DRIVE QNX Documentation : install 'DRIVE QNX Documentation' failure, no file is available to install
15:11:51 WARNING : DevTools Documentation : download https://nvonlineapi.nvidia.com/NVOnlineAPI/api/downloadfile?docid=1034514 failed, retrying 2...
15:11:51 ERROR : DevTools Documentation : download 'DevTools Documentation' failure
15:11:51 ERROR : DevTools Documentation : cannot download file https://nvonlineapi.nvidia.com/NVOnlineAPI/api/downloadfile?docid=1034514 with error Error: getaddrinfo ENOTFOUND nvonlineapi.nvidia.com nvonlineapi.nvidia.com:443
15:11:52 ERROR : DevTools Documentation : install 'DevTools Documentation' failure, no file is available to install
15:11:54 ERROR : Zombie components detected, please check log
15:11:56 ERROR : Flash Xavier A : Flash skipped due to component(s) download/install failure
15:11:56 ERROR : Flash Xavier B : Flash skipped due to component(s) download/install failure
15:11:59 DEBUG : running command < echo "killall sudo_daemon" > /home/bnm4hi/sdkmanager-0.9.8.2002/resources/app.asar.unpacked/output/installUtils/tmp/sudo_daemon_fifo_req >
15:11:59 INFO : command finished successfully
INSTALLATION FAILED 
Review terminal tab for details. Resolve and RETRY.
EXPORT LOGS

RETRY
FAILED ITEMS

STOP TRYING

Copyright © 2018,
NVIDIA CORPORATION.
All rights reserved.
| NVIDIA Developer

I would be much thankful if you could hint on what I miss.

Thanks in advance,
mb

Hello,

Small update to my previous post:
The failure in download and installation is apparently not related to target hardware or software platform: Just tried to download another package - the failure looks very similar.

Appreciate your time and efforts.
mb

Hello maxim.bakouchine,

There are several posts about it on the forum, it’s not possible to install SDK and DriveWorks on a virtual machine, you’ll need a real ubuntu 16 LTS computer.

Hope it helps,
Adrien

Hi Adrien,
That definitely helps.
Thanks a lot for your time.
– mb