cannot compile cutil_vs2010

Hello.
Can anyone help me?

Windows 7 x64
cudatoolkit_4.2.9_win_64
devdriver_4.2_winvista-win7_64_301.27_notebook
gpucomputingsdk_4.2.9_win_64

GT 540M

when i want to build cutil_vs2010.sln from C:\ProgramData\NVIDIA Corporation\NVIDIA GPU Computing SDK 4.2\C\common
i get error:

Error 1 error MSB3073: The command "mkdir …\bin\win64\Debug
copy lib\x64\cutil64D.dll …\bin\win64\Debug

:VCEnd" exited with code 1. C:\Program Files (x86)\MSBuild\Microsoft.Cpp\v4.0\Microsoft.CppCommon.targets 113 6 cutil

OUTPUT:
1>------ Build started: Project: cutil, Configuration: Debug x64 ------
1> Creating library C:\ProgramData\NVIDIA Corporation\NVIDIA GPU Computing SDK 4.2\C\common\lib\x64\cutil64D.lib and object C:\ProgramData\NVIDIA Corporation\NVIDIA GPU Computing SDK 4.2\C\common\lib\x64\cutil64D.exp
1> cutil_vs2010.vcxproj -> C:\ProgramData\NVIDIA Corporation\NVIDIA GPU Computing SDK 4.2\C\common\lib\x64\cutil64D.dll
1> cutil_vs2010.vcxproj -> C:\ProgramData\NVIDIA Corporation\NVIDIA GPU Computing SDK 4.2\C\common\lib\x64\cutil64D.dll
1> Подпапка или файл …\bin\win64\Debug уже существует.
1> Отказано в доступе.
1> Скопировано файлов: 0.
1>C:\Program Files (x86)\MSBuild\Microsoft.Cpp\v4.0\Microsoft.CppCommon.targets(113,5): error MSB3073: The command “mkdir …\bin\win64\Debug
1>C:\Program Files (x86)\MSBuild\Microsoft.Cpp\v4.0\Microsoft.CppCommon.targets(113,5): error MSB3073: copy lib\x64\cutil64D.dll …\bin\win64\Debug
1>C:\Program Files (x86)\MSBuild\Microsoft.Cpp\v4.0\Microsoft.CppCommon.targets(113,5): error MSB3073:
1>C:\Program Files (x86)\MSBuild\Microsoft.Cpp\v4.0\Microsoft.CppCommon.targets(113,5): error MSB3073: :VCEnd” exited with code 1.
========== Build: 0 succeeded, 1 failed, 0 up-to-date, 0 skipped ==========