[SOLVED] Faulty 340.9x drivers with kernels 4.2.x and 4.3.x

Hi developers,

hope to be in the correct section.

I also reported the problem to ‘bugzilla.kernel.org’ as I don’t know if the problem is due to kernel or Nvidia driver.

I’m using Linux Mint KDE 17.2 and when installing any kernel greater than 4.2.0-19-generic I have got the following errors:

Error! Bad return status for module build on kernel: 4.3.0-4-exton (x86_64)
Consult /var/lib/dkms/virtualbox-guest/4.3.34/build/make.log for more information.
Error! Bad return status for module build on kernel: 4.3.0-4-exton (x86_64)
Consult /var/lib/dkms/vboxhost/5.0.10/build/make.log for more information.
Error! Bad return status for module build on kernel: 4.3.0-4-exton (x86_64)
Consult /var/lib/dkms/nvidia-340/340.96/build/make.log for more information.

In the example my last attempt to install kernel by Exton as a last resort. Same results if I try to install last kernels from Ubuntu PPA repository.
The only one working seems the aforementioned, that’s 4.2.0-19-generic.
Any other more recent kernel doesn’t work, both with driver 340.93 and 340.96.

Nvidia seems to pay much more attention to drivers for recent products than for old ones. Three months ago there was a similar bug regarding GPL rights, now DKMS. Sad to see Nvidia less careful to old customers and kernel developers ignoring bugs already reported months ago…

Excuse the outburst.
Now the question: is there a way to solve this?
Thanks in advance and have a nice day.

Below you may see my last ‘make.log’:

DKMS make.log for nvidia-340-340.96 for kernel 4.3.0-4-exton (x86_64)
dom 13 dic 2015, 14.30.41, CET
NVIDIA: calling KBUILD…
make[1]: ingresso nella directory “/usr/src/linux-headers-4.3.0-4-exton”
Makefile:669: Cannot use CONFIG_CC_STACKPROTECTOR_STRONG: -fstack-protector-strong not supported by compiler
test -e include/generated/autoconf.h -a -e include/config/auto.conf || (
echo >&2;
echo >&2 " ERROR: Kernel configuration is invalid.";
echo >&2 " include/generated/autoconf.h or include/config/auto.conf are missing.";
echo >&2 " Run ‘make oldconfig && make prepare’ on kernel src to fix it.";
echo >&2 ;
/bin/false)
mkdir -p /var/lib/dkms/nvidia-340/340.96/build/.tmp_versions ; rm -f /var/lib/dkms/nvidia-340/340.96/build/.tmp_versions/*
make -f ./scripts/Makefile.build obj=/var/lib/dkms/nvidia-340/340.96/build
cc -Wp,-MD,/var/lib/dkms/nvidia-340/340.96/build/.nv.o.d -nostdinc -isystem /usr/lib/gcc/x86_64-linux-gnu/4.8/include -I./arch/x86/include -Iarch/x86/include/generated/uapi -Iarch/x86/include/generated -Iinclude -I./arch/x86/include/uapi -Iarch/x86/include/generated/uapi -I./include/uapi -Iinclude/generated/uapi -include ./include/linux/kconfig.h -Iubuntu/include -D__KERNEL__ -Wall -Wundef -Wstrict-prototypes -Wno-trigraphs -fno-strict-aliasing -fno-common -Werror-implicit-function-declaration -Wno-format-security -std=gnu89 -mno-sse -mno-mmx -mno-sse2 -mno-3dnow -mno-avx -m64 -falign-jumps=1 -falign-loops=1 -mno-80387 -mno-fp-ret-in-387 -mpreferred-stack-boundary=3 -mtune=generic -mno-red-zone -mcmodel=kernel -funit-at-a-time -maccumulate-outgoing-args -DCONFIG_X86_X32_ABI -DCONFIG_AS_FXSAVEQ=1 -DCONFIG_AS_SSSE3=1 -DCONFIG_AS_CRC32=1 -DCONFIG_AS_AVX=1 -DCONFIG_AS_AVX2=1 -pipe -Wno-sign-compare -fno-asynchronous-unwind-tables -fno-delete-null-pointer-checks -O2 --param=allow-store-data-races=0 -Wframe-larger-than=1024 -fstack-protector-strong -fno-omit-frame-pointer -fno-optimize-sibling-calls -pg -DCC_HAVE_ASM_GOTO -DNV_MODULE_INSTANCE=0 -DNV_BUILD_MODULE_INSTANCES=0 -UDEBUG -U_DEBUG -DNDEBUG -I/var/lib/dkms/nvidia-340/340.96/build -Wall -MD -Wsign-compare -Wno-cast-qual -Wno-error -D__KERNEL__ -DMODULE -DNVRM -DNV_VERSION_STRING=“340.96” -Wno-unused-function -Wuninitialized -fno-strict-aliasing -mno-red-zone -mcmodel=kernel -DNV_UVM_ENABLE -D__linux__ -DNV_DEV_NAME=“nvidia” -DMODULE -D"KBUILD_STR(s)=#s" -D"KBUILD_BASENAME=KBUILD_STR(nv)" -D"KBUILD_MODNAME=KBUILD_STR(nvidia)" -c -o /var/lib/dkms/nvidia-340/340.96/build/.tmp_nv.o /var/lib/dkms/nvidia-340/340.96/build/nv.c
cc: error: unrecognized command line option ‘-fstack-protector-strong’
make[2]: *** [/var/lib/dkms/nvidia-340/340.96/build/nv.o] Errore 1
cc -Wp,-MD,/var/lib/dkms/nvidia-340/340.96/build/.nv-acpi.o.d -nostdinc -isystem /usr/lib/gcc/x86_64-linux-gnu/4.8/include -I./arch/x86/include -Iarch/x86/include/generated/uapi -Iarch/x86/include/generated -Iinclude -I./arch/x86/include/uapi -Iarch/x86/include/generated/uapi -I./include/uapi -Iinclude/generated/uapi -include ./include/linux/kconfig.h -Iubuntu/include -D__KERNEL__ -Wall -Wundef -Wstrict-prototypes -Wno-trigraphs -fno-strict-aliasing -fno-common -Werror-implicit-function-declaration -Wno-format-security -std=gnu89 -mno-sse -mno-mmx -mno-sse2 -mno-3dnow -mno-avx -m64 -falign-jumps=1 -falign-loops=1 -mno-80387 -mno-fp-ret-in-387 -mpreferred-stack-boundary=3 -mtune=generic -mno-red-zone -mcmodel=kernel -funit-at-a-time -maccumulate-outgoing-args -DCONFIG_X86_X32_ABI -DCONFIG_AS_FXSAVEQ=1 -DCONFIG_AS_SSSE3=1 -DCONFIG_AS_CRC32=1 -DCONFIG_AS_AVX=1 -DCONFIG_AS_AVX2=1 -pipe -Wno-sign-compare -fno-asynchronous-unwind-tables -fno-delete-null-pointer-checks -O2 --param=allow-store-data-races=0 -Wframe-larger-than=1024 -fstack-protector-strong -fno-omit-frame-pointer -fno-optimize-sibling-calls -pg -DCC_HAVE_ASM_GOTO -DNV_MODULE_INSTANCE=0 -DNV_BUILD_MODULE_INSTANCES=0 -UDEBUG -U_DEBUG -DNDEBUG -I/var/lib/dkms/nvidia-340/340.96/build -Wall -MD -Wsign-compare -Wno-cast-qual -Wno-error -D__KERNEL__ -DMODULE -DNVRM -DNV_VERSION_STRING=“340.96” -Wno-unused-function -Wuninitialized -fno-strict-aliasing -mno-red-zone -mcmodel=kernel -DNV_UVM_ENABLE -D__linux__ -DNV_DEV_NAME=“nvidia” -DMODULE -D"KBUILD_STR(s)=#s" -D"KBUILD_BASENAME=KBUILD_STR(nv_acpi)" -D"KBUILD_MODNAME=KBUILD_STR(nvidia)" -c -o /var/lib/dkms/nvidia-340/340.96/build/.tmp_nv-acpi.o /var/lib/dkms/nvidia-340/340.96/build/nv-acpi.c
cc: error: unrecognized command line option ‘-fstack-protector-strong’
make[2]: *** [/var/lib/dkms/nvidia-340/340.96/build/nv-acpi.o] Errore 1
cc -Wp,-MD,/var/lib/dkms/nvidia-340/340.96/build/.nv-chrdev.o.d -nostdinc -isystem /usr/lib/gcc/x86_64-linux-gnu/4.8/include -I./arch/x86/include -Iarch/x86/include/generated/uapi -Iarch/x86/include/generated -Iinclude -I./arch/x86/include/uapi -Iarch/x86/include/generated/uapi -I./include/uapi -Iinclude/generated/uapi -include ./include/linux/kconfig.h -Iubuntu/include -D__KERNEL__ -Wall -Wundef -Wstrict-prototypes -Wno-trigraphs -fno-strict-aliasing -fno-common -Werror-implicit-function-declaration -Wno-format-security -std=gnu89 -mno-sse -mno-mmx -mno-sse2 -mno-3dnow -mno-avx -m64 -falign-jumps=1 -falign-loops=1 -mno-80387 -mno-fp-ret-in-387 -mpreferred-stack-boundary=3 -mtune=generic -mno-red-zone -mcmodel=kernel -funit-at-a-time -maccumulate-outgoing-args -DCONFIG_X86_X32_ABI -DCONFIG_AS_FXSAVEQ=1 -DCONFIG_AS_SSSE3=1 -DCONFIG_AS_CRC32=1 -DCONFIG_AS_AVX=1 -DCONFIG_AS_AVX2=1 -pipe -Wno-sign-compare -fno-asynchronous-unwind-tables -fno-delete-null-pointer-checks -O2 --param=allow-store-data-races=0 -Wframe-larger-than=1024 -fstack-protector-strong -fno-omit-frame-pointer -fno-optimize-sibling-calls -pg -DCC_HAVE_ASM_GOTO -DNV_MODULE_INSTANCE=0 -DNV_BUILD_MODULE_INSTANCES=0 -UDEBUG -U_DEBUG -DNDEBUG -I/var/lib/dkms/nvidia-340/340.96/build -Wall -MD -Wsign-compare -Wno-cast-qual -Wno-error -D__KERNEL__ -DMODULE -DNVRM -DNV_VERSION_STRING=“340.96” -Wno-unused-function -Wuninitialized -fno-strict-aliasing -mno-red-zone -mcmodel=kernel -DNV_UVM_ENABLE -D__linux__ -DNV_DEV_NAME=“nvidia” -DMODULE -D"KBUILD_STR(s)=#s" -D"KBUILD_BASENAME=KBUILD_STR(nv_chrdev)" -D"KBUILD_MODNAME=KBUILD_STR(nvidia)" -c -o /var/lib/dkms/nvidia-340/340.96/build/.tmp_nv-chrdev.o /var/lib/dkms/nvidia-340/340.96/build/nv-chrdev.c
cc: error: unrecognized command line option ‘-fstack-protector-strong’
make[2]: *** [/var/lib/dkms/nvidia-340/340.96/build/nv-chrdev.o] Errore 1
cc -Wp,-MD,/var/lib/dkms/nvidia-340/340.96/build/.nv-cray.o.d -nostdinc -isystem /usr/lib/gcc/x86_64-linux-gnu/4.8/include -I./arch/x86/include -Iarch/x86/include/generated/uapi -Iarch/x86/include/generated -Iinclude -I./arch/x86/include/uapi -Iarch/x86/include/generated/uapi -I./include/uapi -Iinclude/generated/uapi -include ./include/linux/kconfig.h -Iubuntu/include -D__KERNEL__ -Wall -Wundef -Wstrict-prototypes -Wno-trigraphs -fno-strict-aliasing -fno-common -Werror-implicit-function-declaration -Wno-format-security -std=gnu89 -mno-sse -mno-mmx -mno-sse2 -mno-3dnow -mno-avx -m64 -falign-jumps=1 -falign-loops=1 -mno-80387 -mno-fp-ret-in-387 -mpreferred-stack-boundary=3 -mtune=generic -mno-red-zone -mcmodel=kernel -funit-at-a-time -maccumulate-outgoing-args -DCONFIG_X86_X32_ABI -DCONFIG_AS_FXSAVEQ=1 -DCONFIG_AS_SSSE3=1 -DCONFIG_AS_CRC32=1 -DCONFIG_AS_AVX=1 -DCONFIG_AS_AVX2=1 -pipe -Wno-sign-compare -fno-asynchronous-unwind-tables -fno-delete-null-pointer-checks -O2 --param=allow-store-data-races=0 -Wframe-larger-than=1024 -fstack-protector-strong -fno-omit-frame-pointer -fno-optimize-sibling-calls -pg -DCC_HAVE_ASM_GOTO -DNV_MODULE_INSTANCE=0 -DNV_BUILD_MODULE_INSTANCES=0 -UDEBUG -U_DEBUG -DNDEBUG -I/var/lib/dkms/nvidia-340/340.96/build -Wall -MD -Wsign-compare -Wno-cast-qual -Wno-error -D__KERNEL__ -DMODULE -DNVRM -DNV_VERSION_STRING=“340.96” -Wno-unused-function -Wuninitialized -fno-strict-aliasing -mno-red-zone -mcmodel=kernel -DNV_UVM_ENABLE -D__linux__ -DNV_DEV_NAME=“nvidia” -DMODULE -D"KBUILD_STR(s)=#s" -D"KBUILD_BASENAME=KBUILD_STR(nv_cray)" -D"KBUILD_MODNAME=KBUILD_STR(nvidia)" -c -o /var/lib/dkms/nvidia-340/340.96/build/.tmp_nv-cray.o /var/lib/dkms/nvidia-340/340.96/build/nv-cray.c
cc: error: unrecognized command line option ‘-fstack-protector-strong’
make[2]: *** [/var/lib/dkms/nvidia-340/340.96/build/nv-cray.o] Errore 1
cc -Wp,-MD,/var/lib/dkms/nvidia-340/340.96/build/.nv-dma.o.d -nostdinc -isystem /usr/lib/gcc/x86_64-linux-gnu/4.8/include -I./arch/x86/include -Iarch/x86/include/generated/uapi -Iarch/x86/include/generated -Iinclude -I./arch/x86/include/uapi -Iarch/x86/include/generated/uapi -I./include/uapi -Iinclude/generated/uapi -include ./include/linux/kconfig.h -Iubuntu/include -D__KERNEL__ -Wall -Wundef -Wstrict-prototypes -Wno-trigraphs -fno-strict-aliasing -fno-common -Werror-implicit-function-declaration -Wno-format-security -std=gnu89 -mno-sse -mno-mmx -mno-sse2 -mno-3dnow -mno-avx -m64 -falign-jumps=1 -falign-loops=1 -mno-80387 -mno-fp-ret-in-387 -mpreferred-stack-boundary=3 -mtune=generic -mno-red-zone -mcmodel=kernel -funit-at-a-time -maccumulate-outgoing-args -DCONFIG_X86_X32_ABI -DCONFIG_AS_FXSAVEQ=1 -DCONFIG_AS_SSSE3=1 -DCONFIG_AS_CRC32=1 -DCONFIG_AS_AVX=1 -DCONFIG_AS_AVX2=1 -pipe -Wno-sign-compare -fno-asynchronous-unwind-tables -fno-delete-null-pointer-checks -O2 --param=allow-store-data-races=0 -Wframe-larger-than=1024 -fstack-protector-strong -fno-omit-frame-pointer -fno-optimize-sibling-calls -pg -DCC_HAVE_ASM_GOTO -DNV_MODULE_INSTANCE=0 -DNV_BUILD_MODULE_INSTANCES=0 -UDEBUG -U_DEBUG -DNDEBUG -I/var/lib/dkms/nvidia-340/340.96/build -Wall -MD -Wsign-compare -Wno-cast-qual -Wno-error -D__KERNEL__ -DMODULE -DNVRM -DNV_VERSION_STRING=“340.96” -Wno-unused-function -Wuninitialized -fno-strict-aliasing -mno-red-zone -mcmodel=kernel -DNV_UVM_ENABLE -D__linux__ -DNV_DEV_NAME=“nvidia” -DMODULE -D"KBUILD_STR(s)=#s" -D"KBUILD_BASENAME=KBUILD_STR(nv_dma)" -D"KBUILD_MODNAME=KBUILD_STR(nvidia)" -c -o /var/lib/dkms/nvidia-340/340.96/build/.tmp_nv-dma.o /var/lib/dkms/nvidia-340/340.96/build/nv-dma.c
cc: error: unrecognized command line option ‘-fstack-protector-strong’
make[2]: *** [/var/lib/dkms/nvidia-340/340.96/build/nv-dma.o] Errore 1
cc -Wp,-MD,/var/lib/dkms/nvidia-340/340.96/build/.nv-drm.o.d -nostdinc -isystem /usr/lib/gcc/x86_64-linux-gnu/4.8/include -I./arch/x86/include -Iarch/x86/include/generated/uapi -Iarch/x86/include/generated -Iinclude -I./arch/x86/include/uapi -Iarch/x86/include/generated/uapi -I./include/uapi -Iinclude/generated/uapi -include ./include/linux/kconfig.h -Iubuntu/include -D__KERNEL__ -Wall -Wundef -Wstrict-prototypes -Wno-trigraphs -fno-strict-aliasing -fno-common -Werror-implicit-function-declaration -Wno-format-security -std=gnu89 -mno-sse -mno-mmx -mno-sse2 -mno-3dnow -mno-avx -m64 -falign-jumps=1 -falign-loops=1 -mno-80387 -mno-fp-ret-in-387 -mpreferred-stack-boundary=3 -mtune=generic -mno-red-zone -mcmodel=kernel -funit-at-a-time -maccumulate-outgoing-args -DCONFIG_X86_X32_ABI -DCONFIG_AS_FXSAVEQ=1 -DCONFIG_AS_SSSE3=1 -DCONFIG_AS_CRC32=1 -DCONFIG_AS_AVX=1 -DCONFIG_AS_AVX2=1 -pipe -Wno-sign-compare -fno-asynchronous-unwind-tables -fno-delete-null-pointer-checks -O2 --param=allow-store-data-races=0 -Wframe-larger-than=1024 -fstack-protector-strong -fno-omit-frame-pointer -fno-optimize-sibling-calls -pg -DCC_HAVE_ASM_GOTO -DNV_MODULE_INSTANCE=0 -DNV_BUILD_MODULE_INSTANCES=0 -UDEBUG -U_DEBUG -DNDEBUG -I/var/lib/dkms/nvidia-340/340.96/build -Wall -MD -Wsign-compare -Wno-cast-qual -Wno-error -D__KERNEL__ -DMODULE -DNVRM -DNV_VERSION_STRING=“340.96” -Wno-unused-function -Wuninitialized -fno-strict-aliasing -mno-red-zone -mcmodel=kernel -DNV_UVM_ENABLE -D__linux__ -DNV_DEV_NAME=“nvidia” -DMODULE -D"KBUILD_STR(s)=#s" -D"KBUILD_BASENAME=KBUILD_STR(nv_drm)" -D"KBUILD_MODNAME=KBUILD_STR(nvidia)" -c -o /var/lib/dkms/nvidia-340/340.96/build/.tmp_nv-drm.o /var/lib/dkms/nvidia-340/340.96/build/nv-drm.c
cc: error: unrecognized command line option ‘-fstack-protector-strong’
make[2]: *** [/var/lib/dkms/nvidia-340/340.96/build/nv-drm.o] Errore 1
cc -Wp,-MD,/var/lib/dkms/nvidia-340/340.96/build/.nv-gvi.o.d -nostdinc -isystem /usr/lib/gcc/x86_64-linux-gnu/4.8/include -I./arch/x86/include -Iarch/x86/include/generated/uapi -Iarch/x86/include/generated -Iinclude -I./arch/x86/include/uapi -Iarch/x86/include/generated/uapi -I./include/uapi -Iinclude/generated/uapi -include ./include/linux/kconfig.h -Iubuntu/include -D__KERNEL__ -Wall -Wundef -Wstrict-prototypes -Wno-trigraphs -fno-strict-aliasing -fno-common -Werror-implicit-function-declaration -Wno-format-security -std=gnu89 -mno-sse -mno-mmx -mno-sse2 -mno-3dnow -mno-avx -m64 -falign-jumps=1 -falign-loops=1 -mno-80387 -mno-fp-ret-in-387 -mpreferred-stack-boundary=3 -mtune=generic -mno-red-zone -mcmodel=kernel -funit-at-a-time -maccumulate-outgoing-args -DCONFIG_X86_X32_ABI -DCONFIG_AS_FXSAVEQ=1 -DCONFIG_AS_SSSE3=1 -DCONFIG_AS_CRC32=1 -DCONFIG_AS_AVX=1 -DCONFIG_AS_AVX2=1 -pipe -Wno-sign-compare -fno-asynchronous-unwind-tables -fno-delete-null-pointer-checks -O2 --param=allow-store-data-races=0 -Wframe-larger-than=1024 -fstack-protector-strong -fno-omit-frame-pointer -fno-optimize-sibling-calls -pg -DCC_HAVE_ASM_GOTO -DNV_MODULE_INSTANCE=0 -DNV_BUILD_MODULE_INSTANCES=0 -UDEBUG -U_DEBUG -DNDEBUG -I/var/lib/dkms/nvidia-340/340.96/build -Wall -MD -Wsign-compare -Wno-cast-qual -Wno-error -D__KERNEL__ -DMODULE -DNVRM -DNV_VERSION_STRING=“340.96” -Wno-unused-function -Wuninitialized -fno-strict-aliasing -mno-red-zone -mcmodel=kernel -DNV_UVM_ENABLE -D__linux__ -DNV_DEV_NAME=“nvidia” -DMODULE -D"KBUILD_STR(s)=#s" -D"KBUILD_BASENAME=KBUILD_STR(nv_gvi)" -D"KBUILD_MODNAME=KBUILD_STR(nvidia)" -c -o /var/lib/dkms/nvidia-340/340.96/build/.tmp_nv-gvi.o /var/lib/dkms/nvidia-340/340.96/build/nv-gvi.c
cc: error: unrecognized command line option ‘-fstack-protector-strong’
make[2]: *** [/var/lib/dkms/nvidia-340/340.96/build/nv-gvi.o] Errore 1
cc -Wp,-MD,/var/lib/dkms/nvidia-340/340.96/build/.nv-i2c.o.d -nostdinc -isystem /usr/lib/gcc/x86_64-linux-gnu/4.8/include -I./arch/x86/include -Iarch/x86/include/generated/uapi -Iarch/x86/include/generated -Iinclude -I./arch/x86/include/uapi -Iarch/x86/include/generated/uapi -I./include/uapi -Iinclude/generated/uapi -include ./include/linux/kconfig.h -Iubuntu/include -D__KERNEL__ -Wall -Wundef -Wstrict-prototypes -Wno-trigraphs -fno-strict-aliasing -fno-common -Werror-implicit-function-declaration -Wno-format-security -std=gnu89 -mno-sse -mno-mmx -mno-sse2 -mno-3dnow -mno-avx -m64 -falign-jumps=1 -falign-loops=1 -mno-80387 -mno-fp-ret-in-387 -mpreferred-stack-boundary=3 -mtune=generic -mno-red-zone -mcmodel=kernel -funit-at-a-time -maccumulate-outgoing-args -DCONFIG_X86_X32_ABI -DCONFIG_AS_FXSAVEQ=1 -DCONFIG_AS_SSSE3=1 -DCONFIG_AS_CRC32=1 -DCONFIG_AS_AVX=1 -DCONFIG_AS_AVX2=1 -pipe -Wno-sign-compare -fno-asynchronous-unwind-tables -fno-delete-null-pointer-checks -O2 --param=allow-store-data-races=0 -Wframe-larger-than=1024 -fstack-protector-strong -fno-omit-frame-pointer -fno-optimize-sibling-calls -pg -DCC_HAVE_ASM_GOTO -DNV_MODULE_INSTANCE=0 -DNV_BUILD_MODULE_INSTANCES=0 -UDEBUG -U_DEBUG -DNDEBUG -I/var/lib/dkms/nvidia-340/340.96/build -Wall -MD -Wsign-compare -Wno-cast-qual -Wno-error -D__KERNEL__ -DMODULE -DNVRM -DNV_VERSION_STRING=“340.96” -Wno-unused-function -Wuninitialized -fno-strict-aliasing -mno-red-zone -mcmodel=kernel -DNV_UVM_ENABLE -D__linux__ -DNV_DEV_NAME=“nvidia” -DMODULE -D"KBUILD_STR(s)=#s" -D"KBUILD_BASENAME=KBUILD_STR(nv_i2c)" -D"KBUILD_MODNAME=KBUILD_STR(nvidia)" -c -o /var/lib/dkms/nvidia-340/340.96/build/.tmp_nv-i2c.o /var/lib/dkms/nvidia-340/340.96/build/nv-i2c.c
cc: error: unrecognized command line option ‘-fstack-protector-strong’
make[2]: *** [/var/lib/dkms/nvidia-340/340.96/build/nv-i2c.o] Errore 1
cc -Wp,-MD,/var/lib/dkms/nvidia-340/340.96/build/.nv-mempool.o.d -nostdinc -isystem /usr/lib/gcc/x86_64-linux-gnu/4.8/include -I./arch/x86/include -Iarch/x86/include/generated/uapi -Iarch/x86/include/generated -Iinclude -I./arch/x86/include/uapi -Iarch/x86/include/generated/uapi -I./include/uapi -Iinclude/generated/uapi -include ./include/linux/kconfig.h -Iubuntu/include -D__KERNEL__ -Wall -Wundef -Wstrict-prototypes -Wno-trigraphs -fno-strict-aliasing -fno-common -Werror-implicit-function-declaration -Wno-format-security -std=gnu89 -mno-sse -mno-mmx -mno-sse2 -mno-3dnow -mno-avx -m64 -falign-jumps=1 -falign-loops=1 -mno-80387 -mno-fp-ret-in-387 -mpreferred-stack-boundary=3 -mtune=generic -mno-red-zone -mcmodel=kernel -funit-at-a-time -maccumulate-outgoing-args -DCONFIG_X86_X32_ABI -DCONFIG_AS_FXSAVEQ=1 -DCONFIG_AS_SSSE3=1 -DCONFIG_AS_CRC32=1 -DCONFIG_AS_AVX=1 -DCONFIG_AS_AVX2=1 -pipe -Wno-sign-compare -fno-asynchronous-unwind-tables -fno-delete-null-pointer-checks -O2 --param=allow-store-data-races=0 -Wframe-larger-than=1024 -fstack-protector-strong -fno-omit-frame-pointer -fno-optimize-sibling-calls -pg -DCC_HAVE_ASM_GOTO -DNV_MODULE_INSTANCE=0 -DNV_BUILD_MODULE_INSTANCES=0 -UDEBUG -U_DEBUG -DNDEBUG -I/var/lib/dkms/nvidia-340/340.96/build -Wall -MD -Wsign-compare -Wno-cast-qual -Wno-error -D__KERNEL__ -DMODULE -DNVRM -DNV_VERSION_STRING=“340.96” -Wno-unused-function -Wuninitialized -fno-strict-aliasing -mno-red-zone -mcmodel=kernel -DNV_UVM_ENABLE -D__linux__ -DNV_DEV_NAME=“nvidia” -DMODULE -D"KBUILD_STR(s)=#s" -D"KBUILD_BASENAME=KBUILD_STR(nv_mempool)" -D"KBUILD_MODNAME=KBUILD_STR(nvidia)" -c -o /var/lib/dkms/nvidia-340/340.96/build/.tmp_nv-mempool.o /var/lib/dkms/nvidia-340/340.96/build/nv-mempool.c
cc: error: unrecognized command line option ‘-fstack-protector-strong’
make[2]: *** [/var/lib/dkms/nvidia-340/340.96/build/nv-mempool.o] Errore 1
cc -Wp,-MD,/var/lib/dkms/nvidia-340/340.96/build/.nv-mmap.o.d -nostdinc -isystem /usr/lib/gcc/x86_64-linux-gnu/4.8/include -I./arch/x86/include -Iarch/x86/include/generated/uapi -Iarch/x86/include/generated -Iinclude -I./arch/x86/include/uapi -Iarch/x86/include/generated/uapi -I./include/uapi -Iinclude/generated/uapi -include ./include/linux/kconfig.h -Iubuntu/include -D__KERNEL__ -Wall -Wundef -Wstrict-prototypes -Wno-trigraphs -fno-strict-aliasing -fno-common -Werror-implicit-function-declaration -Wno-format-security -std=gnu89 -mno-sse -mno-mmx -mno-sse2 -mno-3dnow -mno-avx -m64 -falign-jumps=1 -falign-loops=1 -mno-80387 -mno-fp-ret-in-387 -mpreferred-stack-boundary=3 -mtune=generic -mno-red-zone -mcmodel=kernel -funit-at-a-time -maccumulate-outgoing-args -DCONFIG_X86_X32_ABI -DCONFIG_AS_FXSAVEQ=1 -DCONFIG_AS_SSSE3=1 -DCONFIG_AS_CRC32=1 -DCONFIG_AS_AVX=1 -DCONFIG_AS_AVX2=1 -pipe -Wno-sign-compare -fno-asynchronous-unwind-tables -fno-delete-null-pointer-checks -O2 --param=allow-store-data-races=0 -Wframe-larger-than=1024 -fstack-protector-strong -fno-omit-frame-pointer -fno-optimize-sibling-calls -pg -DCC_HAVE_ASM_GOTO -DNV_MODULE_INSTANCE=0 -DNV_BUILD_MODULE_INSTANCES=0 -UDEBUG -U_DEBUG -DNDEBUG -I/var/lib/dkms/nvidia-340/340.96/build -Wall -MD -Wsign-compare -Wno-cast-qual -Wno-error -D__KERNEL__ -DMODULE -DNVRM -DNV_VERSION_STRING=“340.96” -Wno-unused-function -Wuninitialized -fno-strict-aliasing -mno-red-zone -mcmodel=kernel -DNV_UVM_ENABLE -D__linux__ -DNV_DEV_NAME=“nvidia” -DMODULE -D"KBUILD_STR(s)=#s" -D"KBUILD_BASENAME=KBUILD_STR(nv_mmap)" -D"KBUILD_MODNAME=KBUILD_STR(nvidia)" -c -o /var/lib/dkms/nvidia-340/340.96/build/.tmp_nv-mmap.o /var/lib/dkms/nvidia-340/340.96/build/nv-mmap.c
cc: error: unrecognized command line option ‘-fstack-protector-strong’
make[2]: *** [/var/lib/dkms/nvidia-340/340.96/build/nv-mmap.o] Errore 1
cc -Wp,-MD,/var/lib/dkms/nvidia-340/340.96/build/.nv-p2p.o.d -nostdinc -isystem /usr/lib/gcc/x86_64-linux-gnu/4.8/include -I./arch/x86/include -Iarch/x86/include/generated/uapi -Iarch/x86/include/generated -Iinclude -I./arch/x86/include/uapi -Iarch/x86/include/generated/uapi -I./include/uapi -Iinclude/generated/uapi -include ./include/linux/kconfig.h -Iubuntu/include -D__KERNEL__ -Wall -Wundef -Wstrict-prototypes -Wno-trigraphs -fno-strict-aliasing -fno-common -Werror-implicit-function-declaration -Wno-format-security -std=gnu89 -mno-sse -mno-mmx -mno-sse2 -mno-3dnow -mno-avx -m64 -falign-jumps=1 -falign-loops=1 -mno-80387 -mno-fp-ret-in-387 -mpreferred-stack-boundary=3 -mtune=generic -mno-red-zone -mcmodel=kernel -funit-at-a-time -maccumulate-outgoing-args -DCONFIG_X86_X32_ABI -DCONFIG_AS_FXSAVEQ=1 -DCONFIG_AS_SSSE3=1 -DCONFIG_AS_CRC32=1 -DCONFIG_AS_AVX=1 -DCONFIG_AS_AVX2=1 -pipe -Wno-sign-compare -fno-asynchronous-unwind-tables -fno-delete-null-pointer-checks -O2 --param=allow-store-data-races=0 -Wframe-larger-than=1024 -fstack-protector-strong -fno-omit-frame-pointer -fno-optimize-sibling-calls -pg -DCC_HAVE_ASM_GOTO -DNV_MODULE_INSTANCE=0 -DNV_BUILD_MODULE_INSTANCES=0 -UDEBUG -U_DEBUG -DNDEBUG -I/var/lib/dkms/nvidia-340/340.96/build -Wall -MD -Wsign-compare -Wno-cast-qual -Wno-error -D__KERNEL__ -DMODULE -DNVRM -DNV_VERSION_STRING=“340.96” -Wno-unused-function -Wuninitialized -fno-strict-aliasing -mno-red-zone -mcmodel=kernel -DNV_UVM_ENABLE -D__linux__ -DNV_DEV_NAME=“nvidia” -DMODULE -D"KBUILD_STR(s)=#s" -D"KBUILD_BASENAME=KBUILD_STR(nv_p2p)" -D"KBUILD_MODNAME=KBUILD_STR(nvidia)" -c -o /var/lib/dkms/nvidia-340/340.96/build/.tmp_nv-p2p.o /var/lib/dkms/nvidia-340/340.96/build/nv-p2p.c
cc: error: unrecognized command line option ‘-fstack-protector-strong’
make[2]: *** [/var/lib/dkms/nvidia-340/340.96/build/nv-p2p.o] Errore 1
cc -Wp,-MD,/var/lib/dkms/nvidia-340/340.96/build/.nv-pat.o.d -nostdinc -isystem /usr/lib/gcc/x86_64-linux-gnu/4.8/include -I./arch/x86/include -Iarch/x86/include/generated/uapi -Iarch/x86/include/generated -Iinclude -I./arch/x86/include/uapi -Iarch/x86/include/generated/uapi -I./include/uapi -Iinclude/generated/uapi -include ./include/linux/kconfig.h -Iubuntu/include -D__KERNEL__ -Wall -Wundef -Wstrict-prototypes -Wno-trigraphs -fno-strict-aliasing -fno-common -Werror-implicit-function-declaration -Wno-format-security -std=gnu89 -mno-sse -mno-mmx -mno-sse2 -mno-3dnow -mno-avx -m64 -falign-jumps=1 -falign-loops=1 -mno-80387 -mno-fp-ret-in-387 -mpreferred-stack-boundary=3 -mtune=generic -mno-red-zone -mcmodel=kernel -funit-at-a-time -maccumulate-outgoing-args -DCONFIG_X86_X32_ABI -DCONFIG_AS_FXSAVEQ=1 -DCONFIG_AS_SSSE3=1 -DCONFIG_AS_CRC32=1 -DCONFIG_AS_AVX=1 -DCONFIG_AS_AVX2=1 -pipe -Wno-sign-compare -fno-asynchronous-unwind-tables -fno-delete-null-pointer-checks -O2 --param=allow-store-data-races=0 -Wframe-larger-than=1024 -fstack-protector-strong -fno-omit-frame-pointer -fno-optimize-sibling-calls -pg -DCC_HAVE_ASM_GOTO -DNV_MODULE_INSTANCE=0 -DNV_BUILD_MODULE_INSTANCES=0 -UDEBUG -U_DEBUG -DNDEBUG -I/var/lib/dkms/nvidia-340/340.96/build -Wall -MD -Wsign-compare -Wno-cast-qual -Wno-error -D__KERNEL__ -DMODULE -DNVRM -DNV_VERSION_STRING=“340.96” -Wno-unused-function -Wuninitialized -fno-strict-aliasing -mno-red-zone -mcmodel=kernel -DNV_UVM_ENABLE -D__linux__ -DNV_DEV_NAME=“nvidia” -DMODULE -D"KBUILD_STR(s)=#s" -D"KBUILD_BASENAME=KBUILD_STR(nv_pat)" -D"KBUILD_MODNAME=KBUILD_STR(nvidia)" -c -o /var/lib/dkms/nvidia-340/340.96/build/.tmp_nv-pat.o /var/lib/dkms/nvidia-340/340.96/build/nv-pat.c
cc: error: unrecognized command line option ‘-fstack-protector-strong’
make[2]: *** [/var/lib/dkms/nvidia-340/340.96/build/nv-pat.o] Errore 1
cc -Wp,-MD,/var/lib/dkms/nvidia-340/340.96/build/.nv-procfs.o.d -nostdinc -isystem /usr/lib/gcc/x86_64-linux-gnu/4.8/include -I./arch/x86/include -Iarch/x86/include/generated/uapi -Iarch/x86/include/generated -Iinclude -I./arch/x86/include/uapi -Iarch/x86/include/generated/uapi -I./include/uapi -Iinclude/generated/uapi -include ./include/linux/kconfig.h -Iubuntu/include -D__KERNEL__ -Wall -Wundef -Wstrict-prototypes -Wno-trigraphs -fno-strict-aliasing -fno-common -Werror-implicit-function-declaration -Wno-format-security -std=gnu89 -mno-sse -mno-mmx -mno-sse2 -mno-3dnow -mno-avx -m64 -falign-jumps=1 -falign-loops=1 -mno-80387 -mno-fp-ret-in-387 -mpreferred-stack-boundary=3 -mtune=generic -mno-red-zone -mcmodel=kernel -funit-at-a-time -maccumulate-outgoing-args -DCONFIG_X86_X32_ABI -DCONFIG_AS_FXSAVEQ=1 -DCONFIG_AS_SSSE3=1 -DCONFIG_AS_CRC32=1 -DCONFIG_AS_AVX=1 -DCONFIG_AS_AVX2=1 -pipe -Wno-sign-compare -fno-asynchronous-unwind-tables -fno-delete-null-pointer-checks -O2 --param=allow-store-data-races=0 -Wframe-larger-than=1024 -fstack-protector-strong -fno-omit-frame-pointer -fno-optimize-sibling-calls -pg -DCC_HAVE_ASM_GOTO -DNV_MODULE_INSTANCE=0 -DNV_BUILD_MODULE_INSTANCES=0 -UDEBUG -U_DEBUG -DNDEBUG -I/var/lib/dkms/nvidia-340/340.96/build -Wall -MD -Wsign-compare -Wno-cast-qual -Wno-error -D__KERNEL__ -DMODULE -DNVRM -DNV_VERSION_STRING=“340.96” -Wno-unused-function -Wuninitialized -fno-strict-aliasing -mno-red-zone -mcmodel=kernel -DNV_UVM_ENABLE -D__linux__ -DNV_DEV_NAME=“nvidia” -DMODULE -D"KBUILD_STR(s)=#s" -D"KBUILD_BASENAME=KBUILD_STR(nv_procfs)" -D"KBUILD_MODNAME=KBUILD_STR(nvidia)" -c -o /var/lib/dkms/nvidia-340/340.96/build/.tmp_nv-procfs.o /var/lib/dkms/nvidia-340/340.96/build/nv-procfs.c
cc: error: unrecognized command line option ‘-fstack-protector-strong’
make[2]: *** [/var/lib/dkms/nvidia-340/340.96/build/nv-procfs.o] Errore 1
cc -Wp,-MD,/var/lib/dkms/nvidia-340/340.96/build/.nv-usermap.o.d -nostdinc -isystem /usr/lib/gcc/x86_64-linux-gnu/4.8/include -I./arch/x86/include -Iarch/x86/include/generated/uapi -Iarch/x86/include/generated -Iinclude -I./arch/x86/include/uapi -Iarch/x86/include/generated/uapi -I./include/uapi -Iinclude/generated/uapi -include ./include/linux/kconfig.h -Iubuntu/include -D__KERNEL__ -Wall -Wundef -Wstrict-prototypes -Wno-trigraphs -fno-strict-aliasing -fno-common -Werror-implicit-function-declaration -Wno-format-security -std=gnu89 -mno-sse -mno-mmx -mno-sse2 -mno-3dnow -mno-avx -m64 -falign-jumps=1 -falign-loops=1 -mno-80387 -mno-fp-ret-in-387 -mpreferred-stack-boundary=3 -mtune=generic -mno-red-zone -mcmodel=kernel -funit-at-a-time -maccumulate-outgoing-args -DCONFIG_X86_X32_ABI -DCONFIG_AS_FXSAVEQ=1 -DCONFIG_AS_SSSE3=1 -DCONFIG_AS_CRC32=1 -DCONFIG_AS_AVX=1 -DCONFIG_AS_AVX2=1 -pipe -Wno-sign-compare -fno-asynchronous-unwind-tables -fno-delete-null-pointer-checks -O2 --param=allow-store-data-races=0 -Wframe-larger-than=1024 -fstack-protector-strong -fno-omit-frame-pointer -fno-optimize-sibling-calls -pg -DCC_HAVE_ASM_GOTO -DNV_MODULE_INSTANCE=0 -DNV_BUILD_MODULE_INSTANCES=0 -UDEBUG -U_DEBUG -DNDEBUG -I/var/lib/dkms/nvidia-340/340.96/build -Wall -MD -Wsign-compare -Wno-cast-qual -Wno-error -D__KERNEL__ -DMODULE -DNVRM -DNV_VERSION_STRING=“340.96” -Wno-unused-function -Wuninitialized -fno-strict-aliasing -mno-red-zone -mcmodel=kernel -DNV_UVM_ENABLE -D__linux__ -DNV_DEV_NAME=“nvidia” -DMODULE -D"KBUILD_STR(s)=#s" -D"KBUILD_BASENAME=KBUILD_STR(nv_usermap)" -D"KBUILD_MODNAME=KBUILD_STR(nvidia)" -c -o /var/lib/dkms/nvidia-340/340.96/build/.tmp_nv-usermap.o /var/lib/dkms/nvidia-340/340.96/build/nv-usermap.c
cc: error: unrecognized command line option ‘-fstack-protector-strong’
make[2]: *** [/var/lib/dkms/nvidia-340/340.96/build/nv-usermap.o] Errore 1
cc -Wp,-MD,/var/lib/dkms/nvidia-340/340.96/build/.nv-vm.o.d -nostdinc -isystem /usr/lib/gcc/x86_64-linux-gnu/4.8/include -I./arch/x86/include -Iarch/x86/include/generated/uapi -Iarch/x86/include/generated -Iinclude -I./arch/x86/include/uapi -Iarch/x86/include/generated/uapi -I./include/uapi -Iinclude/generated/uapi -include ./include/linux/kconfig.h -Iubuntu/include -D__KERNEL__ -Wall -Wundef -Wstrict-prototypes -Wno-trigraphs -fno-strict-aliasing -fno-common -Werror-implicit-function-declaration -Wno-format-security -std=gnu89 -mno-sse -mno-mmx -mno-sse2 -mno-3dnow -mno-avx -m64 -falign-jumps=1 -falign-loops=1 -mno-80387 -mno-fp-ret-in-387 -mpreferred-stack-boundary=3 -mtune=generic -mno-red-zone -mcmodel=kernel -funit-at-a-time -maccumulate-outgoing-args -DCONFIG_X86_X32_ABI -DCONFIG_AS_FXSAVEQ=1 -DCONFIG_AS_SSSE3=1 -DCONFIG_AS_CRC32=1 -DCONFIG_AS_AVX=1 -DCONFIG_AS_AVX2=1 -pipe -Wno-sign-compare -fno-asynchronous-unwind-tables -fno-delete-null-pointer-checks -O2 --param=allow-store-data-races=0 -Wframe-larger-than=1024 -fstack-protector-strong -fno-omit-frame-pointer -fno-optimize-sibling-calls -pg -DCC_HAVE_ASM_GOTO -DNV_MODULE_INSTANCE=0 -DNV_BUILD_MODULE_INSTANCES=0 -UDEBUG -U_DEBUG -DNDEBUG -I/var/lib/dkms/nvidia-340/340.96/build -Wall -MD -Wsign-compare -Wno-cast-qual -Wno-error -D__KERNEL__ -DMODULE -DNVRM -DNV_VERSION_STRING=“340.96” -Wno-unused-function -Wuninitialized -fno-strict-aliasing -mno-red-zone -mcmodel=kernel -DNV_UVM_ENABLE -D__linux__ -DNV_DEV_NAME=“nvidia” -DMODULE -D"KBUILD_STR(s)=#s" -D"KBUILD_BASENAME=KBUILD_STR(nv_vm)" -D"KBUILD_MODNAME=KBUILD_STR(nvidia)" -c -o /var/lib/dkms/nvidia-340/340.96/build/.tmp_nv-vm.o /var/lib/dkms/nvidia-340/340.96/build/nv-vm.c
cc: error: unrecognized command line option ‘-fstack-protector-strong’
make[2]: *** [/var/lib/dkms/nvidia-340/340.96/build/nv-vm.o] Errore 1
cc -Wp,-MD,/var/lib/dkms/nvidia-340/340.96/build/.nv-vtophys.o.d -nostdinc -isystem /usr/lib/gcc/x86_64-linux-gnu/4.8/include -I./arch/x86/include -Iarch/x86/include/generated/uapi -Iarch/x86/include/generated -Iinclude -I./arch/x86/include/uapi -Iarch/x86/include/generated/uapi -I./include/uapi -Iinclude/generated/uapi -include ./include/linux/kconfig.h -Iubuntu/include -D__KERNEL__ -Wall -Wundef -Wstrict-prototypes -Wno-trigraphs -fno-strict-aliasing -fno-common -Werror-implicit-function-declaration -Wno-format-security -std=gnu89 -mno-sse -mno-mmx -mno-sse2 -mno-3dnow -mno-avx -m64 -falign-jumps=1 -falign-loops=1 -mno-80387 -mno-fp-ret-in-387 -mpreferred-stack-boundary=3 -mtune=generic -mno-red-zone -mcmodel=kernel -funit-at-a-time -maccumulate-outgoing-args -DCONFIG_X86_X32_ABI -DCONFIG_AS_FXSAVEQ=1 -DCONFIG_AS_SSSE3=1 -DCONFIG_AS_CRC32=1 -DCONFIG_AS_AVX=1 -DCONFIG_AS_AVX2=1 -pipe -Wno-sign-compare -fno-asynchronous-unwind-tables -fno-delete-null-pointer-checks -O2 --param=allow-store-data-races=0 -Wframe-larger-than=1024 -fstack-protector-strong -fno-omit-frame-pointer -fno-optimize-sibling-calls -pg -DCC_HAVE_ASM_GOTO -DNV_MODULE_INSTANCE=0 -DNV_BUILD_MODULE_INSTANCES=0 -UDEBUG -U_DEBUG -DNDEBUG -I/var/lib/dkms/nvidia-340/340.96/build -Wall -MD -Wsign-compare -Wno-cast-qual -Wno-error -D__KERNEL__ -DMODULE -DNVRM -DNV_VERSION_STRING=“340.96” -Wno-unused-function -Wuninitialized -fno-strict-aliasing -mno-red-zone -mcmodel=kernel -DNV_UVM_ENABLE -D__linux__ -DNV_DEV_NAME=“nvidia” -DMODULE -D"KBUILD_STR(s)=#s" -D"KBUILD_BASENAME=KBUILD_STR(nv_vtophys)" -D"KBUILD_MODNAME=KBUILD_STR(nvidia)" -c -o /var/lib/dkms/nvidia-340/340.96/build/.tmp_nv-vtophys.o /var/lib/dkms/nvidia-340/340.96/build/nv-vtophys.c
cc: error: unrecognized command line option ‘-fstack-protector-strong’
make[2]: *** [/var/lib/dkms/nvidia-340/340.96/build/nv-vtophys.o] Errore 1
cc -Wp,-MD,/var/lib/dkms/nvidia-340/340.96/build/.os-interface.o.d -nostdinc -isystem /usr/lib/gcc/x86_64-linux-gnu/4.8/include -I./arch/x86/include -Iarch/x86/include/generated/uapi -Iarch/x86/include/generated -Iinclude -I./arch/x86/include/uapi -Iarch/x86/include/generated/uapi -I./include/uapi -Iinclude/generated/uapi -include ./include/linux/kconfig.h -Iubuntu/include -D__KERNEL__ -Wall -Wundef -Wstrict-prototypes -Wno-trigraphs -fno-strict-aliasing -fno-common -Werror-implicit-function-declaration -Wno-format-security -std=gnu89 -mno-sse -mno-mmx -mno-sse2 -mno-3dnow -mno-avx -m64 -falign-jumps=1 -falign-loops=1 -mno-80387 -mno-fp-ret-in-387 -mpreferred-stack-boundary=3 -mtune=generic -mno-red-zone -mcmodel=kernel -funit-at-a-time -maccumulate-outgoing-args -DCONFIG_X86_X32_ABI -DCONFIG_AS_FXSAVEQ=1 -DCONFIG_AS_SSSE3=1 -DCONFIG_AS_CRC32=1 -DCONFIG_AS_AVX=1 -DCONFIG_AS_AVX2=1 -pipe -Wno-sign-compare -fno-asynchronous-unwind-tables -fno-delete-null-pointer-checks -O2 --param=allow-store-data-races=0 -Wframe-larger-than=1024 -fstack-protector-strong -fno-omit-frame-pointer -fno-optimize-sibling-calls -pg -DCC_HAVE_ASM_GOTO -DNV_MODULE_INSTANCE=0 -DNV_BUILD_MODULE_INSTANCES=0 -UDEBUG -U_DEBUG -DNDEBUG -I/var/lib/dkms/nvidia-340/340.96/build -Wall -MD -Wsign-compare -Wno-cast-qual -Wno-error -D__KERNEL__ -DMODULE -DNVRM -DNV_VERSION_STRING=“340.96” -Wno-unused-function -Wuninitialized -fno-strict-aliasing -mno-red-zone -mcmodel=kernel -DNV_UVM_ENABLE -D__linux__ -DNV_DEV_NAME=“nvidia” -DMODULE -D"KBUILD_STR(s)=#s" -D"KBUILD_BASENAME=KBUILD_STR(os_interface)" -D"KBUILD_MODNAME=KBUILD_STR(nvidia)" -c -o /var/lib/dkms/nvidia-340/340.96/build/.tmp_os-interface.o /var/lib/dkms/nvidia-340/340.96/build/os-interface.c
cc: error: unrecognized command line option ‘-fstack-protector-strong’
make[2]: *** [/var/lib/dkms/nvidia-340/340.96/build/os-interface.o] Errore 1
cc -Wp,-MD,/var/lib/dkms/nvidia-340/340.96/build/.os-mlock.o.d -nostdinc -isystem /usr/lib/gcc/x86_64-linux-gnu/4.8/include -I./arch/x86/include -Iarch/x86/include/generated/uapi -Iarch/x86/include/generated -Iinclude -I./arch/x86/include/uapi -Iarch/x86/include/generated/uapi -I./include/uapi -Iinclude/generated/uapi -include ./include/linux/kconfig.h -Iubuntu/include -D__KERNEL__ -Wall -Wundef -Wstrict-prototypes -Wno-trigraphs -fno-strict-aliasing -fno-common -Werror-implicit-function-declaration -Wno-format-security -std=gnu89 -mno-sse -mno-mmx -mno-sse2 -mno-3dnow -mno-avx -m64 -falign-jumps=1 -falign-loops=1 -mno-80387 -mno-fp-ret-in-387 -mpreferred-stack-boundary=3 -mtune=generic -mno-red-zone -mcmodel=kernel -funit-at-a-time -maccumulate-outgoing-args -DCONFIG_X86_X32_ABI -DCONFIG_AS_FXSAVEQ=1 -DCONFIG_AS_SSSE3=1 -DCONFIG_AS_CRC32=1 -DCONFIG_AS_AVX=1 -DCONFIG_AS_AVX2=1 -pipe -Wno-sign-compare -fno-asynchronous-unwind-tables -fno-delete-null-pointer-checks -O2 --param=allow-store-data-races=0 -Wframe-larger-than=1024 -fstack-protector-strong -fno-omit-frame-pointer -fno-optimize-sibling-calls -pg -DCC_HAVE_ASM_GOTO -DNV_MODULE_INSTANCE=0 -DNV_BUILD_MODULE_INSTANCES=0 -UDEBUG -U_DEBUG -DNDEBUG -I/var/lib/dkms/nvidia-340/340.96/build -Wall -MD -Wsign-compare -Wno-cast-qual -Wno-error -D__KERNEL__ -DMODULE -DNVRM -DNV_VERSION_STRING=“340.96” -Wno-unused-function -Wuninitialized -fno-strict-aliasing -mno-red-zone -mcmodel=kernel -DNV_UVM_ENABLE -D__linux__ -DNV_DEV_NAME=“nvidia” -DMODULE -D"KBUILD_STR(s)=#s" -D"KBUILD_BASENAME=KBUILD_STR(os_mlock)" -D"KBUILD_MODNAME=KBUILD_STR(nvidia)" -c -o /var/lib/dkms/nvidia-340/340.96/build/.tmp_os-mlock.o /var/lib/dkms/nvidia-340/340.96/build/os-mlock.c
cc: error: unrecognized command line option ‘-fstack-protector-strong’
make[2]: *** [/var/lib/dkms/nvidia-340/340.96/build/os-mlock.o] Errore 1
cc -Wp,-MD,/var/lib/dkms/nvidia-340/340.96/build/.os-pci.o.d -nostdinc -isystem /usr/lib/gcc/x86_64-linux-gnu/4.8/include -I./arch/x86/include -Iarch/x86/include/generated/uapi -Iarch/x86/include/generated -Iinclude -I./arch/x86/include/uapi -Iarch/x86/include/generated/uapi -I./include/uapi -Iinclude/generated/uapi -include ./include/linux/kconfig.h -Iubuntu/include -D__KERNEL__ -Wall -Wundef -Wstrict-prototypes -Wno-trigraphs -fno-strict-aliasing -fno-common -Werror-implicit-function-declaration -Wno-format-security -std=gnu89 -mno-sse -mno-mmx -mno-sse2 -mno-3dnow -mno-avx -m64 -falign-jumps=1 -falign-loops=1 -mno-80387 -mno-fp-ret-in-387 -mpreferred-stack-boundary=3 -mtune=generic -mno-red-zone -mcmodel=kernel -funit-at-a-time -maccumulate-outgoing-args -DCONFIG_X86_X32_ABI -DCONFIG_AS_FXSAVEQ=1 -DCONFIG_AS_SSSE3=1 -DCONFIG_AS_CRC32=1 -DCONFIG_AS_AVX=1 -DCONFIG_AS_AVX2=1 -pipe -Wno-sign-compare -fno-asynchronous-unwind-tables -fno-delete-null-pointer-checks -O2 --param=allow-store-data-races=0 -Wframe-larger-than=1024 -fstack-protector-strong -fno-omit-frame-pointer -fno-optimize-sibling-calls -pg -DCC_HAVE_ASM_GOTO -DNV_MODULE_INSTANCE=0 -DNV_BUILD_MODULE_INSTANCES=0 -UDEBUG -U_DEBUG -DNDEBUG -I/var/lib/dkms/nvidia-340/340.96/build -Wall -MD -Wsign-compare -Wno-cast-qual -Wno-error -D__KERNEL__ -DMODULE -DNVRM -DNV_VERSION_STRING=“340.96” -Wno-unused-function -Wuninitialized -fno-strict-aliasing -mno-red-zone -mcmodel=kernel -DNV_UVM_ENABLE -D__linux__ -DNV_DEV_NAME=“nvidia” -DMODULE -D"KBUILD_STR(s)=#s" -D"KBUILD_BASENAME=KBUILD_STR(os_pci)" -D"KBUILD_MODNAME=KBUILD_STR(nvidia)" -c -o /var/lib/dkms/nvidia-340/340.96/build/.tmp_os-pci.o /var/lib/dkms/nvidia-340/340.96/build/os-pci.c
cc: error: unrecognized command line option ‘-fstack-protector-strong’
make[2]: *** [/var/lib/dkms/nvidia-340/340.96/build/os-pci.o] Errore 1
cc -Wp,-MD,/var/lib/dkms/nvidia-340/340.96/build/.os-registry.o.d -nostdinc -isystem /usr/lib/gcc/x86_64-linux-gnu/4.8/include -I./arch/x86/include -Iarch/x86/include/generated/uapi -Iarch/x86/include/generated -Iinclude -I./arch/x86/include/uapi -Iarch/x86/include/generated/uapi -I./include/uapi -Iinclude/generated/uapi -include ./include/linux/kconfig.h -Iubuntu/include -D__KERNEL__ -Wall -Wundef -Wstrict-prototypes -Wno-trigraphs -fno-strict-aliasing -fno-common -Werror-implicit-function-declaration -Wno-format-security -std=gnu89 -mno-sse -mno-mmx -mno-sse2 -mno-3dnow -mno-avx -m64 -falign-jumps=1 -falign-loops=1 -mno-80387 -mno-fp-ret-in-387 -mpreferred-stack-boundary=3 -mtune=generic -mno-red-zone -mcmodel=kernel -funit-at-a-time -maccumulate-outgoing-args -DCONFIG_X86_X32_ABI -DCONFIG_AS_FXSAVEQ=1 -DCONFIG_AS_SSSE3=1 -DCONFIG_AS_CRC32=1 -DCONFIG_AS_AVX=1 -DCONFIG_AS_AVX2=1 -pipe -Wno-sign-compare -fno-asynchronous-unwind-tables -fno-delete-null-pointer-checks -O2 --param=allow-store-data-races=0 -Wframe-larger-than=1024 -fstack-protector-strong -fno-omit-frame-pointer -fno-optimize-sibling-calls -pg -DCC_HAVE_ASM_GOTO -DNV_MODULE_INSTANCE=0 -DNV_BUILD_MODULE_INSTANCES=0 -UDEBUG -U_DEBUG -DNDEBUG -I/var/lib/dkms/nvidia-340/340.96/build -Wall -MD -Wsign-compare -Wno-cast-qual -Wno-error -D__KERNEL__ -DMODULE -DNVRM -DNV_VERSION_STRING=“340.96” -Wno-unused-function -Wuninitialized -fno-strict-aliasing -mno-red-zone -mcmodel=kernel -DNV_UVM_ENABLE -D__linux__ -DNV_DEV_NAME=“nvidia” -DMODULE -D"KBUILD_STR(s)=#s" -D"KBUILD_BASENAME=KBUILD_STR(os_registry)" -D"KBUILD_MODNAME=KBUILD_STR(nvidia)" -c -o /var/lib/dkms/nvidia-340/340.96/build/.tmp_os-registry.o /var/lib/dkms/nvidia-340/340.96/build/os-registry.c
cc: error: unrecognized command line option ‘-fstack-protector-strong’
make[2]: *** [/var/lib/dkms/nvidia-340/340.96/build/os-registry.o] Errore 1
cc -Wp,-MD,/var/lib/dkms/nvidia-340/340.96/build/.os-smp.o.d -nostdinc -isystem /usr/lib/gcc/x86_64-linux-gnu/4.8/include -I./arch/x86/include -Iarch/x86/include/generated/uapi -Iarch/x86/include/generated -Iinclude -I./arch/x86/include/uapi -Iarch/x86/include/generated/uapi -I./include/uapi -Iinclude/generated/uapi -include ./include/linux/kconfig.h -Iubuntu/include -D__KERNEL__ -Wall -Wundef -Wstrict-prototypes -Wno-trigraphs -fno-strict-aliasing -fno-common -Werror-implicit-function-declaration -Wno-format-security -std=gnu89 -mno-sse -mno-mmx -mno-sse2 -mno-3dnow -mno-avx -m64 -falign-jumps=1 -falign-loops=1 -mno-80387 -mno-fp-ret-in-387 -mpreferred-stack-boundary=3 -mtune=generic -mno-red-zone -mcmodel=kernel -funit-at-a-time -maccumulate-outgoing-args -DCONFIG_X86_X32_ABI -DCONFIG_AS_FXSAVEQ=1 -DCONFIG_AS_SSSE3=1 -DCONFIG_AS_CRC32=1 -DCONFIG_AS_AVX=1 -DCONFIG_AS_AVX2=1 -pipe -Wno-sign-compare -fno-asynchronous-unwind-tables -fno-delete-null-pointer-checks -O2 --param=allow-store-data-races=0 -Wframe-larger-than=1024 -fstack-protector-strong -fno-omit-frame-pointer -fno-optimize-sibling-calls -pg -DCC_HAVE_ASM_GOTO -DNV_MODULE_INSTANCE=0 -DNV_BUILD_MODULE_INSTANCES=0 -UDEBUG -U_DEBUG -DNDEBUG -I/var/lib/dkms/nvidia-340/340.96/build -Wall -MD -Wsign-compare -Wno-cast-qual -Wno-error -D__KERNEL__ -DMODULE -DNVRM -DNV_VERSION_STRING=“340.96” -Wno-unused-function -Wuninitialized -fno-strict-aliasing -mno-red-zone -mcmodel=kernel -DNV_UVM_ENABLE -D__linux__ -DNV_DEV_NAME=“nvidia” -DMODULE -D"KBUILD_STR(s)=#s" -D"KBUILD_BASENAME=KBUILD_STR(os_smp)" -D"KBUILD_MODNAME=KBUILD_STR(nvidia)" -c -o /var/lib/dkms/nvidia-340/340.96/build/.tmp_os-smp.o /var/lib/dkms/nvidia-340/340.96/build/os-smp.c
cc: error: unrecognized command line option ‘-fstack-protector-strong’
make[2]: *** [/var/lib/dkms/nvidia-340/340.96/build/os-smp.o] Errore 1
cc -Wp,-MD,/var/lib/dkms/nvidia-340/340.96/build/.os-usermap.o.d -nostdinc -isystem /usr/lib/gcc/x86_64-linux-gnu/4.8/include -I./arch/x86/include -Iarch/x86/include/generated/uapi -Iarch/x86/include/generated -Iinclude -I./arch/x86/include/uapi -Iarch/x86/include/generated/uapi -I./include/uapi -Iinclude/generated/uapi -include ./include/linux/kconfig.h -Iubuntu/include -D__KERNEL__ -Wall -Wundef -Wstrict-prototypes -Wno-trigraphs -fno-strict-aliasing -fno-common -Werror-implicit-function-declaration -Wno-format-security -std=gnu89 -mno-sse -mno-mmx -mno-sse2 -mno-3dnow -mno-avx -m64 -falign-jumps=1 -falign-loops=1 -mno-80387 -mno-fp-ret-in-387 -mpreferred-stack-boundary=3 -mtune=generic -mno-red-zone -mcmodel=kernel -funit-at-a-time -maccumulate-outgoing-args -DCONFIG_X86_X32_ABI -DCONFIG_AS_FXSAVEQ=1 -DCONFIG_AS_SSSE3=1 -DCONFIG_AS_CRC32=1 -DCONFIG_AS_AVX=1 -DCONFIG_AS_AVX2=1 -pipe -Wno-sign-compare -fno-asynchronous-unwind-tables -fno-delete-null-pointer-checks -O2 --param=allow-store-data-races=0 -Wframe-larger-than=1024 -fstack-protector-strong -fno-omit-frame-pointer -fno-optimize-sibling-calls -pg -DCC_HAVE_ASM_GOTO -DNV_MODULE_INSTANCE=0 -DNV_BUILD_MODULE_INSTANCES=0 -UDEBUG -U_DEBUG -DNDEBUG -I/var/lib/dkms/nvidia-340/340.96/build -Wall -MD -Wsign-compare -Wno-cast-qual -Wno-error -D__KERNEL__ -DMODULE -DNVRM -DNV_VERSION_STRING=“340.96” -Wno-unused-function -Wuninitialized -fno-strict-aliasing -mno-red-zone -mcmodel=kernel -DNV_UVM_ENABLE -D__linux__ -DNV_DEV_NAME=“nvidia” -DMODULE -D"KBUILD_STR(s)=#s" -D"KBUILD_BASENAME=KBUILD_STR(os_usermap)" -D"KBUILD_MODNAME=KBUILD_STR(nvidia)" -c -o /var/lib/dkms/nvidia-340/340.96/build/.tmp_os-usermap.o /var/lib/dkms/nvidia-340/340.96/build/os-usermap.c
cc: error: unrecognized command line option ‘-fstack-protector-strong’
make[2]: *** [/var/lib/dkms/nvidia-340/340.96/build/os-usermap.o] Errore 1
cc -Wp,-MD,/var/lib/dkms/nvidia-340/340.96/build/.nv_uvm_interface.o.d -nostdinc -isystem /usr/lib/gcc/x86_64-linux-gnu/4.8/include -I./arch/x86/include -Iarch/x86/include/generated/uapi -Iarch/x86/include/generated -Iinclude -I./arch/x86/include/uapi -Iarch/x86/include/generated/uapi -I./include/uapi -Iinclude/generated/uapi -include ./include/linux/kconfig.h -Iubuntu/include -D__KERNEL__ -Wall -Wundef -Wstrict-prototypes -Wno-trigraphs -fno-strict-aliasing -fno-common -Werror-implicit-function-declaration -Wno-format-security -std=gnu89 -mno-sse -mno-mmx -mno-sse2 -mno-3dnow -mno-avx -m64 -falign-jumps=1 -falign-loops=1 -mno-80387 -mno-fp-ret-in-387 -mpreferred-stack-boundary=3 -mtune=generic -mno-red-zone -mcmodel=kernel -funit-at-a-time -maccumulate-outgoing-args -DCONFIG_X86_X32_ABI -DCONFIG_AS_FXSAVEQ=1 -DCONFIG_AS_SSSE3=1 -DCONFIG_AS_CRC32=1 -DCONFIG_AS_AVX=1 -DCONFIG_AS_AVX2=1 -pipe -Wno-sign-compare -fno-asynchronous-unwind-tables -fno-delete-null-pointer-checks -O2 --param=allow-store-data-races=0 -Wframe-larger-than=1024 -fstack-protector-strong -fno-omit-frame-pointer -fno-optimize-sibling-calls -pg -DCC_HAVE_ASM_GOTO -DNV_MODULE_INSTANCE=0 -DNV_BUILD_MODULE_INSTANCES=0 -UDEBUG -U_DEBUG -DNDEBUG -I/var/lib/dkms/nvidia-340/340.96/build -Wall -MD -Wsign-compare -Wno-cast-qual -Wno-error -D__KERNEL__ -DMODULE -DNVRM -DNV_VERSION_STRING=“340.96” -Wno-unused-function -Wuninitialized -fno-strict-aliasing -mno-red-zone -mcmodel=kernel -DNV_UVM_ENABLE -D__linux__ -DNV_DEV_NAME=“nvidia” -DMODULE -D"KBUILD_STR(s)=#s" -D"KBUILD_BASENAME=KBUILD_STR(nv_uvm_interface)" -D"KBUILD_MODNAME=KBUILD_STR(nvidia)" -c -o /var/lib/dkms/nvidia-340/340.96/build/.tmp_nv_uvm_interface.o /var/lib/dkms/nvidia-340/340.96/build/nv_uvm_interface.c
cc: error: unrecognized command line option ‘-fstack-protector-strong’
make[2]: *** [/var/lib/dkms/nvidia-340/340.96/build/nv_uvm_interface.o] Errore 1
cc -Wp,-MD,/var/lib/dkms/nvidia-340/340.96/build/.nv-frontend.o.d -nostdinc -isystem /usr/lib/gcc/x86_64-linux-gnu/4.8/include -I./arch/x86/include -Iarch/x86/include/generated/uapi -Iarch/x86/include/generated -Iinclude -I./arch/x86/include/uapi -Iarch/x86/include/generated/uapi -I./include/uapi -Iinclude/generated/uapi -include ./include/linux/kconfig.h -Iubuntu/include -D__KERNEL__ -Wall -Wundef -Wstrict-prototypes -Wno-trigraphs -fno-strict-aliasing -fno-common -Werror-implicit-function-declaration -Wno-format-security -std=gnu89 -mno-sse -mno-mmx -mno-sse2 -mno-3dnow -mno-avx -m64 -falign-jumps=1 -falign-loops=1 -mno-80387 -mno-fp-ret-in-387 -mpreferred-stack-boundary=3 -mtune=generic -mno-red-zone -mcmodel=kernel -funit-at-a-time -maccumulate-outgoing-args -DCONFIG_X86_X32_ABI -DCONFIG_AS_FXSAVEQ=1 -DCONFIG_AS_SSSE3=1 -DCONFIG_AS_CRC32=1 -DCONFIG_AS_AVX=1 -DCONFIG_AS_AVX2=1 -pipe -Wno-sign-compare -fno-asynchronous-unwind-tables -fno-delete-null-pointer-checks -O2 --param=allow-store-data-races=0 -Wframe-larger-than=1024 -fstack-protector-strong -fno-omit-frame-pointer -fno-optimize-sibling-calls -pg -DCC_HAVE_ASM_GOTO -DNV_MODULE_INSTANCE=0 -DNV_BUILD_MODULE_INSTANCES=0 -UDEBUG -U_DEBUG -DNDEBUG -I/var/lib/dkms/nvidia-340/340.96/build -Wall -MD -Wsign-compare -Wno-cast-qual -Wno-error -D__KERNEL__ -DMODULE -DNVRM -DNV_VERSION_STRING=“340.96” -Wno-unused-function -Wuninitialized -fno-strict-aliasing -mno-red-zone -mcmodel=kernel -DNV_UVM_ENABLE -D__linux__ -DNV_DEV_NAME=“nvidia” -DMODULE -D"KBUILD_STR(s)=#s" -D"KBUILD_BASENAME=KBUILD_STR(nv_frontend)" -D"KBUILD_MODNAME=KBUILD_STR(nvidia)" -c -o /var/lib/dkms/nvidia-340/340.96/build/.tmp_nv-frontend.o /var/lib/dkms/nvidia-340/340.96/build/nv-frontend.c
cc: error: unrecognized command line option ‘-fstack-protector-strong’
make[2]: *** [/var/lib/dkms/nvidia-340/340.96/build/nv-frontend.o] Errore 1
(cat /dev/null; echo kernel//var/lib/dkms/nvidia-340/340.96/build/nvidia.ko;) > /var/lib/dkms/nvidia-340/340.96/build/modules.order
make[2]: L’obiettivo “__build” non è stato rigenerato a causa di errori.
make[1]: *** [module/var/lib/dkms/nvidia-340/340.96/build] Errore 2
make[1]: L’obiettivo “modules” non è stato rigenerato a causa di errori.
make[1]: uscita dalla directory “/usr/src/linux-headers-4.3.0-4-exton”
NVIDIA: left KBUILD.
nvidia.ko failed to build!
make: *** [nvidia.ko] Errore 1
make: L’obiettivo “module” non è stato rigenerato a causa di errori.
make: ingresso nella directory “/var/lib/dkms/nvidia-340/340.96/build/uvm”
cd ./…; make module SYSSRC=/lib/modules/4.3.0-4-exton/build SYSOUT=/lib/modules/4.3.0-4-exton/build KBUILD_EXTMOD=./…
make[1]: ingresso nella directory “/var/lib/dkms/nvidia-340/340.96/build”
NVIDIA: calling KBUILD…
make[2]: ingresso nella directory “/usr/src/linux-headers-4.3.0-4-exton”
Makefile:669: Cannot use CONFIG_CC_STACKPROTECTOR_STRONG: -fstack-protector-strong not supported by compiler
test -e include/generated/autoconf.h -a -e include/config/auto.conf || (
echo >&2;
echo >&2 " ERROR: Kernel configuration is invalid.";
echo >&2 " include/generated/autoconf.h or include/config/auto.conf are missing.";
echo >&2 " Run ‘make oldconfig && make prepare’ on kernel src to fix it.";
echo >&2 ;
/bin/false)
mkdir -p ./…/.tmp_versions ; rm -f ./…/.tmp_versions/*
make -f ./scripts/Makefile.build obj=./…
./scripts/Makefile.build:44: …/Makefile: File o directory non esistente
make[3]: *** Nessuna regola per generare l’obiettivo “…/Makefile”. Arresto.
make[2]: *** [module./…] Errore 2
make[2]: uscita dalla directory “/usr/src/linux-headers-4.3.0-4-exton”
NVIDIA: left KBUILD.
nvidia.ko failed to build!
make[1]: *** [nvidia.ko] Errore 1
make[1]: uscita dalla directory “/var/lib/dkms/nvidia-340/340.96/build”
make: *** […/Module.symvers] Errore 2
make: uscita dalla directory “/var/lib/dkms/nvidia-340/340.96/build/uvm”

make.log (47 KB)

Hi there,

this is definitive not a NVidia problem you claim here. It is simply compiler related. Particular it is related to Linux Mint. Linux Mint is using a really old compiler toolchain as it is based on Ubuntu 14.04 LTS. Its toolchain simply don’t support this new feature -fstack-protector-strong with the kernel was build with:

There are several issues posted about that already:

https://forums.virtualbox.org/viewtopic.php?f=7&t=74238
https://github.com/longsleep/bcmwl-ubuntu/issues/12

So, either you use a working kernel, which was compiled by the given toolchain of Linux Mint 17.2 / Ubuntu 14.04 or you update it to a newer one, which supports that needed fstack feature:

https://launchpad.net/~sergey-dryabzhinsky/+archive/ubuntu/toolchain

greez
Phil

Thanks Phil,

great man for a great distro.

You only gave me the right answer.

For other users this is what i did:

sudo su -

add-apt-repository ppa:sergey-dryabzhinsky/toolchain

apt-get update

apt-get install gcc-4.9 g+±4.9 cpp-4.9

cd /usr/bin

rm gcc g++ cpp

ln -s gcc-4.9 gcc

ln -s g+±4.9 g++

ln -s cpp-4.9 cpp

and verified with

gcc --version

If interested you may find more here:

Hoping Mint’s Clement Lefebvre will correct this in the next release.

Thanks again.

Regards.