Unable to install 319.32 in Fedora 19 Kernel 3.10.3-300 DKMS as well

I have had no problems in manually installing the drivers with previous kernels but this new kernel was released today so I upgraded and have been unable to install the drivers against it.

My nvidia-install.log file is as follows:

nvidia-installer log file '/var/log/nvidia-installer.log'
creation time: Sun Jul 28 08:49:19 2013
installer version: 319.32

PATH: /usr/lib/qt-3.3/bin:/usr/local/sbin:/usr/local/bin:/sbin:/bin:/usr/sbin:/usr/bin:/root/bin

nvidia-installer command line:
    ./nvidia-installer
    -a

Using: nvidia-installer ncurses user interface
WARNING: Skipping the runlevel check (the utility `runlevel` failed to run).
-> Tagging shared libraries with chcon -t textrel_shlib_t.
-> License accepted by command line option.
-> Installing NVIDIA driver version 319.32.
-> There appears to already be a driver installed on your system (version: 319.32).  As part of installing this driver (version: 319.32), the existing driver will be uninstalled.  Are you sure you want to continue? ('no' will abort installation) (Answer: Yes)
-> Would you like to register the kernel module sources with DKMS? This will allow DKMS to automatically build a new module, if you install a different kernel later. (Answer: No)
-> Performing CC sanity check with CC="cc".
-> Kernel source path: '/lib/modules/3.10.3-300.fc19.i686/source'
-> Kernel output path: '/lib/modules/3.10.3-300.fc19.i686/build'
-> Performing rivafb check.
-> Performing nvidiafb check.
-> Performing Xen check.
-> Cleaning kernel module build directory.
   executing: 'cd ./kernel; make clean'...
-> Building kernel module:
   executing: 'cd ./kernel; make module SYSSRC=/lib/modules/3.10.3-300.fc19.i686/source SYSOUT=/lib/modules/3.10.3-300.fc19.i686/build'...
   NVIDIA: calling KBUILD...
   make -C /lib/modules/3.10.3-300.fc19.i686/build \
   KBUILD_SRC=/usr/src/kernels/3.10.3-300.fc19.i686 \
   KBUILD_EXTMOD="/tmp/selfgz2365/NVIDIA-Linux-x86-319.32/kernel" -f /usr/src/kernels/3.10.3-300.fc19.i686/Makefile \
   modules
   test -e include/generated/autoconf.h -a -e include/config/auto.conf || (		\
   echo >&2;							\
   echo >&2 "  ERROR: Kernel configuration is invalid.";		\
   echo >&2 "         include/generated/autoconf.h or include/config/auto.conf are missing.";\
   echo >&2 "         Run 'make oldconfig && make prepare' on kernel src to fix it.";	\
   echo >&2 ;							\
   /bin/false)
   mkdir -p /tmp/selfgz2365/NVIDIA-Linux-x86-319.32/kernel/.tmp_versions ; rm -f /tmp/selfgz2365/NVIDIA-Linux-x86-319.32/kernel/.tmp_versions/*
   make -f /usr/src/kernels/3.10.3-300.fc19.i686/scripts/Makefile.build obj=/tmp/selfgz2365/NVIDIA-Linux-x86-319.32/kernel
     cc -Wp,-MD,/tmp/selfgz2365/NVIDIA-Linux-x86-319.32/kernel/.nv.o.d  -nostdinc -isystem /usr/lib/gcc/i686-redhat-linux/4.8.1/include -I/usr/src/kernels/3.10.3-300.fc19.i686/arch/x86/include -Iarch/x86/include/generated  -I/usr/src/kernels/3.10.3-300.fc19.i686/include -Iinclude -I/usr/src/kernels/3.10.3-300.fc19.i686/arch/x86/include/uapi -Iarch/x86/include/generated/uapi -I/usr/src/kernels/3.10.3-300.fc19.i686/include/uapi -Iinclude/generated/uapi -include /usr/src/kernels/3.10.3-300.fc19.i686/include/linux/kconfig.h   -I/tmp/selfgz2365/NVIDIA-Linux-x86-319.32/kernel -D__KERNEL__ -Wall -Wundef -Wstrict-prototypes -Wno-trigraphs -fno-strict-aliasing -fno-common -Werror-implicit-function-declaration -Wno-format-security -fno-delete-null-pointer-checks -O2 -m32 -msoft-float -mregparm=3 -freg-struct-return -fno-pic -mpreferred-stack-boundary=2 -march=i686 -mtune=generic -maccumulate-outgoing-args -Wa,-mtune=generic32 -ffreestanding -fstack-protector -DCONFIG_AS_CFI=1 -DCONFIG_AS_CFI_SIGNAL_FRAME=1 -DCONFIG_AS_CFI_SECTIONS=1 -DCONFIG_AS_AVX=1 -DCONFIG_AS_AVX2=1 -pipe -Wno-sign-compare -fno-asynchronous-unwind-tables -mno-sse -mno-mmx -mno-sse2 -mno-3dnow -mno-avx 
   -Wframe-larger-than=1024 -Wno-unused-but-set-variable -fno-omit-frame-pointer -fno-optimize-sibling-calls -g -pg -Wdeclaration-after-statement -Wno-pointer-sign -fno-strict-overflow -fconserve-stack -DCC_HAVE_ASM_GOTO   -I/tmp/selfgz2365/NVIDIA-Linux-x86-319.32/kernel -Wall -MD -Wsign-compare -Wno-cast-qual -Wno-error -D__KERNEL__ -DMODULE -DNVRM -DNV_VERSION_STRING=\"319.32\" -Wno-unused-function -Wuninitialized -UDEBUG -U_DEBUG -DNDEBUG -D__linux__  -DMODULE  -D"KBUILD_STR(s)=#s" -D"KBUILD_BASENAME=KBUILD_STR(nv)"  -D"KBUILD_MODNAME=KBUILD_STR(nvidia)" -c -o /tmp/selfgz2365/NVIDIA-Linux-x86-319.32/kernel/nv.o /tmp/selfgz2365/NVIDIA-Linux-x86-319.32/kernel/nv.c
   In file included from /usr/src/kernels/3.10.3-300.fc19.i686/arch/x86/include/asm/bitops.h:514:0,
                    from /usr/src/kernels/3.10.3-300.fc19.i686/include/linux/bitops.h:22,
                    from /usr/src/kernels/3.10.3-300.fc19.i686/include/linux/kernel.h:10,
                    from /usr/src/kernels/3.10.3-300.fc19.i686/include/linux/sched.h:15,
                    from /usr/src/kernels/3.10.3-300.fc19.i686/include/linux/utsname.h:5,
                    from /tmp/selfgz2365/NVIDIA-Linux-x86-319.32/kernel/nv-linux.h:44,
                    from /tmp/selfgz2365/NVIDIA-Linux-x86-319.32/kernel/nv.c:13:
   /usr/src/kernels/3.10.3-300.fc19.i686/include/linux/bitops.h: In function ‘hweight_long’:
   /usr/src/kernels/3.10.3-300.fc19.i686/include/asm-generic/bitops/const_hweight.h:26:70: warning: signed and unsigned type in conditional expression [-Wsign-compare]
    #define hweight32(w) (__builtin_constant_p(w) ? __const_hweight32(w) : __arch_hweight32(w))
                                                                         ^
   /usr/src/kernels/3.10.3-300.fc19.i686/include/linux/bitops.h:66:26: note: in expansion of macro ‘hweight32’
     return sizeof(w) == 4 ? hweight32(w) : hweight64(w);
                             ^
   In file included from /usr/src/kernels/3.10.3-300.fc19.i686/arch/x86/include/asm/cpumask.h:4:0,
                    from /usr/src/kernels/3.10.3-300.fc19.i686/arch/x86/include/asm/msr.h:10,
                    from /usr/src/kernels/3.10.3-300.fc19.i686/arch/x86/include/asm/processor.h:20,
                    from /usr/src/kernels/3.10.3-300.fc19.i686/arch/x86/include/asm/thread_info.h:22,
                    from /usr/src/kernels/3.10.3-300.fc19.i686/include/linux/thread_info.h:54,
                    from /usr/src/kernels/3.10.3-300.fc19.i686/include/linux/preempt.h:9,
                    from /usr/src/kernels/3.10.3-300.fc19.i686/include/linux/spinlock.h:50,
                    from /usr/src/kernels/3.10.3-300.fc19.i686/include/linux/seqlock.h:29,
                    from /usr/src/kernels/3.10.3-300.fc19.i686/include/linux/time.h:5,
                    from /usr/src/kernels/3.10.3-300.fc19.i686/include/uapi/linux/timex.h:56,
                    from /usr/src/kernels/3.10.3-300.fc19.i686/include/linux/timex.h:56,
                    from /usr/src/kernels/3.10.3-300.fc19.i686/include/linux/sched.h:17,
                    from /usr/src/kernels/3.10.3-300.fc19.i686/include/linux/utsname.h:5,
                    from /tmp/selfgz2365/NVIDIA-Linux-x86-319.32/kernel/nv-linux.h:44,
                    from /tmp/selfgz2365/NVIDIA-Linux-x86-319.32/kernel/nv.c:13:
   /usr/src/kernels/3.10.3-300.fc19.i686/include/linux/cpumask.h: In function ‘cpumask_parse’:
   /usr/src/kernels/3.10.3-300.fc19.i686/include/linux/cpumask.h:603:26: warning: signed and unsigned type in conditional expression [-Wsign-compare]
     int len = nl ? nl - buf : strlen(buf);
                             ^
   In file included from /usr/src/kernels/3.10.3-300.fc19.i686/include/uapi/linux/stddef.h:1:0,
                    from /usr/src/kernels/3.10.3-300.fc19.i686/include/linux/stddef.h:4,
                    from /usr/src/kernels/3.10.3-300.fc19.i686/include/uapi/linux/posix_types.h:4,
                    from /usr/src/kernels/3.10.3-300.fc19.i686/include/uapi/linux/types.h:13,
                    from /usr/src/kernels/3.10.3-300.fc19.i686/include/linux/types.h:5,
                    from /usr/src/kernels/3.10.3-300.fc19.i686/include/uapi/linux/capability.h:16,
                    from /usr/src/kernels/3.10.3-300.fc19.i686/include/linux/capability.h:15,
                    from /usr/src/kernels/3.10.3-300.fc19.i686/include/linux/sched.h:13,
                    from /usr/src/kernels/3.10.3-300.fc19.i686/include/linux/utsname.h:5,
                    from /tmp/selfgz2365/NVIDIA-Linux-x86-319.32/kernel/nv-linux.h:44,
                    from /tmp/selfgz2365/NVIDIA-Linux-x86-319.32/kernel/nv.c:13:
   /usr/src/kernels/3.10.3-300.fc19.i686/arch/x86/include/asm/uaccess_32.h: In function ‘copy_from_user’:
   /usr/src/kernels/3.10.3-300.fc19.i686/arch/x86/include/asm/uaccess_32.h:208:28: warning: comparison between signed and unsigned integer expressions [-Wsign-compare]
     if (likely(sz == -1 || sz >= n))
                               ^
   /usr/src/kernels/3.10.3-300.fc19.i686/include/linux/compiler.h:152:40: note: in definition of macro ‘likely’
    # define likely(x) __builtin_expect(!!(x), 1)
                                           ^
     if [ "-pg" = "-pg" ]; then if [ /tmp/selfgz2365/NVIDIA-Linux-x86-319.32/kernel/nv.o != "scripts/mod/empty.o" ]; then /usr/src/kernels/3.10.3-300.fc19.i686/scripts/recordmcount  "/tmp/selfgz2365/NVIDIA-Linux-x86-319.32/kernel/nv.o"; fi; fi;
     cc -Wp,-MD,/tmp/selfgz2365/NVIDIA-Linux-x86-319.32/kernel/.nv-acpi.o.d  -nostdinc -isystem /usr/lib/gcc/i686-redhat-linux/4.8.1/include -I/usr/src/kernels/3.10.3-300.fc19.i686/arch/x86/include -Iarch/x86/include/generated  -I/usr/src/kernels/3.10.3-300.fc19.i686/include -Iinclude -I/usr/src/kernels/3.10.3-300.fc19.i686/arch/x86/include/uapi -Iarch/x86/include/generated/uapi -I/usr/src/kernels/3.10.3-300.fc19.i686/include/uapi -Iinclude/generated/uapi -include /usr/src/kernels/3.10.3-300.fc19.i686/include/linux/kconfig.h   -I/tmp/selfgz2365/NVIDIA-Linux-x86-319.32/kernel -D__KERNEL__ -Wall -Wundef -Wstrict-prototypes -Wno-trigraphs -fno-strict-aliasing -fno-common -Werror-implicit-function-declaration -Wno-format-security -fno-delete-null-pointer-checks -O2 -m32 -msoft-float -mregparm=3 -freg-struct-return -fno-pic -mpreferred-stack-b
   oundary=2 -march=i686 -mtune=generic -maccumulate-outgoing-args -Wa,-mtune=generic32 -ffreestanding -fstack-protector -DCONFIG_AS_CFI=1 -DCONFIG_AS_CFI_SIGNAL_FRAME=1 -DCONFIG_AS_CFI_SECTIONS=1 -DCONFIG_AS_AVX=1 -DCONFIG_AS_AVX2=1 -pipe -Wno-sign-compare -fno-asynchronous-unwind-tables -mno-sse -mno-mmx -mno-sse2 -mno-3dnow -mno-avx -Wframe-larger-than=1024 -Wno-unused-but-set-variable -fno-omit-frame-pointer -fno-optimize-sibling-calls -g -pg -Wdeclaration-after-statement -Wno-pointer-sign -fno-strict-overflow -fconserve-stack -DCC_HAVE_ASM_GOTO   -I/tmp/selfgz2365/NVIDIA-Linux-x86-319.32/kernel -Wall -MD -Wsign-compare -Wno-cast-qual -Wno-error -D__KERNEL__ -DMODULE -DNVRM -DNV_VERSION_STRING=\"319.32\" -Wno-unused-function -Wuninitialized -UDEBUG -U_DEBUG -DNDEBUG -D__linux__  -DMODULE  -D"KBUILD_STR(s)=#s" -D"KBUILD_BASENAME=KBUILD_STR(nv_acpi)"  -D"KBUILD_MODNAME=KBUILD_STR(nvidia)" -c -o /tmp/selfgz2365/NVIDIA-Linux-x86-319.32/kernel/nv-acpi.o /tmp/selfgz2365/NVIDIA-Linux-x86-319.32/kernel/nv-acpi.c
   In file included from /usr/src/kernels/3.10.3-300.fc19.i686/arch/x86/include/asm/bitops.h:514:0,
                    from /usr/src/kernels/3.10.3-300.fc19.i686/include/linux/bitops.h:22,
                    from /usr/src/kernels/3.10.3-300.fc19.i686/include/linux/kernel.h:10,
                    from /usr/src/kernels/3.10.3-300.fc19.i686/include/linux/sched.h:15,
                    from /usr/src/kernels/3.10.3-300.fc19.i686/include/linux/utsname.h:5,
                    from /tmp/selfgz2365/NVIDIA-Linux-x86-319.32/kernel/nv-linux.h:44,
                    from /tmp/selfgz2365/NVIDIA-Linux-x86-319.32/kernel/nv-acpi.c:15:
   /usr/src/kernels/3.10.3-300.fc19.i686/include/linux/bitops.h: In function ‘hweight_long’:
   /usr/src/kernels/3.10.3-300.fc19.i686/include/asm-generic/bitops/const_hweight.h:26:70: warning: signed and unsigned type in conditional expression [-Wsign-compare]
    #define hweight32(w) (__builtin_constant_p(w) ? __const_hweight32(w) : __arch_hweight32(w))
                                                                         ^
   /usr/src/kernels/3.10.3-300.fc19.i686/include/linux/bitops.h:66:26: note: in expansion of macro ‘hweight32’
     return sizeof(w) == 4 ? hweight32(w) : hweight64(w);
                             ^
   In file included from /usr/src/kernels/3.10.3-300.fc19.i686/arch/x86/include/asm/cpumask.h:4:0,
                    from /usr/src/kernels/3.10.3-300.fc19.i686/arch/x86/include/asm/msr.h:10,
                    from /usr/src/kernels/3.10.3-300.fc19.i686/arch/x86/include/asm/processor.h:20,
                    from /usr/src/kernels/3.10.3-300.fc19.i686/arch/x86/include/asm/thread_info.h:22,
                    from /usr/src/kernels/3.10.3-300.fc19.i686/include/linux/thread_info.h:54,
                    from /usr/src/kernels/3.10.3-300.fc19.i686/include/linux/preempt.h:9,
                    from /usr/src/kernels/3.10.3-300.fc19.i686/include/linux/spinlock.h:50,
                    from /usr/src/kernels/3.10.3-300.fc19.i686/include/linux/seqlock.h:29,
                    from /usr/src/kernels/3.10.3-300.fc19.i686/include/linux/time.h:5,
                    from /usr/src/kernels/3.10.3-300.fc19.i686/include/uapi/linux/timex.h:56,
                    from /usr/src/kernels/3.10.3-300.fc19.i686/include/linux/timex.h:56,
                    from /usr/src/kernels/3.10.3-300.fc19.i686/include/linux/sched.h:17,
                    from /usr/src/kernels/3.10.3-300.fc19.i686/include/linux/utsname.h:5,
                    from /tmp/selfgz2365/NVIDIA-Linux-x86-319.32/kernel/nv-linux.h:44,
                    from /tmp/selfgz2365/NVIDIA-Linux-x86-319.32/kernel/nv-acpi.c:15:
   /usr/src/kernels/3.10.3-300.fc19.i686/include/linux/cpumask.h: In function ‘cpumask_parse’:
   /usr/src/kernels/3.10.3-300.fc19.i686/include/linux/cpumask.h:603:26: warning: signed and unsigned type in conditional expression [-Wsign-compare]
     int len = nl ? nl - buf : strlen(buf);
                             ^
   In file included from /usr/src/kernels/3.10.3-300.fc19.i686/include/uapi/linux/stddef.h:1:0,
                    from /usr/src/kernels/3.10.3-300.fc19.i686/include/linux/stddef.h:4,
                    from /usr/src/kernels/3.10.3-300.fc19.i686/include/uapi/linux/posix_types.h:4,
                    from /usr/src/kernels/3.10.3-300.fc19.i686/include/uapi/linux/types.h:13,
                    from /usr/src/kernels/3.10.3-300.fc19.i686/include/linux/types.h:5,
                    from /usr/src/kernels/3.10.3-300.fc19.i686/include/uapi/linux/capability.h:16,
                    from /usr/src/kernels/3.10.3-300.fc19.i686/include/linux/capability.h:15,
                    from /usr/src/kernels/3.10.3-300.fc19.i686/include/linux/sched.h:13,
                    from /usr/src/kernels/3.10.3-300.fc19.i686/include/linux/utsname.h:5,
                    from /tmp/selfgz2365/NVIDIA-Linux-x86-319.32/kernel/nv-linux.h:44,
                    from /tmp/selfgz2365/NVIDIA-Linux-x86-319.32/kernel/nv-acpi.c:15:
   /usr/src/kernels/3.10.3-300.fc19.i686/arch/x86/include/asm/uaccess_32.h: In function ‘copy_from_user’:
   /usr/src/kernels/3.10.3-300.fc19.i686/arch/x86/include/asm/uaccess_32.h:208:28: warning: comparison between signed and unsigned integer expressions [-Wsign-compare]
     if (likely(sz == -1 || sz >= n))
                               ^
   /usr/src/kernels/3.10.3-300.fc19.i686/include/linux/compiler.h:152:40: note: in definition of macro ‘likely’
    # define likely(x) __builtin_expect(!!(x), 1)
                                           ^
   /tmp/selfgz2365/NVIDIA-Linux-x86-319.32/kernel/nv-acpi.c: At top level:
   /tmp/selfgz2365/NVIDIA-Linux-x86-319.32/kernel/nv-acpi.c:70:9: warning: initialization from incompatible pointer type [enabled by default]
            .remove = nv_acpi_remove,
            ^
   /tmp/selfgz2365/NVIDIA-Linux-x86-319.32/kernel/nv-acpi.c:70:9: warning: (near initialization for ‘nv_acpi_driver_template.ops.remove’) [enabled by default]
     if [ "-pg" = "-pg" ]; then if [ /tmp/selfgz2365/NVIDIA-Linux-x86-319.32/kernel/nv-acpi.o != "scripts/mod/empty.o" ]; then /usr/src/kernels/3.10.3-300.fc19.i686/scripts/recordmcount  "/tmp/selfgz2365/NVIDIA-Linux-x86-319.32/kernel/nv-acpi.o"; fi; fi;
     cc -Wp,-MD,/tmp/selfgz2365/NVIDIA-Linux-x86-319.32/kernel/.nv-chrdev.o.d  -nostdinc -isystem /usr/lib/gcc/i686-redhat-linux/4.8.1/include -I/usr/src/kernels/3.10.3-300.fc19.i686/arch/x86/include -Iarch/x86/include/generated  -I/usr/src/kernels/3.10.3-300.fc19.i686/include -Iinclude -I/usr/src/kernels/3.10.3-300.fc19.i686/arch/x86/include/uapi -Iarch/x86/include/generated/uapi -I/usr/src/kernels/3.10.3-300.fc19.i686/include/uapi -Iinclude/generated/uapi -include /usr/src/kernels/3.10.3-300.fc19.i686/include/linux/kconfig.h   -I/tmp/selfgz2365/NVIDIA-Linux-x86-319.32/kernel -D__KERNEL__ -Wall -Wundef -Wstrict-prototypes -Wno-trigraphs -fno-strict-aliasing -fno-common -Werror-implicit-function-declaration -Wno-format-security -fno-delete-null-pointer-checks -O2 -m32 -msoft-float -mregparm=3 -freg-struct-return -fno-pic -mpreferred-stack-boundary=2 -march=i686 -mtune=generic -maccumulate-outgoing-args -Wa,-mtune=generic32 -ffreestanding -fstack-protector -DCONFIG_AS_CFI=1 -DCONFIG_AS_CFI_SIGNAL_FRAME=1 -DCONFIG_AS_CFI_SECTIONS=1 -DCONFIG_AS_AVX=1 -DCONFIG_AS_AVX2=1
    -pipe -Wno-sign-compare -fno-asynchronous-unwind-tables -mno-sse -mno-mmx -mno-sse2 -mno-3dnow -mno-avx -Wframe-larger-than=1024 -Wno-unused-but-set-variable -fno-omit-frame-pointer -fno-optimize-sibling-calls -g -pg -Wdeclaration-after-statement -Wno-pointer-sign -fno-strict-overflow -fconserve-stack -DCC_HAVE_ASM_GOTO   -I/tmp/selfgz2365/NVIDIA-Linux-x86-319.32/kernel -Wall -MD -Wsign-compare -Wno-cast-qual -Wno-error -D__KERNEL__ -DMODULE -DNVRM -DNV_VERSION_STRING=\"319.32\" -Wno-unused-function -Wuninitialized -UDEBUG -U_DEBUG -DNDEBUG -D__linux__  -DMODULE  -D"KBUILD_STR(s)=#s" -D"KBUILD_BASENAME=KBUILD_STR(nv_chrdev)"  -D"KBUILD_MODNAME=KBUILD_STR(nvidia)" -c -o /tmp/selfgz2365/NVIDIA-Linux-x86-319.32/kernel/nv-chrdev.o /tmp/selfgz2365/NVIDIA-Linux-x86-319.32/kernel/nv-chrdev.c
   In file included from /usr/src/kernels/3.10.3-300.fc19.i686/arch/x86/include/asm/bitops.h:514:0,
                    from /usr/src/kernels/3.10.3-300.fc19.i686/include/linux/bitops.h:22,
                    from /usr/src/kernels/3.10.3-300.fc19.i686/include/linux/kernel.h:10,
                    from /usr/src/kernels/3.10.3-300.fc19.i686/include/linux/sched.h:15,
                    from /usr/src/kernels/3.10.3-300.fc19.i686/include/linux/utsname.h:5,
                    from /tmp/selfgz2365/NVIDIA-Linux-x86-319.32/kernel/nv-linux.h:44,
                    from /tmp/selfgz2365/NVIDIA-Linux-x86-319.32/kernel/nv-chrdev.c:15:
   /usr/src/kernels/3.10.3-300.fc19.i686/include/linux/bitops.h: In function ‘hweight_long’:
   /usr/src/kernels/3.10.3-300.fc19.i686/include/asm-generic/bitops/const_hweight.h:26:70: warning: signed and unsigned type in conditional expression [-Wsign-compare]
    #define hweight32(w) (__builtin_constant_p(w) ? __const_hweight32(w) : __arch_hweight32(w))
                                                                         ^
   /usr/src/kernels/3.10.3-300.fc19.i686/include/linux/bitops.h:66:26: note: in expansion of macro ‘hweight32’
     return sizeof(w) == 4 ? hweight32(w) : hweight64(w);
                             ^
   In file included from /usr/src/kernels/3.10.3-300.fc19.i686/arch/x86/include/asm/cpumask.h:4:0,
                    from /usr/src/kernels/3.10.3-300.fc19.i686/arch/x86/include/asm/msr.h:10,
                    from /usr/src/kernels/3.10.3-300.fc19.i686/arch/x86/include/asm/processor.h:20,
                    from /usr/src/kernels/3.10.3-300.fc19.i686/arch/x86/include/asm/thread_info.h:22,
                    from /usr/src/kernels/3.10.3-300.fc19.i686/include/linux/thread_info.h:54,
                    from /usr/src/kernels/3.10.3-300.fc19.i686/include/linux/preempt.h:9,
                    from /usr/src/kernels/3.10.3-300.fc19.i686/include/linux/spinlock.h:50,
                    from /usr/src/kernels/3.10.3-300.fc19.i686/include/linux/seqlock.h:29,
                    from /usr/src/kernels/3.10.3-300.fc19.i686/include/linux/time.h:5,
                    from /usr/src/kernels/3.10.3-300.fc19.i686/include/uapi/linux/timex.h:56,
                    from /usr/src/kernels/3.10.3-300.fc19.i686/include/linux/timex.h:56,
                    from /usr/src/kernels/3.10.3-300.fc19.i686/include/linux/sched.h:17,
                    from /usr/src/kernels/3.10.3-300.fc19.i686/include/linux/utsname.h:5,
                    from /tmp/selfgz2365/NVIDIA-Linux-x86-319.32/kernel/nv-linux.h:44,
                    from /tmp/selfgz2365/NVIDIA-Linux-x86-319.32/kernel/nv-chrdev.c:15:
   /usr/src/kernels/3.10.3-300.fc19.i686/include/linux/cpumask.h: In function ‘cpumask_parse’:
   /usr/src/kernels/3.10.3-300.fc19.i686/include/linux/cpumask.h:603:26: warning: signed and unsigned type in conditional expression [-Wsign-compare]
     int len = nl ? nl - buf : strlen(buf);
                             ^
   In file included from /usr/src/kernels/3.10.3-300.fc19.i686/include/uapi/linux/stddef.h:1:0,
                    from /usr/src/kernels/3.10.3-300.fc19.i686/include/linux/stddef.h:4,
                    from /usr/src/kernels/3.10.3-300.fc19.i686/include/uapi/linux/posix_types.h:4,
                    from /usr/src/kernels/3.10.3-300.fc19.i686/include/uapi/linux/types.h:13,
                    from /usr/src/kernels/3.10.3-300.fc19.i686/include/linux/types.h:5,
                    from /usr/src/kernels/3.10.3-300.fc19.i686/include/uapi/linux/capability.h:16,
                    from /usr/src/kernels/3.10.3-300.fc19.i686/include/linux/capability.h:15,
                    from /usr/src/kernels/3.10.3-300.fc19.i686/include/linux/sched.h:13,
                    from /usr/src/kernels/3.10.3-300.fc19.i686/include/linux/utsname.h:5,
                    from /tmp/selfgz2365/NVIDIA-Linux-x86-319.32/kernel/nv-linux.h:44,
                    from /tmp/selfgz2365/NVIDIA-Linux-x86-319.32/kernel/nv-chrdev.c:15:
   /usr/src/kernels/3.10.3-300.fc19.i686/arch/x86/include/asm/uaccess_32.h: In function ‘copy_from_user’:
   /usr/src/kernels/3.10.3-300.fc19.i686/arch/x86/include/asm/uaccess_32.h:208:28: warning: comparison between signed and unsigned integer expressions [-Wsign-compare]
     if (likely(sz == -1 || sz >= n))
                               ^
   /usr/src/kernels/3.10.3-300.fc19.i686/include/linux/compiler.h:152:40: note: in definition of macro ‘likely’
    # define likely(x) __builtin_expect(!!(x), 1)
                                           ^
     if [ "-pg" = "-pg" ]; then if [ /tmp/selfgz2365/NVIDIA-Linux-x86-319.32/kernel/nv-chrdev.o != "scripts/mod/empty.o" ]; then /usr/src/kernels/3.10.3-300.fc19.i686/scripts/recordmcount  "/tmp/selfgz2365/NVIDIA-Linux-x86-319.32/kernel/nv-chrdev.o"; fi; fi;
     cc -Wp,-MD,/tmp/selfgz2365/NVIDIA-Linux-x86-319.32/kernel/.nv-cray.o.d  -nostdinc -isystem /usr/lib/gcc/i686-redhat-linux/4.8.1/include -I/usr/src/kernels/3.10.3-300.fc19.i686/arch/x86/include -Iarch/x86/include/generated  -I/usr/src/kernels/3.10.3-300.fc19.i686/include -Iinclude -I/usr/src/kernels/3.10.3-300.fc19.i686/arch/x86/include/uapi -Iarch/x86/include/generated/uapi -I/usr/src/kernels/3.10.3-300.fc19.i686/include/uapi -Iinclude/generated/uapi -include /usr/src/kernels/3.10.3-300.fc19.i686/include/linux/kconfig.h   -I/tmp/selfgz2365/NVIDIA-Linux-x86-319.32/kernel -D__KERNEL__ -Wall -Wundef -Wstrict-prototypes -Wno-trigraphs -fno-strict-aliasing -fno-common -Werror-impl
   icit-function-declaration -Wno-format-security -fno-delete-null-pointer-checks -O2 -m32 -msoft-float -mregparm=3 -freg-struct-return -fno-pic -mpreferred-stack-boundary=2 -march=i686 -mtune=generic -maccumulate-outgoing-args -Wa,-mtune=generic32 -ffreestanding -fstack-protector -DCONFIG_AS_CFI=1 -DCONFIG_AS_CFI_SIGNAL_FRAME=1 -DCONFIG_AS_CFI_SECTIONS=1 -DCONFIG_AS_AVX=1 -DCONFIG_AS_AVX2=1 -pipe -Wno-sign-compare -fno-asynchronous-unwind-tables -mno-sse -mno-mmx -mno-sse2 -mno-3dnow -mno-avx -Wframe-larger-than=1024 -Wno-unused-but-set-variable -fno-omit-frame-pointer -fno-optimize-sibling-calls -g -pg -Wdeclaration-after-statement -Wno-pointer-sign -fno-strict-overflow -fconserve-stack -DCC_HAVE_ASM_GOTO   -I/tmp/selfgz2365/NVIDIA-Linux-x86-319.32/kernel -Wall -MD -Wsign-compare -Wno-cast-qual -Wno-error -D__KERNEL__ -DMODULE -DNVRM -DNV_VERSION_STRING=\"319.32\" -Wno-unused-function -Wuninitialized -UDEBUG -U_DEBUG -DNDEBUG -D__linux__  -DMODULE  -D"KBUILD_STR(s)=#s" -D"KBUILD_BASENAME=KBUILD_STR(nv_cray)"  
   -D"KBUILD_MODNAME=KBUILD_STR(nvidia)" -c -o /tmp/selfgz2365/NVIDIA-Linux-x86-319.32/kernel/nv-cray.o /tmp/selfgz2365/NVIDIA-Linux-x86-319.32/kernel/nv-cray.c
   In file included from /usr/src/kernels/3.10.3-300.fc19.i686/arch/x86/include/asm/bitops.h:514:0,
                    from /usr/src/kernels/3.10.3-300.fc19.i686/include/linux/bitops.h:22,
                    from /usr/src/kernels/3.10.3-300.fc19.i686/include/linux/kernel.h:10,
                    from /usr/src/kernels/3.10.3-300.fc19.i686/include/linux/sched.h:15,
                    from /usr/src/kernels/3.10.3-300.fc19.i686/include/linux/utsname.h:5,
                    from /tmp/selfgz2365/NVIDIA-Linux-x86-319.32/kernel/nv-linux.h:44,
                    from /tmp/selfgz2365/NVIDIA-Linux-x86-319.32/kernel/nv-cray.c:15:
   /usr/src/kernels/3.10.3-300.fc19.i686/include/linux/bitops.h: In function ‘hweight_long’:
   /usr/src/kernels/3.10.3-300.fc19.i686/include/asm-generic/bitops/const_hweight.h:26:70: warning: signed and unsigned type in conditional expression [-Wsign-compare]
    #define hweight32(w) (__builtin_constant_p(w) ? __const_hweight32(w) : __arch_hweight32(w))
                                                                         ^
   /usr/src/kernels/3.10.3-300.fc19.i686/include/linux/bitops.h:66:26: note: in expansion of macro ‘hweight32’
     return sizeof(w) == 4 ? hweight32(w) : hweight64(w);
                             ^
   In file included from /usr/src/kernels/3.10.3-300.fc19.i686/arch/x86/include/asm/cpumask.h:4:0,
                    from /usr/src/kernels/3.10.3-300.fc19.i686/arch/x86/include/asm/msr.h:10,
                    from /usr/src/kernels/3.10.3-300.fc19.i686/arch/x86/include/asm/processor.h:20,
                    from /usr/src/kernels/3.10.3-300.fc19.i686/arch/x86/include/asm/thread_info.h:22,
                    from /usr/src/kernels/3.10.3-300.fc19.i686/include/linux/thread_info.h:54,
                    from /usr/src/kernels/3.10.3-300.fc19.i686/include/linux/preempt.h:9,
                    from /usr/src/kernels/3.10.3-300.fc19.i686/include/linux/spinlock.h:50,
                    from /usr/src/kernels/3.10.3-300.fc19.i686/include/linux/seqlock.h:29,
                    from /usr/src/kernels/3.10.3-300.fc19.i686/include/linux/time.h:5,
                    from /usr/src/kernels/3.10.3-300.fc19.i686/include/uapi/linux/timex.h:56,
                    from /usr/src/kernels/3.10.3-300.fc19.i686/include/linux/timex.h:56,
                    from /usr/src/kernels/3.10.3-300.fc19.i686/include/linux/sched.h:17,
                    from /usr/src/kernels/3.10.3-300.fc19.i686/include/linux/utsname.h:5,
                    from /tmp/selfgz2365/NVIDIA-Linux-x86-319.32/kernel/nv-linux.h:44,
                    from /tmp/selfgz2365/NVIDIA-Linux-x86-319.32/kernel/nv-cray.c:15:
   /usr/src/kernels/3.10.3-300.fc19.i686/include/linux/cpumask.h: In function ‘cpumask_parse’:
   /usr/src/kernels/3.10.3-300.fc19.i686/include/linux/cpumask.h:603:26: warning: signed and unsigned type in conditional expression [-Wsign-compare]
     int len = nl ? nl - buf : strlen(buf);
                             ^
   In file included from /usr/src/kernels/3.10.3-300.fc19.i686/include/uapi/linux/stddef.h:1:0,
                    from /usr/src/kernels/3.10.3-300.fc19.i686/include/linux/stddef.h:4,
                    from /usr/src/kernels/3.10.3-300.fc19.i686/include/uapi/linux/posix_types.h:4,
                    from /usr/src/kernels/3.10.3-300.fc19.i686/include/uapi/linux/types.h:13,
                    from /usr/src/kernels/3.10.3-300.fc19.i686/include/linux/types.h:5,
                    from /usr/src/kernels/3.10.3-300.fc19.i686/include/uapi/linux/capability.h:16,
                    from /usr/src/kernels/3.10.3-300.fc19.i686/include/linux/capability.h:15,
                    from /usr/src/kernels/3.10.3-300.fc19.i686/include/linux/sched.h:13,
                    from /usr/src/kernels/3.10.3-300.fc19.i686/include/linux/utsname.h:5,
                    from /tmp/selfgz2365/NVIDIA-Linux-x86-319.32/kernel/nv-linux.h:44,
                    from /tmp/selfgz2365/NVIDIA-Linux-x86-319.32/kernel/nv-cray.c:15:
   /usr/src/kernels/3.10.3-300.fc19.i686/arch/x86/include/asm/uaccess_32.h: In function ‘copy_from_user’:
   /usr/src/kernels/3.10.3-300.fc19.i686/arch/x86/include/asm/uaccess_32.h:208:28: warning: comparison between signed and unsigned integer expressions [-Wsign-compare]
     if (likely(sz == -1 || sz >= n))
                               ^
   /usr/src/kernels/3.10.3-300.fc19.i686/include/linux/compiler.h:152:40: note: in definition of macro ‘likely’
    # define likely(x) __builtin_expect(!!(x), 1)
                                           ^
     if [ "-pg" = "-pg" ]; then if [ /tmp/selfgz2365/NVIDIA-Linux-x86-319.32/kernel/nv-cray.o != "scripts/mod/empty.o" ]; then /usr/src/kernels/3.10.3-300.fc19.i686/scripts/recordmcount  "/tmp/selfgz2365/NVIDIA-Linux-x86-319.32/kernel/nv-cray.o"; fi; fi;
     cc -Wp,-MD,/tmp/selfgz2365/NVIDIA-Linux-x86-319.32/kernel/.nv-drm.o.d  -nostdinc -isystem /usr/lib/gcc/i686-redhat-linux/4.8.1/include -I/usr/src/kernels/3.10.3-300.fc19.i686/arch/x86/include -Iarch/x86/include/generated  -I/usr/src/kernels/3.10.3-300.fc19.i686/include -Iinclude -I/usr/src/kernels/3.10.3-300
   .fc19.i686/arch/x86/include/uapi -Iarch/x86/include/generated/uapi -I/usr/src/kernels/3.10.3-300.fc19.i686/include/uapi -Iinclude/generated/uapi -include /usr/src/kernels/3.10.3-300.fc19.i686/include/linux/kconfig.h   -I/tmp/selfgz2365/NVIDIA-Linux-x86-319.32/kernel -D__KERNEL__ -Wall -Wundef -Wstrict-prototypes -Wno-trigraphs -fno-strict-aliasing -fno-common -Werror-implicit-function-declaration -Wno-format-security -fno-delete-null-pointer-checks -O2 -m32 -msoft-float -mregparm=3 -freg-struct-return -fno-pic -mpreferred-stack-boundary=2 -march=i686 -mtune=generic -maccumulate-outgoing-args -Wa,-mtune=generic32 -ffreestanding -fstack-protector -DCONFIG_AS_CFI=1 -DCONFIG_AS_CFI_SIGNAL_FRAME=1 -DCONFIG_AS_CFI_SECTIONS=1 -DCONFIG_AS_AVX=1 -DCONFIG_AS_AVX2=1 -pipe -Wno-sign-compare -fno-asynchronous-unwind-tables -mno-sse -mno-mmx -mno-sse2 -mno-3dnow -mno-avx -Wframe-larger-than=1024 -Wno-unused-but-set-variable -fno-omit-frame-pointer -fno-optimize-sibling-calls -g -pg -Wdeclaration-after-statement -Wno-pointe
   r-sign -fno-strict-overflow -fconserve-stack -DCC_HAVE_ASM_GOTO   -I/tmp/selfgz2365/NVIDIA-Linux-x86-319.32/kernel -Wall -MD -Wsign-compare -Wno-cast-qual -Wno-error -D__KERNEL__ -DMODULE -DNVRM -DNV_VERSION_STRING=\"319.32\" -Wno-unused-function -Wuninitialized -UDEBUG -U_DEBUG -DNDEBUG -D__linux__  -DMODULE  -D"KBUILD_STR(s)=#s" -D"KBUILD_BASENAME=KBUILD_STR(nv_drm)"  -D"KBUILD_MODNAME=KBUILD_STR(nvidia)" -c -o /tmp/selfgz2365/NVIDIA-Linux-x86-319.32/kernel/nv-drm.o /tmp/selfgz2365/NVIDIA-Linux-x86-319.32/kernel/nv-drm.c
   In file included from /usr/src/kernels/3.10.3-300.fc19.i686/arch/x86/include/asm/bitops.h:514:0,
                    from /usr/src/kernels/3.10.3-300.fc19.i686/include/linux/bitops.h:22,
                    from /usr/src/kernels/3.10.3-300.fc19.i686/include/linux/kernel.h:10,
                    from /usr/src/kernels/3.10.3-300.fc19.i686/include/linux/sched.h:15,
                    from /usr/src/kernels/3.10.3-300.fc19.i686/include/linux/utsname.h:5,
                    from /tmp/selfgz2365/NVIDIA-Linux-x86-319.32/kernel/nv-linux.h:44,
                    from /tmp/selfgz2365/NVIDIA-Linux-x86-319.32/kernel/nv-drm.c:15:
   /usr/src/kernels/3.10.3-300.fc19.i686/include/linux/bitops.h: In function ‘hweight_long’:
   /usr/src/kernels/3.10.3-300.fc19.i686/include/asm-generic/bitops/const_hweight.h:26:70: warning: signed and unsigned type in conditional expression [-Wsign-compare]
    #define hweight32(w) (__builtin_constant_p(w) ? __const_hweight32(w) : __arch_hweight32(w))
                                                                         ^
   /usr/src/kernels/3.10.3-300.fc19.i686/include/linux/bitops.h:66:26: note: in expansion of macro ‘hweight32’
     return sizeof(w) == 4 ? hweight32(w) : hweight64(w);
                             ^
   In file included from /usr/src/kernels/3.10.3-300.fc19.i686/arch/x86/include/asm/cpumask.h:4:0,
                    from /usr/src/kernels/3.10.3-300.fc19.i686/arch/x86/include/asm/msr.h:10,
                    from /usr/src/kernels/3.10.3-300.fc19.i686/arch/x86/include/asm/processor.h:20,
                    from /usr/src/kernels/3.10.3-300.fc19.i686/arch/x86/include/asm/thread_info.h:22,
                    from /usr/src/kernels/3.10.3-300.fc19.i686/include/linux/thread_info.h:54,
                    from /usr/src/kernels/3.10.3-300.fc19.i686/include/linux/preempt.h:9,
                    from /usr/src/kernels/3.10.3-300.fc19.i686/include/linux/spinlock.h:50,
                    from /usr/src/kernels/3.10.3-300.fc19.i686/include/linux/seqlock.h:29,
                    from /usr/src/kernels/3.10.3-300.fc19.i686/include/linux/time.h:5,
                    from /usr/src/kernels/3.10.3-300.fc19.i686/include/uapi/linux/timex.h:56,
                    from /usr/src/kernels/3.10.3-300.fc19.i686/include/linux/timex.h:56,
                    from /usr/src/kernels/3.10.3-300.fc19.i686/include/linux/sched.h:17,
                    from /usr/src/kernels/3.10.3-300.fc19.i686/include/linux/utsname.h:5,
                    from /tmp/selfgz2365/NVIDIA-Linux-x86-319.32/kernel/nv-linux.h:44,
                    from /tmp/selfgz2365/NVIDIA-Linux-x86-319.32/kernel/nv-drm.c:15:
   /usr/src/kernels/3.10.3-300.fc19.i686/include/linux/cpumask.h: In function ‘cpumask_parse’:
   /usr/src/kernels/3.10.3-300.fc19.i686/include/linux/cpumask.h:603:26: warning: signed and unsigned type in conditional expression [-Wsign-compare]
     int len = nl ? nl - buf : strlen(buf);
                             ^
   In file included from /usr/src/kernels/3.10.3-300.fc19.i686/include/uapi/linux/stddef.h:1:0,
                    from /usr/src/kernels/3.10.3-300.fc19.i686/include/linux/stddef.h:4,
                    from /usr/src/kernels/3.10.3-300.fc19.i686/include/uapi/linux/posix_types.h:4,
                    from /usr/src/kernels/3.10.3-300.fc19.i686/include/uapi/linux/types.h:13,
                    from /usr/src/kernels/3.10.3-300.fc19.i686/include/linux/types.h:5,
                    from /usr/src/kernels/3.10.3-300.fc19.i686/include/uapi/linux/capability.h:16,
                    from /usr/src/kernels/3.10.3-300.fc19.i686/include/linux/capability.h:15,
                    from /usr/src/kernels/3.10.3-300.fc19.i686/include/linux/sched.h:13,
                    from /usr/src/kernels/3.10.3-300.fc19.i686/include/linux/utsname.h:5,
                    from /tmp/selfgz2365/NVIDIA-Linux-x86-319.32/kernel/nv-linux.h:44,
                    from /tmp/selfgz2365/NVIDIA-Linux-x86-319.32/kernel/nv-drm.c:15:
   /usr/src/kernels/3.10.3-300.fc19.i686/arch/x86/include/asm/uaccess_32.h: In function ‘copy_from_user’:
   /usr/src/kernels/3.10.3-300.fc19.i686/arch/x86/include/asm/uaccess_32.h:208:28: warning: comparison between signed and unsigned integer expressions [-Wsign-compare]
     if (likely(sz == -1 || sz >= n))
                               ^
   /usr/src/kernels/3.10.3-300.fc19.i686/include/linux/compiler.h:152:40: note: in definition of macro ‘likely’
    # define likely(x) __builtin_expect(!!(x), 1)
                                           ^
   In file included from /usr/src/kernels/3.10.3-300.fc19.i686/include/drm/drm_crtc.h:32:0,
                    from /usr/src/kernels/3.10.3-300.fc19.i686/include/drm/drmP.h:691,
                    from /tmp/selfgz2365/NVIDIA-Linux-x86-319.32/kernel/nv-drm.c:19:
   /usr/src/kernels/3.10.3-300.fc19.i686/include/linux/fb.h: In function ‘__fb_pad_aligned_buffer’:
   /usr/src/kernels/3.10.3-300.fc19.i686/include/linux/fb.h:650:17: warning: comparison between signed and unsigned integer expressions [-Wsign-compare]
      for (j = 0; j < s_pitch; j++)
                    ^
     if [ "-pg" = "-pg" ]; then if [ /tmp/selfgz2365/NVIDIA-Linux-x86-319.32/kernel/nv-drm.o != "scripts/mod/empty.o" ]; then /usr/src/kernels/3.10.3-300.fc19.i686/scripts/recordmcount  "/tmp/selfgz2365/NVIDIA-Linux-x86-319.32/kernel/nv-drm.o"; fi; fi;
     cc -Wp,-MD,/tmp/selfgz2365/NVIDIA-Linux-x86-319.32/kernel/.nv-gvi.o.d  -nostdinc -isystem /usr/lib/gcc/i686-redhat-linux/4.8.1/include -I/usr/src/kernels/3.10.3-300.fc19.i686/arch/x86/include -Iarch/x86/include/generated  -I/usr/src/kernels/3.10.3-300.fc19.i686/include -Iinclude -I/usr/src/kernels/3.10.3-300.fc19.i686/arch/x86/include/uapi -Iarch/x86/include/generated/uapi -I/usr/src/kernels/3.10.3-300.fc1
   9.i686/include/uapi -Iinclude/generated/uapi -include /usr/src/kernels/3.10.3-300.fc19.i686/include/linux/kconfig.h   -I/tmp/selfgz2365/NVIDIA-Linux-x86-319.32/kernel -D__KERNEL__ -Wall -Wundef -Wstrict-prototypes -Wno-trigraphs -fno-strict-aliasing -fno-common -Werror-implicit-function-declaration -Wno-format-security -fno-delete-null-pointer-checks -O2 -m32 -msoft-float -mregparm=3 -freg-struct-return -fno-pic -mpreferred-stack-boundary=2 -march=i686 -mtune=generic -maccumulate-outgoing-args -Wa,-mtune=generic32 -ffreestanding -fstack-protector -DCONFIG_AS_CFI=1 -DCONFIG_AS_CFI_SIGNAL_FRAME=1 -DCONFIG_AS_CFI_SECTIONS=1 -DCONFIG_AS_AVX=1 -DCONFIG_AS_AVX2=1 -pipe -Wno-sign-compare -fno-asynchronous-unwind-tables -mno-sse -mno-mmx -mno-sse2 -mno-3dnow -mno-avx -Wframe-larger-than=1024 -Wno-unused-but-set-variable -fno-omit-frame-pointer -fno-optimize-sibling-calls -g -pg -Wdeclaration-after-statement -Wno-pointer-sign -fno-strict-overflow -fconserve-stack -DCC_HAVE_ASM_GOTO   -I/tmp/selfgz2365/NVIDIA-Linux-x86
   -319.32/kernel -Wall -MD -Wsign-compare -Wno-cast-qual -Wno-error -D__KERNEL__ -DMODULE -DNVRM -DNV_VERSION_STRING=\"319.32\" -Wno-unused-function -Wuninitialized -UDEBUG -U_DEBUG -DNDEBUG -D__linux__  -DMODULE  -D"KBUILD_STR(s)=#s" -D"KBUILD_BASENAME=KBUILD_STR(nv_gvi)"  -D"KBUILD_MODNAME=KBUILD_STR(nvidia)" -c -o /tmp/selfgz2365/NVIDIA-Linux-x86-319.32/kernel/nv-gvi.o /tmp/selfgz2365/NVIDIA-Linux-x86-319.32/kernel/nv-gvi.c
   In file included from /usr/src/kernels/3.10.3-300.fc19.i686/arch/x86/include/asm/bitops.h:514:0,
                    from /usr/src/kernels/3.10.3-300.fc19.i686/include/linux/bitops.h:22,
                    from /usr/src/kernels/3.10.3-300.fc19.i686/include/linux/kernel.h:10,
                    from /usr/src/kernels/3.10.3-300.fc19.i686/include/linux/sched.h:15,
                    from /usr/src/kernels/3.10.3-300.fc19.i686/include/linux/utsname.h:5,
                    from /tmp/selfgz2365/NVIDIA-Linux-x86-319.32/kernel/nv-linux.h:44,
                    from /tmp/selfgz2365/NVIDIA-Linux-x86-319.32/kernel/nv-gvi.c:15:
   /usr/src/kernels/3.10.3-300.fc19.i686/include/linux/bitops.h: In function ‘hweight_long’:
   /usr/src/kernels/3.10.3-300.fc19.i686/include/asm-generic/bitops/const_hweight.h:26:70: warning: signed and unsigned type in conditional expression [-Wsign-compare]
    #define hweight32(w) (__builtin_constant_p(w) ? __const_hweight32(w) : __arch_hweight32(w))
                                                                         ^
   /usr/src/kernels/3.10.3-300.fc19.i686/include/linux/bitops.h:66:26: note: in expansion of macro ‘hweight32’
     return sizeof(w) == 4 ? hweight32(w) : hweight64(w);
                             ^
   In file included from /usr/src/kernels/3.10.3-300.fc19.i686/arch/x86/include/asm/cpumask.h:4:0,
                    from /usr/src/kernels/3.10.3-300.fc19.i686/arch/x86/include/asm/msr.h:10,
                    from /usr/src/kernels/3.10.3-300.fc19.i686/arch/x86/include/asm/processor.h:20,
                    from /usr/src/kernels/3.10.3-300.fc19.i686/arch/x86/include/asm/thread_info.h:22,
                    from /usr/src/kernels/3.10.3-300.fc19.i686/include/linux/thread_info.h:54,
                    from /usr/src/kernels/3.10.3-300.fc19.i686/include/linux/preempt.h:9,
                    from /usr/src/kernels/3.10.3-300.fc19.i686/include/linux/spinlock.h:50,
                    from /usr/src/kernels/3.10.3-300.fc19.i686/include/linux/seqlock.h:29,
                    from /usr/src/kernels/3.10.3-300.fc19.i686/include/linux/time.h:5,
                    from /usr/src/kernels/3.10.3-300.fc19.i686/include/uapi/linux/timex.h:56,
                    from /usr/src/kernels/3.10.3-300.fc19.i686/include/linux/timex.h:56,
                    from /usr/src/kernels/3.10.3-300.fc19.i686/include/linux/sched.h:17,
                    from /usr/src/kernels/3.10.3-300.fc19.i686/include/linux/utsname.h:5,
                    from /tmp/selfgz2365/NVIDIA-Linux-x86-319.32/kernel/nv-linux.h:44,
                    from /tmp/selfgz2365/NVIDIA-Linux-x86-319.32/kernel/nv-gvi.c:15:
   /usr/src/kernels/3.10.3-300.fc19.i686/include/linux/cpumask.h: In function ‘cpumask_parse’:
   /usr/src/kernels/3.10.3-300.fc19.i686/include/linux/cpumask.h:603:26: warning: signed and unsigned type in conditional expression [-Wsign-compare]
     int len = nl ? nl - buf : strlen(buf);
                             ^
   In file included from /usr/src/kernels/3.10.3-300.fc19.i686/include/uapi/linux/stddef.h:1:0,
                    from /usr/src/kernels/3.10.3-300.fc19.i686/include/linux/stddef.h:4,
                    from /usr/src/kernels/3.10.3-300.fc19.i686/include/uapi/linux/posix_types.h:4,
                    from /usr/src/kernels/3.10.3-300.fc19.i686/include/uapi/linux/types.h:13,
                    from /usr/src/kernels/3.10.3-300.fc19.i686/include/linux/types.h:5,
                    from /usr/src/kernels/3.10.3-300.fc19.i686/include/uapi/linux/capability.h:16,
                    from /usr/src/kernels/3.10.3-300.fc19.i686/include/linux/capability.h:15,
                    from /usr/src/kernels/3.10.3-300.fc19.i686/include/linux/sched.h:13,
                    from /usr/src/kernels/3.10.3-300.fc19.i686/include/linux/utsname.h:5,
                    from /tmp/selfgz2365/NVIDIA-Linux-x86-319.32/kernel/nv-linux.h:44,
                    from /tmp/selfgz2365/NVIDIA-Linux-x86-319.32/kernel/nv-gvi.c:15:
   /usr/src/kernels/3.10.3-300.fc19.i686/arch/x86/include/asm/uaccess_32.h: In function ‘copy_from_user’:
   /usr/src/kernels/3.10.3-300.fc19.i686/arch/x86/include/asm/uaccess_32.h:208:28: warning: comparison between signed and unsigned integer expressions [-Wsign-compare]
     if (likely(sz == -1 || sz >= n))
                               ^
   /usr/src/kernels/3.10.3-300.fc19.i686/include/linux/compiler.h:152:40: note: in definition of macro ‘likely’
    # define likely(x) __builtin_expect(!!(x), 1)
                                           ^
     if [ "-pg" = "-pg" ]; then if [ /tmp/selfgz2365/NVIDIA-Linux-x86-319.32/kernel/nv-gvi.o != "scripts/mod/empty.o" ]; then /usr/src/kernels/3.10.3-300.fc19.i686/scripts/recordmcount  "/tmp/selfgz2365/NVIDIA-Linux-x86-319.32/kernel/nv-gvi.o"; fi; fi;
     cc -Wp,-MD,/tmp/selfgz2365/NVIDIA-Linux-x86-319.32/kernel/.nv-i2c.o.d  -nostdinc -isystem /usr/lib/gcc/i686-redhat-linux/4.8.1/include -I/usr/src/kernels/3.10.3-300.fc19.i686/arch/x86/include -Iarch/x86/include/generated  -I/usr/src/kernels/3.10.3-300.fc19.i686/include -Iinclude -I/usr/src/kernels/3.10.3-300.fc19.i686/arch/x86/include/uapi -Iarch/x86/include/generated/uapi -I/usr/src/kernels/3.10.3-300.fc19.i686/include/uapi -Iinclude/generated/uapi -include /usr/src/kernels/3.10.3-300.fc19.i686/include/linux/kconfig.h   -I/tmp/selfgz2365/NVIDIA-Linux-x86-319.32/kernel -D__KERNEL__ -Wall -Wundef -Wstrict-prototypes -Wno-trigraphs -fno-strict-aliasing -fno-common -Werror-implicit-function-declaration -Wno-format-security -fno-delete-null-pointer-checks -O2 -m32 -msoft-float -mregparm=3 -freg-struct-return -fno-pic -mpreferred-stack-boundary=2 -march=i686 -mtune=generic -maccumulate-outgoing-args -Wa,-mtune=generic32 -ffreestanding -fstack-protector -DCONFIG_AS_CFI=1 -DCONFIG_AS_CFI_SIGNAL_FRAME=1 -DCONFIG_AS_CFI_SECTIONS=1 -DCONFIG_AS_AVX=1 -DCONFIG_AS
   _AVX2=1 -pipe -Wno-sign-compare -fno-asynchronous-unwind-tables -mno-sse -mno-mmx -mno-sse2 -mno-3dnow -mno-avx -Wframe-larger-than=1024 -Wno-unused-but-set-variable -fno-omit-frame-pointer -fno-optimize-sibling-calls -g -pg -Wdeclaration-after-statement -Wno-pointer-sign -fno-strict-overflow -fconserve-stack -DCC_HAVE_ASM_GOTO   -I/tmp/selfgz2365/NVIDIA-Linux-x86-319.32/kernel -Wall -MD -Wsign-compare -Wno-cast-qual -Wno-error -D__KERNEL__ -DMODULE -DNVRM -DNV_VERSION_STRING=\"319.32\" -Wno-unused-function -Wuninitialized -UDEBUG -U_DEBUG -DNDEBUG -D__linux__  -DMODULE  -D"KBUILD_STR(s)=#s" -D"KBUILD_BASENAME=KBUILD_STR(nv_i2c)"  -D"KBUILD_MODNAME=KBUILD_STR(nvidia)" -c -o /tmp/selfgz2365/NVIDIA-Linux-x86-319.32/kernel/nv-i2c.o /tmp/selfgz2365/NVIDIA-Linux-x86-319.32/kernel/nv-i2c.c
   In file included from /usr/src/kernels/3.10.3-300.fc19.i686/arch/x86/include/asm/bitops.h:514:0,
                    from /usr/src/kernels/3.10.3-300.fc19.i686/include/linux/bitops.h:22,
                    from /usr/src/kernels/3.10.3-300.fc19.i686/include/linux/kernel.h:10,
                    from /usr/src/kernels/3.10.3-300.fc19.i686/include/linux/sched.h:15,
                    from /usr/src/kernels/3.10.3-300.fc19.i686/include/linux/utsname.h:5,
                    from /tmp/selfgz2365/NVIDIA-Linux-x86-319.32/kernel/nv-linux.h:44,
                    from /tmp/selfgz2365/NVIDIA-Linux-x86-319.32/kernel/nv-i2c.c:15:
   /usr/src/kernels/3.10.3-300.fc19.i686/include/linux/bitops.h: In function ‘hweight_long’:
   /usr/src/kernels/3.10.3-300.fc19.i686/include/asm-generic/bitops/const_hweight.h:26:70: warning: signed and unsigned type in conditional expression [-Wsign-compare]
    #define hweight32(w) (__builtin_constant_p(w) ? __const_hweight32(w) : __arch_hweight32(w))
                                                                         ^
   /usr/src/kernels/3.10.3-300.fc19.i686/include/linux/bitops.h:66:26: note: in expansion of macro ‘hweight32’
     return sizeof(w) == 4 ? hweight32(w) : hweight64(w);
                             ^
   In file included from /usr/src/kernels/3.10.3-300.fc19.i686/arch/x86/include/asm/cpumask.h:4:0,
                    from /usr/src/kernels/3.10.3-300.fc19.i686/arch/x86/include/asm/msr.h:10,
                    from /usr/src/kernels/3.10.3-300.fc19.i686/arch/x86/include/asm/processor.h:20,
                    from /usr/src/kernels/3.10.3-300.fc19.i686/arch/x86/include/asm/thread_info.h:22,
                    from /usr/src/kernels/3.10.3-300.fc19.i686/include/linux/thread_info.h:54,
                    from /usr/src/kernels/3.10.3-300.fc19.i686/include/linux/preempt.h:9,
                    from /usr/src/kernels/3.10.3-300.fc19.i686/include/linux/spinlock.h:50,
                    from /usr/src/kernels/3.10.3-300.fc19.i686/include/linux/seqlock.h:29,
                    from /usr/src/kernels/3.10.3-300.fc19.i686/include/linux/time.h:5,
                    from /usr/src/kernels/3.10.3-300.fc19.i686/include/uapi/linux/timex.h:56,
                    from /usr/src/kernels/3.10.3-300.fc19.i686/include/linux/timex.h:56,
                    from /usr/src/kernels/3.10.3-300.fc19.i686/include/linux/sched.h:17,
                    from /usr/src/kernels/3.10.3-300.fc19.i686/include/linux/utsname.h:5,
                    from /tmp/selfgz2365/NVIDIA-Linux-x86-319.32/kernel/nv-linux.h:44,
                    from /tmp/selfgz2365/NVIDIA-Linux-x86-319.32/kernel/nv-i2c.c:15:
   /usr/src/kernels/3.10.3-300.fc19.i686/include/linux/cpumask.h: In function ‘cpumask_parse’:
   /usr/src/kernels/3.10.3-300.fc19.i686/include/linux/cpumask.h:603:26: warning: signed and unsigned type in conditional expression [-Wsign-compare]
     int len = nl ? nl - buf : strlen(buf);
                             ^
   In file included from /usr/src/kernels/3.10.3-300.fc19.i686/include/uapi/linux/stddef.h:1:0,
                    from /usr/src/kernels/3.10.3-300.fc19.i686/include/linux/stddef.h:4,
                    from /usr/src/kernels/3.10.3-300.fc19.i686/include/uapi/linux/posix_types.h:4,
                    from /usr/src/kernels/3.10.3-300.fc19.i686/include/uapi/linux/types.h:13,
                    from /usr/src/kernels/3.10.3-300.fc19.i686/include/linux/types.h:5,
                    from /usr/src/kernels/3.10.3-300.fc19.i686/include/uapi/linux/capability.h:16,
                    from /usr/src/kernels/3.10.3-300.fc19.i686/include/linux/capability.h:15,
                    from /usr/src/kernels/3.10.3-300.fc19.i686/include/linux/sched.h:13,
                    from /usr/src/kernels/3.10.3-300.fc19.i686/include/linux/utsname.h:5,
                    from /tmp/selfgz2365/NVIDIA-Linux-x86-319.32/kernel/nv-linux.h:44,
                    from /tmp/selfgz2365/NVIDIA-Linux-x86-319.32/kernel/nv-i2c.c:15:
   /usr/src/kernels/3.10.3-300.fc19.i686/arch/x86/include/asm/uaccess_32.h: In function ‘copy_from_user’:
   /usr/src/kernels/3.10.3-300.fc19.i686/arch/x86/include/asm/uaccess_32.h:208:28: warning: comparison between signed and unsigned integer expressions [-Wsign-compare]
     if (likely(sz == -1 || sz >= n))
                               ^
   /usr/src/kernels/3.10.3-300.fc19.i686/include/linux/compiler.h:152:40: note: in definition of macro ‘likely’
    # define likely(x) __builtin_expect(!!(x), 1)
                                           ^
   /tmp/selfgz2365/NVIDIA-Linux-x86-319.32/kernel/nv-i2c.c: In function ‘nv_i2c_del_adapter’:
   /tmp/selfgz2365/NVIDIA-Linux-x86-319.32/kernel/nv-i2c.c:327:14: error: void value not ignored as it ought to be
        osstatus = i2c_del_adapter(pI2cAdapter);
                 ^
   make[4]: *** [/tmp/selfgz2365/NVIDIA-Linux-x86-319.32/kernel/nv-i2c.o] Error 1
   make[3]: *** [_module_/tmp/selfgz2365/NVIDIA-Linux-x86-319.32/kernel] Error 2
   make[2]: *** [sub-make] Error 2
   NVIDIA: left KBUILD.
   nvidia.ko failed to build!
   make[1]: *** [module] Error 1
   make: *** [module] Error 2
-> Error.
ERROR: Unable to build the NVIDIA kernel module.
ERROR: Installation has failed.  Please see the file '/var/log/nvidia-installer.log' for details.  You may find suggestions on fixing installation problems in the README available on the Linux driver download page at www.nvidia.com.

My DKMS Make.log is:

[code]
DKMS make.log for nvidia-319.32 for kernel 3.10.3-300.fc19.i686 (i686)
Sun Jul 28 08:51:05 WST 2013
NVIDIA: calling KBUILD…
make -C /lib/modules/3.10.3-300.fc19.i686/build
KBUILD_SRC=/usr/src/kernels/3.10.3-300.fc19.i686
KBUILD_EXTMOD="/var/lib/dkms/nvidia/319.32/build" -f /usr/src/kernels/3.10.3-300.fc19.i686/Makefile
modules
test -e include/generated/autoconf.h -a -e include/config/auto.conf || (
echo >&2;
echo >&2 " ERROR: Kernel configuration is invalid.";
echo >&2 " include/generated/autoconf.h or include/config/auto.conf are missing.";
echo >&2 " Run ‘make oldconfig && make prepare’ on kernel src to fix it.";
echo >&2 ;
/bin/false)
mkdir -p /var/lib/dkms/nvidia/319.32/build/.tmp_versions ; rm -f /var/lib/dkms/nvidia/319.32/build/.tmp_versions/*
make -f /usr/src/kernels/3.10.3-300.fc19.i686/scripts/Makefile.build obj=/var/lib/dkms/nvidia/319.32/build
cc -Wp,-MD,/var/lib/dkms/nvidia/319.32/build/.nv.o.d -nostdinc -isystem /usr/lib/gcc/i686-redhat-linux/4.8.1/include -I/usr/src/kernels/3.10.3-300.fc19.i686/arch/x86/include -Iarch/x86/include/generated -I/usr/src/kernels/3.10.3-300.fc19.i686/include -Iinclude -I/usr/src/kernels/3.10.3-300.fc19.i686/arch/x86/include/uapi -Iarch/x86/include/generated/uapi -I/usr/src/kernels/3.10.3-300.fc19.i686/include/uapi -Iinclude/generated/uapi -include /usr/src/kernels/3.10.3-300.fc19.i686/include/linux/kconfig.h -I/var/lib/dkms/nvidia/319.32/build -D__KERNEL__ -Wall -Wundef -Wstrict-prototypes -Wno-trigraphs -fno-strict-aliasing -fno-common -Werror-implicit-function-declaration -Wno-format-security -fno-delete-null-pointer-checks -O2 -m32 -msoft-float -mregparm=3 -freg-struct-return -fno-pic -mpreferred-stack-boundary=2 -march=i686 -mtune=generic -maccumulate-outgoing-args -Wa,-mtune=generic32 -ffreestanding -fstack-protector -DCONFIG_AS_CFI=1 -DCONFIG_AS_CFI_SIGNAL_FRAME=1 -DCONFIG_AS_CFI_SECTIONS=1 -DCONFIG_AS_AVX=1 -DCONFIG_AS_AVX2=1 -pipe -Wno-sign-compare -fno-asynchronous-unwind-tables -mno-sse -mno-mmx -mno-sse2 -mno-3dnow -mno-avx -Wframe-larger-than=1024 -Wno-unused-but-set-variable -fno-omit-frame-pointer -fno-optimize-sibling-calls -g -pg -Wdeclaration-after-statement -Wno-pointer-sign -fno-strict-overflow -fconserve-stack -DCC_HAVE_ASM_GOTO -I/var/lib/dkms/nvidia/319.32/build -Wall -MD -Wsign-compare -Wno-cast-qual -Wno-error -D__KERNEL__ -DMODULE -DNVRM -DNV_VERSION_STRING=“319.32” -Wno-unused-function -Wuninitialized -UDEBUG -U_DEBUG -DNDEBUG -D__linux__ -DMODULE -D"KBUILD_STR(s)=#s" -D"KBUILD_BASENAME=KBUILD_STR(nv)" -D"KBUILD_MODNAME=KBUILD_STR(nvidia)" -c -o /var/lib/dkms/nvidia/319.32/build/nv.o /var/lib/dkms/nvidia/319.32/build/nv.c
In file included from /usr/src/kernels/3.10.3-300.fc19.i686/arch/x86/include/asm/bitops.h:514:0,
from /usr/src/kernels/3.10.3-300.fc19.i686/include/linux/bitops.h:22,
from /usr/src/kernels/3.10.3-300.fc19.i686/include/linux/kernel.h:10,
from /usr/src/kernels/3.10.3-300.fc19.i686/include/linux/sched.h:15,
from /usr/src/kernels/3.10.3-300.fc19.i686/include/linux/utsname.h:5,
from /var/lib/dkms/nvidia/319.32/build/nv-linux.h:44,
from /var/lib/dkms/nvidia/319.32/build/nv.c:13:
/usr/src/kernels/3.10.3-300.fc19.i686/include/linux/bitops.h: In function ‘hweight_long’:
/usr/src/kernels/3.10.3-300.fc19.i686/include/asm-generic/bitops/const_hweight.h:26:70: warning: signed and unsigned type in conditional expression [-Wsign-compare]
#define hweight32(w) (__builtin_constant_p(w) ? __const_hweight32(w) : __arch_hweight32(w))
^
/usr/src/kernels/3.10.3-300.fc19.i686/include/linux/bitops.h:66:26: note: in expansion of macro ‘hweight32’
return sizeof(w) == 4 ? hweight32(w) : hweight64(w);
^
In file included from /usr/src/kernels/3.10.3-300.fc19.i686/arch/x86/include/asm/cpumask.h:4:0,
from /usr/src/kernels/3.10.3-300.fc19.i686/arch/x86/include/asm/msr.h:10,
from /usr/src/kernels/3.10.3-300.fc19.i686/arch/x86/include/asm/processor.h:20,
from /usr/src/kernels/3.10.3-300.fc19.i686/arch/x86/include/asm/thread_info.h:22,
from /usr/src/kernels/3.10.3-300.fc19.i686/include/linux/thread_info.h:54,
from /usr/src/kernels/3.10.3-300.fc19.i686/include/linux/preempt.h:9,
from /usr/src/kernels/3.10.3-300.fc19.i686/include/linux/spinlock.h:50,
from /usr/src/kernels/3.10.3-300.fc19.i686/include/linux/seqlock.h:29,
from /usr/src/kernels/3.10.3-300.fc19.i686/include/linux/time.h:5,
from /usr/src/kernels/3.10.3-300.fc19.i686/include/uapi/linux/timex.h:56,
from /usr/src/kernels/3.10.3-300.fc19.i686/include/linux/timex.h:56,
from /usr/src/kernels/3.10.3-300.fc19.i686/include/linux/sched.h:17,
from /usr/src/kernels/3.10.3-300.fc19.i686/include/linux/utsname.h:5,
from /var/lib/dkms/nvidia/319.32/build/nv-linux.h:44,
from /var/lib/dkms/nvidia/319.32/build/nv.c:13:
/usr/src/kernels/3.10.3-300.fc19.i686/include/linux/cpumask.h: In function ‘cpumask_parse’:
/usr/src/kernels/3.10.3-300.fc19.i686/include/linux/cpumask.h:603:26: warning: signed and unsigned type in conditional expression [-Wsign-compare]
int len = nl ? nl - buf : strlen(buf);
^
In file included from /usr/src/kernels/3.10.3-300.fc19.i686/include/uapi/linux/stddef.h:1:0,
from /usr/src/kernels/3.10.3-300.fc19.i686/include/linux/stddef.h:4,
from /usr/src/kernels/3.10.3-300.fc19.i686/include/uapi/linux/posix_types.h:4,
from /usr/src/kernels/3.10.3-300.fc19.i686/include/uapi/linux/types.h:13,
from /usr/src/kernels/3.10.3-300.fc19.i686/include/linux/types.h:5,
from /usr/src/kernels/3.10.3-300.fc19.i686/include/uapi/linux/capability.h:16,
from /usr/src/kernels/3.10.3-300.fc19.i686/include/linux/capability.h:15,
from /usr/src/kernels/3.10.3-300.fc19.i686/include/linux/sched.h:13,
from /usr/src/kernels/3.10.3-300.fc19.i686/include/linux/utsname.h:5,
from /var/lib/dkms/nvidia/319.32/build/nv-linux.h:44,
from /var/lib/dkms/nvidia/319.32/build/nv.c:13:
/usr/src/kernels/3.10.3-300.fc19.i686/arch/x86/include/asm/uaccess_32.h: In function ‘copy_from_user’:
/usr/src/kernels/3.10.3-300.fc19.i686/arch/x86/include/asm/uaccess_32.h:208:28: warning: comparison between signed and unsigned integer expressions [-Wsign-compare]
if (likely(sz == -1 || sz >= n))
^
/usr/src/kernels/3.10.3-300.fc19.i686/include/linux/compiler.h:152:40: note: in definition of macro ‘likely’

define likely(x) __builtin_expect(!!(x), 1)

                                    ^

if [ “-pg” = “-pg” ]; then if [ /var/lib/dkms/nvidia/319.32/build/nv.o != “scripts/mod/empty.o” ]; then /usr/src/kernels/3.10.3-300.fc19.i686/scripts/recordmcount “/var/lib/dkms/nvidia/319.32/build/nv.o”; fi; fi;
cc -Wp,-MD,/var/lib/dkms/nvidia/319.32/build/.nv-acpi.o.d -nostdinc -isystem /usr/lib/gcc/i686-redhat-linux/4.8.1/include -I/usr/src/kernels/3.10.3-300.fc19.i686/arch/x86/include -Iarch/x86/include/generated -I/usr/src/kernels/3.10.3-300.fc19.i686/include -Iinclude -I/usr/src/kernels/3.10.3-300.fc19.i686/arch/x86/include/uapi -Iarch/x86/include/generated/uapi -I/usr/src/kernels/3.10.3-300.fc19.i686/include/uapi -Iinclude/generated/uapi -include /usr/src/kernels/3.10.3-300.fc19.i686/include/linux/kconfig.h -I/var/lib/dkms/nvidia/319.32/build -D__KERNEL__ -Wall -Wundef -Wstrict-prototypes -Wno-trigraphs -fno-strict-aliasing -fno-common -Werror-implicit-function-declaration -Wno-format-security -fno-delete-null-pointer-checks -O2 -m32 -msoft-float -mregparm=3 -freg-struct-return -fno-pic -mpreferred-stack-boundary=2 -march=i686 -mtune=generic -maccumulate-outgoing-args -Wa,-mtune=generic32 -ffreestanding -fstack-protector -DCONFIG_AS_CFI=1 -DCONFIG_AS_CFI_SIGNAL_FRAME=1 -DCONFIG_AS_CFI_SECTIONS=1 -DCONFIG_AS_AVX=1 -DCONFIG_AS_AVX2=1 -pipe -Wno-sign-compare -fno-asynchronous-unwind-tables -mno-sse -mno-mmx -mno-sse2 -mno-3dnow -mno-avx -Wframe-larger-than=1024 -Wno-unused-but-set-variable -fno-omit-frame-pointer -fno-optimize-sibling-calls -g -pg -Wdeclaration-after-statement -Wno-pointer-sign -fno-strict-overflow -fconserve-stack -DCC_HAVE_ASM_GOTO -I/var/lib/dkms/nvidia/319.32/build -Wall -MD -Wsign-compare -Wno-cast-qual -Wno-error -D__KERNEL__ -DMODULE -DNVRM -DNV_VERSION_STRING=“319.32” -Wno-unused-function -Wuninitialized -UDEBUG -U_DEBUG -DNDEBUG -D__linux__ -DMODULE -D"KBUILD_STR(s)=#s" -D"KBUILD_BASENAME=KBUILD_STR(nv_acpi)" -D"KBUILD_MODNAME=KBUILD_STR(nvidia)" -c -o /var/lib/dkms/nvidia/319.32/build/nv-acpi.o /var/lib/dkms/nvidia/319.32/build/nv-acpi.c
In file included from /usr/src/kernels/3.10.3-300.fc19.i686/arch/x86/include/asm/bitops.h:514:0,
from /usr/src/kernels/3.10.3-300.fc19.i686/include/linux/bitops.h:22,
from /usr/src/kernels/3.10.3-300.fc19.i686/include/linux/kernel.h:10,
from /usr/src/kernels/3.10.3-300.fc19.i686/include/linux/sched.h:15,
from /usr/src/kernels/3.10.3-300.fc19.i686/include/linux/utsname.h:5,
from /var/lib/dkms/nvidia/319.32/build/nv-linux.h:44,
from /var/lib/dkms/nvidia/319.32/build/nv-acpi.c:15:
/usr/src/kernels/3.10.3-300.fc19.i686/include/linux/bitops.h: In function ‘hweight_long’:
/usr/src/kernels/3.10.3-300.fc19.i686/include/asm-generic/bitops/const_hweight.h:26:70: warning: signed and unsigned type in conditional expression [-Wsign-compare]
#define hweight32(w) (__builtin_constant_p(w) ? __const_hweight32(w) : __arch_hweight32(w))
^
/usr/src/kernels/3.10.3-300.fc19.i686/include/linux/bitops.h:66:26: note: in expansion of macro ‘hweight32’
return sizeof(w) == 4 ? hweight32(w) : hweight64(w);
^
In file included from /usr/src/kernels/3.10.3-300.fc19.i686/arch/x86/include/asm/cpumask.h:4:0,
from /usr/src/kernels/3.10.3-300.fc19.i686/arch/x86/include/asm/msr.h:10,
from /usr/src/kernels/3.10.3-300.fc19.i686/arch/x86/include/asm/processor.h:20,
from /usr/src/kernels/3.10.3-300.fc19.i686/arch/x86/include/asm/thread_info.h:22,
from /usr/src/kernels/3.10.3-300.fc19.i686/include/linux/thread_info.h:54,
from /usr/src/kernels/3.10.3-300.fc19.i686/include/linux/preempt.h:9,
from /usr/src/kernels/3.10.3-300.fc19.i686/include/linux/spinlock.h:50,
from /usr/src/kernels/3.10.3-300.fc19.i686/include/linux/seqlock.h:29,
from /usr/src/kernels/3.10.3-300.fc19.i686/include/linux/time.h:5,
from /usr/src/kernels/3.10.3-300.fc19.i686/include/uapi/linux/timex.h:56,
from /usr/src/kernels/3.10.3-300.fc19.i686/include/linux/timex.h:56,
from /usr/src/kernels/3.10.3-300.fc19.i686/include/linux/sched.h:17,
from /usr/src/kernels/3.10.3-300.fc19.i686/include/linux/utsname.h:5,
from /var/lib/dkms/nvidia/319.32/build/nv-linux.h:44,
from /var/lib/dkms/nvidia/319.32/build/nv-acpi.c:15:
/usr/src/kernels/3.10.3-300.fc19.i686/include/linux/cpumask.h: In function ‘cpumask_parse’:
/usr/src/kernels/3.10.3-300.fc19.i686/include/linux/cpumask.h:603:26: warning: signed and unsigned type in conditional expression [-Wsign-compare]
int len = nl ? nl - buf : strlen(buf);
^
In file included from /usr/src/kernels/3.10.3-300.fc19.i686/include/uapi/linux/stddef.h:1:0,
from /usr/src/kernels/3.10.3-300.fc19.i686/include/linux/stddef.h:4,
from /usr/src/kernels/3.10.3-300.fc19.i686/include/uapi/linux/posix_types.h:4,
from /usr/src/kernels/3.10.3-300.fc19.i686/include/uapi/linux/types.h:13,
from /usr/src/kernels/3.10.3-300.fc19.i686/include/linux/types.h:5,
from /usr/src/kernels/3.10.3-300.fc19.i686/include/uapi/linux/capability.h:16,
from /usr/src/kernels/3.10.3-300.fc19.i686/include/linux/capability.h:15,
from /usr/src/kernels/3.10.3-300.fc19.i686/include/linux/sched.h:13,
from /usr/src/kernels/3.10.3-300.fc19.i686/include/linux/utsname.h:5,
from /var/lib/dkms/nvidia/319.32/build/nv-linux.h:44,
from /var/lib/dkms/nvidia/319.32/build/nv-acpi.c:15:
/usr/src/kernels/3.10.3-300.fc19.i686/arch/x86/include/asm/uaccess_32.h: In function ‘copy_from_user’:
/usr/src/kernels/3.10.3-300.fc19.i686/arch/x86/include/asm/uaccess_32.h:208:28: warning: comparison between signed and unsigned integer expressions [-Wsign-compare]
if (likely(sz == -1 || sz >= n))
^
/usr/src/kernels/3.10.3-300.fc19.i686/include/linux/c

Same s*** happens with the 3.10.4-300 kernel.
Come on Nvidia…sort nv-i2c problem out!

Hooray!

Was there a new kernel released?

Sign up for eMail updates. I think you mean driver?

How did you solve this?
I started having trouble since kernel 3.11