Driver does not install

I have tried installing the nvidia driver from the cuda repository, but it fails with the following compile file. This is on a 64 bit Fedora Core 19 install.

DKMS make.log for nvidia-319.37 for kernel 3.11.6-200.fc19.x86_64 (x86_64)
Fri  8 Nov 14:25:22 HKT 2013
NVIDIA: calling KBUILD...
make -C /lib/modules/3.11.6-200.fc19.x86_64/build \
KBUILD_SRC=/usr/src/kernels/3.11.6-200.fc19.x86_64 \
KBUILD_EXTMOD="/var/lib/dkms/nvidia/319.37/build" -f /usr/src/kernels/3.11.6-200.fc19.x86_64/Makefile \
modules
test -e include/generated/autoconf.h -a -e include/config/auto.conf || (		\
echo >&2;							\
echo >&2 "  ERROR: Kernel configuration is invalid.";		\
echo >&2 "         include/generated/autoconf.h or include/config/auto.conf are missing.";\
echo >&2 "         Run 'make oldconfig && make prepare' on kernel src to fix it.";	\
echo >&2 ;							\
/bin/false)
mkdir -p /var/lib/dkms/nvidia/319.37/build/.tmp_versions ; rm -f /var/lib/dkms/nvidia/319.37/build/.tmp_versions/*
make -f /usr/src/kernels/3.11.6-200.fc19.x86_64/scripts/Makefile.build obj=/var/lib/dkms/nvidia/319.37/build
  cc -Wp,-MD,/var/lib/dkms/nvidia/319.37/build/.nv.o.d  -nostdinc -isystem /usr/lib/gcc/x86_64-redhat-linux/4.8.2/include -I/usr/src/kernels/3.11.6-200.fc19.x86_64/arch/x86/include -Iarch/x86/include/generated  -I/usr/src/kernels/3.11.6-200.fc19.x86_64/include -Iinclude -I/usr/src/kernels/3.11.6-200.fc19.x86_64/arch/x86/include/uapi -Iarch/x86/include/generated/uapi -I/usr/src/kernels/3.11.6-200.fc19.x86_64/include/uapi -Iinclude/generated/uapi -include /usr/src/kernels/3.11.6-200.fc19.x86_64/include/linux/kconfig.h   -I/var/lib/dkms/nvidia/319.37/build -D__KERNEL__ -Wall -Wundef -Wstrict-prototypes -Wno-trigraphs -fno-strict-aliasing -fno-common -Werror-implicit-function-declaration -Wno-format-security -fno-delete-null-pointer-checks -O2 -m64 -mno-sse -mpreferred-stack-boundary=3 -mtune=generic -mno-red-zone -mcmodel=kernel -funit-at-a-time -maccumulate-outgoing-args -fstack-protector -DCONFIG_AS_CFI=1 -DCONFIG_AS_CFI_SIGNAL_FRAME=1 -DCONFIG_AS_CFI_SECTIONS=1 -DCONFIG_AS_FXSAVEQ=1 -DCONFIG_AS_AVX=1 -DCONFIG_AS_AVX2=1 -pipe -Wno-sign-compare -fno-asynchronous-unwind-tables -mno-sse -mno-mmx -mno-sse2 -mno-3dnow -mno-avx -Wframe-larger-than=2048 -Wno-unused-but-set-variable -fno-omit-frame-pointer -fno-optimize-sibling-calls -g -pg -mfentry -DCC_USING_FENTRY -Wdeclaration-after-statement -Wno-pointer-sign -fno-strict-overflow -fconserve-stack -DCC_HAVE_ASM_GOTO   -I/var/lib/dkms/nvidia/319.37/build -Wall -MD -Wsign-compare -Wno-cast-qual -Wno-error -D__KERNEL__ -DMODULE -DNVRM -DNV_VERSION_STRING=\"319.37\" -Wno-unused-function -Wuninitialized -mno-red-zone -mcmodel=kernel -UDEBUG -U_DEBUG -DNDEBUG -D__linux__  -DMODULE  -D"KBUILD_STR(s)=#s" -D"KBUILD_BASENAME=KBUILD_STR(nv)"  -D"KBUILD_MODNAME=KBUILD_STR(nvidia)" -c -o /var/lib/dkms/nvidia/319.37/build/nv.o /var/lib/dkms/nvidia/319.37/build/nv.c
In file included from /usr/src/kernels/3.11.6-200.fc19.x86_64/arch/x86/include/asm/bitops.h:514:0,
                 from /usr/src/kernels/3.11.6-200.fc19.x86_64/include/linux/bitops.h:22,
                 from /usr/src/kernels/3.11.6-200.fc19.x86_64/include/linux/kernel.h:10,
                 from /usr/src/kernels/3.11.6-200.fc19.x86_64/include/linux/sched.h:15,
                 from /usr/src/kernels/3.11.6-200.fc19.x86_64/include/linux/utsname.h:5,
                 from /var/lib/dkms/nvidia/319.37/build/nv-linux.h:44,
                 from /var/lib/dkms/nvidia/319.37/build/nv.c:13:
/usr/src/kernels/3.11.6-200.fc19.x86_64/include/linux/bitops.h: In function ‘hweight_long’:
/usr/src/kernels/3.11.6-200.fc19.x86_64/include/asm-generic/bitops/const_hweight.h:27:70: warning: signed and unsigned type in conditional expression [-Wsign-compare]
 #define hweight64(w) (__builtin_constant_p(w) ? __const_hweight64(w) : __arch_hweight64(w))
                                                                      ^
/usr/src/kernels/3.11.6-200.fc19.x86_64/include/linux/bitops.h:66:41: note: in expansion of macro ‘hweight64’
  return sizeof(w) == 4 ? hweight32(w) : hweight64(w);
                                         ^
In file included from /usr/src/kernels/3.11.6-200.fc19.x86_64/arch/x86/include/asm/cpumask.h:4:0,
                 from /usr/src/kernels/3.11.6-200.fc19.x86_64/arch/x86/include/asm/msr.h:10,
                 from /usr/src/kernels/3.11.6-200.fc19.x86_64/arch/x86/include/asm/processor.h:20,
                 from /usr/src/kernels/3.11.6-200.fc19.x86_64/arch/x86/include/asm/thread_info.h:22,
                 from /usr/src/kernels/3.11.6-200.fc19.x86_64/include/linux/thread_info.h:54,
                 from /usr/src/kernels/3.11.6-200.fc19.x86_64/include/linux/preempt.h:9,
                 from /usr/src/kernels/3.11.6-200.fc19.x86_64/include/linux/spinlock.h:50,
                 from /usr/src/kernels/3.11.6-200.fc19.x86_64/include/linux/seqlock.h:29,
                 from /usr/src/kernels/3.11.6-200.fc19.x86_64/include/linux/time.h:5,
                 from /usr/src/kernels/3.11.6-200.fc19.x86_64/include/uapi/linux/timex.h:56,
                 from /usr/src/kernels/3.11.6-200.fc19.x86_64/include/linux/timex.h:56,
                 from /usr/src/kernels/3.11.6-200.fc19.x86_64/include/linux/sched.h:17,
                 from /usr/src/kernels/3.11.6-200.fc19.x86_64/include/linux/utsname.h:5,
                 from /var/lib/dkms/nvidia/319.37/build/nv-linux.h:44,
                 from /var/lib/dkms/nvidia/319.37/build/nv.c:13:
/usr/src/kernels/3.11.6-200.fc19.x86_64/include/linux/cpumask.h: In function ‘cpumask_parse’:
/usr/src/kernels/3.11.6-200.fc19.x86_64/include/linux/cpumask.h:603:26: warning: signed and unsigned type in conditional expression [-Wsign-compare]
  int len = nl ? nl - buf : strlen(buf);
                          ^
In file included from /usr/src/kernels/3.11.6-200.fc19.x86_64/include/uapi/linux/stddef.h:1:0,
                 from /usr/src/kernels/3.11.6-200.fc19.x86_64/include/linux/stddef.h:4,
                 from /usr/src/kernels/3.11.6-200.fc19.x86_64/include/uapi/linux/posix_types.h:4,
                 from /usr/src/kernels/3.11.6-200.fc19.x86_64/include/uapi/linux/types.h:13,
                 from /usr/src/kernels/3.11.6-200.fc19.x86_64/include/linux/types.h:5,
                 from /usr/src/kernels/3.11.6-200.fc19.x86_64/include/uapi/linux/capability.h:16,
                 from /usr/src/kernels/3.11.6-200.fc19.x86_64/include/linux/capability.h:15,
                 from /usr/src/kernels/3.11.6-200.fc19.x86_64/include/linux/sched.h:13,
                 from /usr/src/kernels/3.11.6-200.fc19.x86_64/include/linux/utsname.h:5,
                 from /var/lib/dkms/nvidia/319.37/build/nv-linux.h:44,
                 from /var/lib/dkms/nvidia/319.37/build/nv.c:13:
/usr/src/kernels/3.11.6-200.fc19.x86_64/arch/x86/include/asm/uaccess_64.h: In function ‘copy_from_user’:
/usr/src/kernels/3.11.6-200.fc19.x86_64/arch/x86/include/asm/uaccess_64.h:62:28: warning: comparison between signed and unsigned integer expressions [-Wsign-compare]
  if (likely(sz == -1 || sz >= n))
                            ^
/usr/src/kernels/3.11.6-200.fc19.x86_64/include/linux/compiler.h:152:40: note: in definition of macro ‘likely’
 # define likely(x) __builtin_expect(!!(x), 1)
                                        ^
  if [ "-pg" = "-pg" ]; then if [ /var/lib/dkms/nvidia/319.37/build/nv.o != "scripts/mod/empty.o" ]; then /usr/src/kernels/3.11.6-200.fc19.x86_64/scripts/recordmcount  "/var/lib/dkms/nvidia/319.37/build/nv.o"; fi; fi;
  cc -Wp,-MD,/var/lib/dkms/nvidia/319.37/build/.nv-acpi.o.d  -nostdinc -isystem /usr/lib/gcc/x86_64-redhat-linux/4.8.2/include -I/usr/src/kernels/3.11.6-200.fc19.x86_64/arch/x86/include -Iarch/x86/include/generated  -I/usr/src/kernels/3.11.6-200.fc19.x86_64/include -Iinclude -I/usr/src/kernels/3.11.6-200.fc19.x86_64/arch/x86/include/uapi -Iarch/x86/include/generated/uapi -I/usr/src/kernels/3.11.6-200.fc19.x86_64/include/uapi -Iinclude/generated/uapi -include /usr/src/kernels/3.11.6-200.fc19.x86_64/include/linux/kconfig.h   -I/var/lib/dkms/nvidia/319.37/build -D__KERNEL__ -Wall -Wundef -Wstrict-prototypes -Wno-trigraphs -fno-strict-aliasing -fno-common -Werror-implicit-function-declaration -Wno-format-security -fno-delete-null-pointer-checks -O2 -m64 -mno-sse -mpreferred-stack-boundary=3 -mtune=generic -mno-red-zone -mcmodel=kernel -funit-at-a-time -maccumulate-outgoing-args -fstack-protector -DCONFIG_AS_CFI=1 -DCONFIG_AS_CFI_SIGNAL_FRAME=1 -DCONFIG_AS_CFI_SECTIONS=1 -DCONFIG_AS_FXSAVEQ=1 -DCONFIG_AS_AVX=1 -DCONFIG_AS_AVX2=1 -pipe -Wno-sign-compare -fno-asynchronous-unwind-tables -mno-sse -mno-mmx -mno-sse2 -mno-3dnow -mno-avx -Wframe-larger-than=2048 -Wno-unused-but-set-variable -fno-omit-frame-pointer -fno-optimize-sibling-calls -g -pg -mfentry -DCC_USING_FENTRY -Wdeclaration-after-statement -Wno-pointer-sign -fno-strict-overflow -fconserve-stack -DCC_HAVE_ASM_GOTO   -I/var/lib/dkms/nvidia/319.37/build -Wall -MD -Wsign-compare -Wno-cast-qual -Wno-error -D__KERNEL__ -DMODULE -DNVRM -DNV_VERSION_STRING=\"319.37\" -Wno-unused-function -Wuninitialized -mno-red-zone -mcmodel=kernel -UDEBUG -U_DEBUG -DNDEBUG -D__linux__  -DMODULE  -D"KBUILD_STR(s)=#s" -D"KBUILD_BASENAME=KBUILD_STR(nv_acpi)"  -D"KBUILD_MODNAME=KBUILD_STR(nvidia)" -c -o /var/lib/dkms/nvidia/319.37/build/nv-acpi.o /var/lib/dkms/nvidia/319.37/build/nv-acpi.c
In file included from /usr/src/kernels/3.11.6-200.fc19.x86_64/arch/x86/include/asm/bitops.h:514:0,
                 from /usr/src/kernels/3.11.6-200.fc19.x86_64/include/linux/bitops.h:22,
                 from /usr/src/kernels/3.11.6-200.fc19.x86_64/include/linux/kernel.h:10,
                 from /usr/src/kernels/3.11.6-200.fc19.x86_64/include/linux/sched.h:15,
                 from /usr/src/kernels/3.11.6-200.fc19.x86_64/include/linux/utsname.h:5,
                 from /var/lib/dkms/nvidia/319.37/build/nv-linux.h:44,
                 from /var/lib/dkms/nvidia/319.37/build/nv-acpi.c:15:
/usr/src/kernels/3.11.6-200.fc19.x86_64/include/linux/bitops.h: In function ‘hweight_long’:
/usr/src/kernels/3.11.6-200.fc19.x86_64/include/asm-generic/bitops/const_hweight.h:27:70: warning: signed and unsigned type in conditional expression [-Wsign-compare]
 #define hweight64(w) (__builtin_constant_p(w) ? __const_hweight64(w) : __arch_hweight64(w))
                                                                      ^
/usr/src/kernels/3.11.6-200.fc19.x86_64/include/linux/bitops.h:66:41: note: in expansion of macro ‘hweight64’
  return sizeof(w) == 4 ? hweight32(w) : hweight64(w);
                                         ^
In file included from /usr/src/kernels/3.11.6-200.fc19.x86_64/arch/x86/include/asm/cpumask.h:4:0,
                 from /usr/src/kernels/3.11.6-200.fc19.x86_64/arch/x86/include/asm/msr.h:10,
                 from /usr/src/kernels/3.11.6-200.fc19.x86_64/arch/x86/include/asm/processor.h:20,
                 from /usr/src/kernels/3.11.6-200.fc19.x86_64/arch/x86/include/asm/thread_info.h:22,
                 from /usr/src/kernels/3.11.6-200.fc19.x86_64/include/linux/thread_info.h:54,
                 from /usr/src/kernels/3.11.6-200.fc19.x86_64/include/linux/preempt.h:9,
                 from /usr/src/kernels/3.11.6-200.fc19.x86_64/include/linux/spinlock.h:50,
                 from /usr/src/kernels/3.11.6-200.fc19.x86_64/include/linux/seqlock.h:29,
                 from /usr/src/kernels/3.11.6-200.fc19.x86_64/include/linux/time.h:5,
                 from /usr/src/kernels/3.11.6-200.fc19.x86_64/include/uapi/linux/timex.h:56,
                 from /usr/src/kernels/3.11.6-200.fc19.x86_64/include/linux/timex.h:56,
                 from /usr/src/kernels/3.11.6-200.fc19.x86_64/include/linux/sched.h:17,
                 from /usr/src/kernels/3.11.6-200.fc19.x86_64/include/linux/utsname.h:5,
                 from /var/lib/dkms/nvidia/319.37/build/nv-linux.h:44,
                 from /var/lib/dkms/nvidia/319.37/build/nv-acpi.c:15:
/usr/src/kernels/3.11.6-200.fc19.x86_64/include/linux/cpumask.h: In function ‘cpumask_parse’:
/usr/src/kernels/3.11.6-200.fc19.x86_64/include/linux/cpumask.h:603:26: warning: signed and unsigned type in conditional expression [-Wsign-compare]
  int len = nl ? nl - buf : strlen(buf);
                          ^
In file included from /usr/src/kernels/3.11.6-200.fc19.x86_64/include/uapi/linux/stddef.h:1:0,
                 from /usr/src/kernels/3.11.6-200.fc19.x86_64/include/linux/stddef.h:4,
                 from /usr/src/kernels/3.11.6-200.fc19.x86_64/include/uapi/linux/posix_types.h:4,
                 from /usr/src/kernels/3.11.6-200.fc19.x86_64/include/uapi/linux/types.h:13,
                 from /usr/src/kernels/3.11.6-200.fc19.x86_64/include/linux/types.h:5,
                 from /usr/src/kernels/3.11.6-200.fc19.x86_64/include/uapi/linux/capability.h:16,
                 from /usr/src/kernels/3.11.6-200.fc19.x86_64/include/linux/capability.h:15,
                 from /usr/src/kernels/3.11.6-200.fc19.x86_64/include/linux/sched.h:13,
                 from /usr/src/kernels/3.11.6-200.fc19.x86_64/include/linux/utsname.h:5,
                 from /var/lib/dkms/nvidia/319.37/build/nv-linux.h:44,
                 from /var/lib/dkms/nvidia/319.37/build/nv-acpi.c:15:
/usr/src/kernels/3.11.6-200.fc19.x86_64/arch/x86/include/asm/uaccess_64.h: In function ‘copy_from_user’:
/usr/src/kernels/3.11.6-200.fc19.x86_64/arch/x86/include/asm/uaccess_64.h:62:28: warning: comparison between signed and unsigned integer expressions [-Wsign-compare]
  if (likely(sz == -1 || sz >= n))
                            ^
/usr/src/kernels/3.11.6-200.fc19.x86_64/include/linux/compiler.h:152:40: note: in definition of macro ‘likely’
 # define likely(x) __builtin_expect(!!(x), 1)
                                        ^
/var/lib/dkms/nvidia/319.37/build/nv-acpi.c: At top level:
/var/lib/dkms/nvidia/319.37/build/nv-acpi.c:70:9: warning: initialization from incompatible pointer type [enabled by default]
         .remove = nv_acpi_remove,
         ^
/var/lib/dkms/nvidia/319.37/build/nv-acpi.c:70:9: warning: (near initialization for ‘nv_acpi_driver_template.ops.remove’) [enabled by default]
  if [ "-pg" = "-pg" ]; then if [ /var/lib/dkms/nvidia/319.37/build/nv-acpi.o != "scripts/mod/empty.o" ]; then /usr/src/kernels/3.11.6-200.fc19.x86_64/scripts/recordmcount  "/var/lib/dkms/nvidia/319.37/build/nv-acpi.o"; fi; fi;
  cc -Wp,-MD,/var/lib/dkms/nvidia/319.37/build/.nv-chrdev.o.d  -nostdinc -isystem /usr/lib/gcc/x86_64-redhat-linux/4.8.2/include -I/usr/src/kernels/3.11.6-200.fc19.x86_64/arch/x86/include -Iarch/x86/include/generated  -I/usr/src/kernels/3.11.6-200.fc19.x86_64/include -Iinclude -I/usr/src/kernels/3.11.6-200.fc19.x86_64/arch/x86/include/uapi -Iarch/x86/include/generated/uapi -I/usr/src/kernels/3.11.6-200.fc19.x86_64/include/uapi -Iinclude/generated/uapi -include /usr/src/kernels/3.11.6-200.fc19.x86_64/include/linux/kconfig.h   -I/var/lib/dkms/nvidia/319.37/build -D__KERNEL__ -Wall -Wundef -Wstrict-prototypes -Wno-trigraphs -fno-strict-aliasing -fno-common -Werror-implicit-function-declaration -Wno-format-security -fno-delete-null-pointer-checks -O2 -m64 -mno-sse -mpreferred-stack-boundary=3 -mtune=generic -mno-red-zone -mcmodel=kernel -funit-at-a-time -maccumulate-outgoing-args -fstack-protector -DCONFIG_AS_CFI=1 -DCONFIG_AS_CFI_SIGNAL_FRAME=1 -DCONFIG_AS_CFI_SECTIONS=1 -DCONFIG_AS_FXSAVEQ=1 -DCONFIG_AS_AVX=1 -DCONFIG_AS_AVX2=1 -pipe -Wno-sign-compare -fno-asynchronous-unwind-tables -mno-sse -mno-mmx -mno-sse2 -mno-3dnow -mno-avx -Wframe-larger-than=2048 -Wno-unused-but-set-variable -fno-omit-frame-pointer -fno-optimize-sibling-calls -g -pg -mfentry -DCC_USING_FENTRY -Wdeclaration-after-statement -Wno-pointer-sign -fno-strict-overflow -fconserve-stack -DCC_HAVE_ASM_GOTO   -I/var/lib/dkms/nvidia/319.37/build -Wall -MD -Wsign-compare -Wno-cast-qual -Wno-error -D__KERNEL__ -DMODULE -DNVRM -DNV_VERSION_STRING=\"319.37\" -Wno-unused-function -Wuninitialized -mno-red-zone -mcmodel=kernel -UDEBUG -U_DEBUG -DNDEBUG -D__linux__  -DMODULE  -D"KBUILD_STR(s)=#s" -D"KBUILD_BASENAME=KBUILD_STR(nv_chrdev)"  -D"KBUILD_MODNAME=KBUILD_STR(nvidia)" -c -o /var/lib/dkms/nvidia/319.37/build/nv-chrdev.o /var/lib/dkms/nvidia/319.37/build/nv-chrdev.c
In file included from /usr/src/kernels/3.11.6-200.fc19.x86_64/arch/x86/include/asm/bitops.h:514:0,
                 from /usr/src/kernels/3.11.6-200.fc19.x86_64/include/linux/bitops.h:22,
                 from /usr/src/kernels/3.11.6-200.fc19.x86_64/include/linux/kernel.h:10,
                 from /usr/src/kernels/3.11.6-200.fc19.x86_64/include/linux/sched.h:15,
                 from /usr/src/kernels/3.11.6-200.fc19.x86_64/include/linux/utsname.h:5,
                 from /var/lib/dkms/nvidia/319.37/build/nv-linux.h:44,
                 from /var/lib/dkms/nvidia/319.37/build/nv-chrdev.c:15:
/usr/src/kernels/3.11.6-200.fc19.x86_64/include/linux/bitops.h: In function ‘hweight_long’:
/usr/src/kernels/3.11.6-200.fc19.x86_64/include/asm-generic/bitops/const_hweight.h:27:70: warning: signed and unsigned type in conditional expression [-Wsign-compare]
 #define hweight64(w) (__builtin_constant_p(w) ? __const_hweight64(w) : __arch_hweight64(w))
                                                                      ^
/usr/src/kernels/3.11.6-200.fc19.x86_64/include/linux/bitops.h:66:41: note: in expansion of macro ‘hweight64’
  return sizeof(w) == 4 ? hweight32(w) : hweight64(w);
                                         ^
In file included from /usr/src/kernels/3.11.6-200.fc19.x86_64/arch/x86/include/asm/cpumask.h:4:0,
                 from /usr/src/kernels/3.11.6-200.fc19.x86_64/arch/x86/include/asm/msr.h:10,
                 from /usr/src/kernels/3.11.6-200.fc19.x86_64/arch/x86/include/asm/processor.h:20,
                 from /usr/src/kernels/3.11.6-200.fc19.x86_64/arch/x86/include/asm/thread_info.h:22,
                 from /usr/src/kernels/3.11.6-200.fc19.x86_64/include/linux/thread_info.h:54,
                 from /usr/src/kernels/3.11.6-200.fc19.x86_64/include/linux/preempt.h:9,
                 from /usr/src/kernels/3.11.6-200.fc19.x86_64/include/linux/spinlock.h:50,
                 from /usr/src/kernels/3.11.6-200.fc19.x86_64/include/linux/seqlock.h:29,
                 from /usr/src/kernels/3.11.6-200.fc19.x86_64/include/linux/time.h:5,
                 from /usr/src/kernels/3.11.6-200.fc19.x86_64/include/uapi/linux/timex.h:56,
                 from /usr/src/kernels/3.11.6-200.fc19.x86_64/include/linux/timex.h:56,
                 from /usr/src/kernels/3.11.6-200.fc19.x86_64/include/linux/sched.h:17,
                 from /usr/src/kernels/3.11.6-200.fc19.x86_64/include/linux/utsname.h:5,
                 from /var/lib/dkms/nvidia/319.37/build/nv-linux.h:44,
                 from /var/lib/dkms/nvidia/319.37/build/nv-chrdev.c:15:
/usr/src/kernels/3.11.6-200.fc19.x86_64/include/linux/cpumask.h: In function ‘cpumask_parse’:
/usr/src/kernels/3.11.6-200.fc19.x86_64/include/linux/cpumask.h:603:26: warning: signed and unsigned type in conditional expression [-Wsign-compare]
  int len = nl ? nl - buf : strlen(buf);
                          ^
In file included from /usr/src/kernels/3.11.6-200.fc19.x86_64/include/uapi/linux/stddef.h:1:0,
                 from /usr/src/kernels/3.11.6-200.fc19.x86_64/include/linux/stddef.h:4,
                 from /usr/src/kernels/3.11.6-200.fc19.x86_64/include/uapi/linux/posix_types.h:4,
                 from /usr/src/kernels/3.11.6-200.fc19.x86_64/include/uapi/linux/types.h:13,
                 from /usr/src/kernels/3.11.6-200.fc19.x86_64/include/linux/types.h:5,
                 from /usr/src/kernels/3.11.6-200.fc19.x86_64/include/uapi/linux/capability.h:16,
                 from /usr/src/kernels/3.11.6-200.fc19.x86_64/include/linux/capability.h:15,
                 from /usr/src/kernels/3.11.6-200.fc19.x86_64/include/linux/sched.h:13,
                 from /usr/src/kernels/3.11.6-200.fc19.x86_64/include/linux/utsname.h:5,
                 from /var/lib/dkms/nvidia/319.37/build/nv-linux.h:44,
                 from /var/lib/dkms/nvidia/319.37/build/nv-chrdev.c:15:
/usr/src/kernels/3.11.6-200.fc19.x86_64/arch/x86/include/asm/uaccess_64.h: In function ‘copy_from_user’:
/usr/src/kernels/3.11.6-200.fc19.x86_64/arch/x86/include/asm/uaccess_64.h:62:28: warning: comparison between signed and unsigned integer expressions [-Wsign-compare]
  if (likely(sz == -1 || sz >= n))
                            ^
/usr/src/kernels/3.11.6-200.fc19.x86_64/include/linux/compiler.h:152:40: note: in definition of macro ‘likely’
 # define likely(x) __builtin_expect(!!(x), 1)
                                        ^
  if [ "-pg" = "-pg" ]; then if [ /var/lib/dkms/nvidia/319.37/build/nv-chrdev.o != "scripts/mod/empty.o" ]; then /usr/src/kernels/3.11.6-200.fc19.x86_64/scripts/recordmcount  "/var/lib/dkms/nvidia/319.37/build/nv-chrdev.o"; fi; fi;
  cc -Wp,-MD,/var/lib/dkms/nvidia/319.37/build/.nv-cray.o.d  -nostdinc -isystem /usr/lib/gcc/x86_64-redhat-linux/4.8.2/include -I/usr/src/kernels/3.11.6-200.fc19.x86_64/arch/x86/include -Iarch/x86/include/generated  -I/usr/src/kernels/3.11.6-200.fc19.x86_64/include -Iinclude -I/usr/src/kernels/3.11.6-200.fc19.x86_64/arch/x86/include/uapi -Iarch/x86/include/generated/uapi -I/usr/src/kernels/3.11.6-200.fc19.x86_64/include/uapi -Iinclude/generated/uapi -include /usr/src/kernels/3.11.6-200.fc19.x86_64/include/linux/kconfig.h   -I/var/lib/dkms/nvidia/319.37/build -D__KERNEL__ -Wall -Wundef -Wstrict-prototypes -Wno-trigraphs -fno-strict-aliasing -fno-common -Werror-implicit-function-declaration -Wno-format-security -fno-delete-null-pointer-checks -O2 -m64 -mno-sse -mpreferred-stack-boundary=3 -mtune=generic -mno-red-zone -mcmodel=kernel -funit-at-a-time -maccumulate-outgoing-args -fstack-protector -DCONFIG_AS_CFI=1 -DCONFIG_AS_CFI_SIGNAL_FRAME=1 -DCONFIG_AS_CFI_SECTIONS=1 -DCONFIG_AS_FXSAVEQ=1 -DCONFIG_AS_AVX=1 -DCONFIG_AS_AVX2=1 -pipe -Wno-sign-compare -fno-asynchronous-unwind-tables -mno-sse -mno-mmx -mno-sse2 -mno-3dnow -mno-avx -Wframe-larger-than=2048 -Wno-unused-but-set-variable -fno-omit-frame-pointer -fno-optimize-sibling-calls -g -pg -mfentry -DCC_USING_FENTRY -Wdeclaration-after-statement -Wno-pointer-sign -fno-strict-overflow -fconserve-stack -DCC_HAVE_ASM_GOTO   -I/var/lib/dkms/nvidia/319.37/build -Wall -MD -Wsign-compare -Wno-cast-qual -Wno-error -D__KERNEL__ -DMODULE -DNVRM -DNV_VERSION_STRING=\"319.37\" -Wno-unused-function -Wuninitialized -mno-red-zone -mcmodel=kernel -UDEBUG -U_DEBUG -DNDEBUG -D__linux__  -DMODULE  -D"KBUILD_STR(s)=#s" -D"KBUILD_BASENAME=KBUILD_STR(nv_cray)"  -D"KBUILD_MODNAME=KBUILD_STR(nvidia)" -c -o /var/lib/dkms/nvidia/319.37/build/nv-cray.o /var/lib/dkms/nvidia/319.37/build/nv-cray.c
In file included from /usr/src/kernels/3.11.6-200.fc19.x86_64/arch/x86/include/asm/bitops.h:514:0,
                 from /usr/src/kernels/3.11.6-200.fc19.x86_64/include/linux/bitops.h:22,
                 from /usr/src/kernels/3.11.6-200.fc19.x86_64/include/linux/kernel.h:10,
                 from /usr/src/kernels/3.11.6-200.fc19.x86_64/include/linux/sched.h:15,
                 from /usr/src/kernels/3.11.6-200.fc19.x86_64/include/linux/utsname.h:5,
                 from /var/lib/dkms/nvidia/319.37/build/nv-linux.h:44,
                 from /var/lib/dkms/nvidia/319.37/build/nv-cray.c:15:
/usr/src/kernels/3.11.6-200.fc19.x86_64/include/linux/bitops.h: In function ‘hweight_long’:
/usr/src/kernels/3.11.6-200.fc19.x86_64/include/asm-generic/bitops/const_hweight.h:27:70: warning: signed and unsigned type in conditional expression [-Wsign-compare]
 #define hweight64(w) (__builtin_constant_p(w) ? __const_hweight64(w) : __arch_hweight64(w))
                                                                      ^
/usr/src/kernels/3.11.6-200.fc19.x86_64/include/linux/bitops.h:66:41: note: in expansion of macro ‘hweight64’
  return sizeof(w) == 4 ? hweight32(w) : hweight64(w);
                                         ^
In file included from /usr/src/kernels/3.11.6-200.fc19.x86_64/arch/x86/include/asm/cpumask.h:4:0,
                 from /usr/src/kernels/3.11.6-200.fc19.x86_64/arch/x86/include/asm/msr.h:10,
                 from /usr/src/kernels/3.11.6-200.fc19.x86_64/arch/x86/include/asm/processor.h:20,
                 from /usr/src/kernels/3.11.6-200.fc19.x86_64/arch/x86/include/asm/thread_info.h:22,
                 from /usr/src/kernels/3.11.6-200.fc19.x86_64/include/linux/thread_info.h:54,
                 from /usr/src/kernels/3.11.6-200.fc19.x86_64/include/linux/preempt.h:9,
                 from /usr/src/kernels/3.11.6-200.fc19.x86_64/include/linux/spinlock.h:50,
                 from /usr/src/kernels/3.11.6-200.fc19.x86_64/include/linux/seqlock.h:29,
                 from /usr/src/kernels/3.11.6-200.fc19.x86_64/include/linux/time.h:5,
                 from /usr/src/kernels/3.11.6-200.fc19.x86_64/include/uapi/linux/timex.h:56,
                 from /usr/src/kernels/3.11.6-200.fc19.x86_64/include/linux/timex.h:56,
                 from /usr/src/kernels/3.11.6-200.fc19.x86_64/include/linux/sched.h:17,
                 from /usr/src/kernels/3.11.6-200.fc19.x86_64/include/linux/utsname.h:5,
                 from /var/lib/dkms/nvidia/319.37/build/nv-linux.h:44,
                 from /var/lib/dkms/nvidia/319.37/build/nv-cray.c:15:
/usr/src/kernels/3.11.6-200.fc19.x86_64/include/linux/cpumask.h: In function ‘cpumask_parse’:
/usr/src/kernels/3.11.6-200.fc19.x86_64/include/linux/cpumask.h:603:26: warning: signed and unsigned type in conditional expression [-Wsign-compare]
  int len = nl ? nl - buf : strlen(buf);
                          ^
In file included from /usr/src/kernels/3.11.6-200.fc19.x86_64/include/uapi/linux/stddef.h:1:0,
                 from /usr/src/kernels/3.11.6-200.fc19.x86_64/include/linux/stddef.h:4,
                 from /usr/src/kernels/3.11.6-200.fc19.x86_64/include/uapi/linux/posix_types.h:4,
                 from /usr/src/kernels/3.11.6-200.fc19.x86_64/include/uapi/linux/types.h:13,
                 from /usr/src/kernels/3.11.6-200.fc19.x86_64/include/linux/types.h:5,
                 from /usr/src/kernels/3.11.6-200.fc19.x86_64/include/uapi/linux/capability.h:16,
                 from /usr/src/kernels/3.11.6-200.fc19.x86_64/include/linux/capability.h:15,
                 from /usr/src/kernels/3.11.6-200.fc19.x86_64/include/linux/sched.h:13,
                 from /usr/src/kernels/3.11.6-200.fc19.x86_64/include/linux/utsname.h:5,
                 from /var/lib/dkms/nvidia/319.37/build/nv-linux.h:44,
                 from /var/lib/dkms/nvidia/319.37/build/nv-cray.c:15:
/usr/src/kernels/3.11.6-200.fc19.x86_64/arch/x86/include/asm/uaccess_64.h: In function ‘copy_from_user’:
/usr/src/kernels/3.11.6-200.fc19.x86_64/arch/x86/include/asm/uaccess_64.h:62:28: warning: comparison between signed and unsigned integer expressions [-Wsign-compare]
  if (likely(sz == -1 || sz >= n))
                            ^
/usr/src/kernels/3.11.6-200.fc19.x86_64/include/linux/compiler.h:152:40: note: in definition of macro ‘likely’
 # define likely(x) __builtin_expect(!!(x), 1)
                                        ^
  if [ "-pg" = "-pg" ]; then if [ /var/lib/dkms/nvidia/319.37/build/nv-cray.o != "scripts/mod/empty.o" ]; then /usr/src/kernels/3.11.6-200.fc19.x86_64/scripts/recordmcount  "/var/lib/dkms/nvidia/319.37/build/nv-cray.o"; fi; fi;
  cc -Wp,-MD,/var/lib/dkms/nvidia/319.37/build/.nv-drm.o.d  -nostdinc -isystem /usr/lib/gcc/x86_64-redhat-linux/4.8.2/include -I/usr/src/kernels/3.11.6-200.fc19.x86_64/arch/x86/include -Iarch/x86/include/generated  -I/usr/src/kernels/3.11.6-200.fc19.x86_64/include -Iinclude -I/usr/src/kernels/3.11.6-200.fc19.x86_64/arch/x86/include/uapi -Iarch/x86/include/generated/uapi -I/usr/src/kernels/3.11.6-200.fc19.x86_64/include/uapi -Iinclude/generated/uapi -include /usr/src/kernels/3.11.6-200.fc19.x86_64/include/linux/kconfig.h   -I/var/lib/dkms/nvidia/319.37/build -D__KERNEL__ -Wall -Wundef -Wstrict-prototypes -Wno-trigraphs -fno-strict-aliasing -fno-common -Werror-implicit-function-declaration -Wno-format-security -fno-delete-null-pointer-checks -O2 -m64 -mno-sse -mpreferred-stack-boundary=3 -mtune=generic -mno-red-zone -mcmodel=kernel -funit-at-a-time -maccumulate-outgoing-args -fstack-protector -DCONFIG_AS_CFI=1 -DCONFIG_AS_CFI_SIGNAL_FRAME=1 -DCONFIG_AS_CFI_SECTIONS=1 -DCONFIG_AS_FXSAVEQ=1 -DCONFIG_AS_AVX=1 -DCONFIG_AS_AVX2=1 -pipe -Wno-sign-compare -fno-asynchronous-unwind-tables -mno-sse -mno-mmx -mno-sse2 -mno-3dnow -mno-avx -Wframe-larger-than=2048 -Wno-unused-but-set-variable -fno-omit-frame-pointer -fno-optimize-sibling-calls -g -pg -mfentry -DCC_USING_FENTRY -Wdeclaration-after-statement -Wno-pointer-sign -fno-strict-overflow -fconserve-stack -DCC_HAVE_ASM_GOTO   -I/var/lib/dkms/nvidia/319.37/build -Wall -MD -Wsign-compare -Wno-cast-qual -Wno-error -D__KERNEL__ -DMODULE -DNVRM -DNV_VERSION_STRING=\"319.37\" -Wno-unused-function -Wuninitialized -mno-red-zone -mcmodel=kernel -UDEBUG -U_DEBUG -DNDEBUG -D__linux__  -DMODULE  -D"KBUILD_STR(s)=#s" -D"KBUILD_BASENAME=KBUILD_STR(nv_drm)"  -D"KBUILD_MODNAME=KBUILD_STR(nvidia)" -c -o /var/lib/dkms/nvidia/319.37/build/nv-drm.o /var/lib/dkms/nvidia/319.37/build/nv-drm.c
In file included from /usr/src/kernels/3.11.6-200.fc19.x86_64/arch/x86/include/asm/bitops.h:514:0,
                 from /usr/src/kernels/3.11.6-200.fc19.x86_64/include/linux/bitops.h:22,
                 from /usr/src/kernels/3.11.6-200.fc19.x86_64/include/linux/kernel.h:10,
                 from /usr/src/kernels/3.11.6-200.fc19.x86_64/include/linux/sched.h:15,
                 from /usr/src/kernels/3.11.6-200.fc19.x86_64/include/linux/utsname.h:5,
                 from /var/lib/dkms/nvidia/319.37/build/nv-linux.h:44,
                 from /var/lib/dkms/nvidia/319.37/build/nv-drm.c:15:
/usr/src/kernels/3.11.6-200.fc19.x86_64/include/linux/bitops.h: In function ‘hweight_long’:
/usr/src/kernels/3.11.6-200.fc19.x86_64/include/asm-generic/bitops/const_hweight.h:27:70: warning: signed and unsigned type in conditional expression [-Wsign-compare]
 #define hweight64(w) (__builtin_constant_p(w) ? __const_hweight64(w) : __arch_hweight64(w))
                                                                      ^
/usr/src/kernels/3.11.6-200.fc19.x86_64/include/linux/bitops.h:66:41: note: in expansion of macro ‘hweight64’
  return sizeof(w) == 4 ? hweight32(w) : hweight64(w);
                                         ^
In file included from /usr/src/kernels/3.11.6-200.fc19.x86_64/arch/x86/include/asm/cpumask.h:4:0,
                 from /usr/src/kernels/3.11.6-200.fc19.x86_64/arch/x86/include/asm/msr.h:10,
                 from /usr/src/kernels/3.11.6-200.fc19.x86_64/arch/x86/include/asm/processor.h:20,
                 from /usr/src/kernels/3.11.6-200.fc19.x86_64/arch/x86/include/asm/thread_info.h:22,
                 from /usr/src/kernels/3.11.6-200.fc19.x86_64/include/linux/thread_info.h:54,
                 from /usr/src/kernels/3.11.6-200.fc19.x86_64/include/linux/preempt.h:9,
                 from /usr/src/kernels/3.11.6-200.fc19.x86_64/include/linux/spinlock.h:50,
                 from /usr/src/kernels/3.11.6-200.fc19.x86_64/include/linux/seqlock.h:29,
                 from /usr/src/kernels/3.11.6-200.fc19.x86_64/include/linux/time.h:5,
                 from /usr/src/kernels/3.11.6-200.fc19.x86_64/include/uapi/linux/timex.h:56,
                 from /usr/src/kernels/3.11.6-200.fc19.x86_64/include/linux/timex.h:56,
                 from /usr/src/kernels/3.11.6-200.fc19.x86_64/include/linux/sched.h:17,
                 from /usr/src/kernels/3.11.6-200.fc19.x86_64/include/linux/utsname.h:5,
                 from /var/lib/dkms/nvidia/319.37/build/nv-linux.h:44,
                 from /var/lib/dkms/nvidia/319.37/build/nv-drm.c:15:
/usr/src/kernels/3.11.6-200.fc19.x86_64/include/linux/cpumask.h: In function ‘cpumask_parse’:
/usr/src/kernels/3.11.6-200.fc19.x86_64/include/linux/cpumask.h:603:26: warning: signed and unsigned type in conditional expression [-Wsign-compare]
  int len = nl ? nl - buf : strlen(buf);
                          ^
In file included from /usr/src/kernels/3.11.6-200.fc19.x86_64/include/uapi/linux/stddef.h:1:0,
                 from /usr/src/kernels/3.11.6-200.fc19.x86_64/include/linux/stddef.h:4,
                 from /usr/src/kernels/3.11.6-200.fc19.x86_64/include/uapi/linux/posix_types.h:4,
                 from /usr/src/kernels/3.11.6-200.fc19.x86_64/include/uapi/linux/types.h:13,
                 from /usr/src/kernels/3.11.6-200.fc19.x86_64/include/linux/types.h:5,
                 from /usr/src/kernels/3.11.6-200.fc19.x86_64/include/uapi/linux/capability.h:16,
                 from /usr/src/kernels/3.11.6-200.fc19.x86_64/include/linux/capability.h:15,
                 from /usr/src/kernels/3.11.6-200.fc19.x86_64/include/linux/sched.h:13,
                 from /usr/src/kernels/3.11.6-200.fc19.x86_64/include/linux/utsname.h:5,
                 from /var/lib/dkms/nvidia/319.37/build/nv-linux.h:44,
                 from /var/lib/dkms/nvidia/319.37/build/nv-drm.c:15:
/usr/src/kernels/3.11.6-200.fc19.x86_64/arch/x86/include/asm/uaccess_64.h: In function ‘copy_from_user’:
/usr/src/kernels/3.11.6-200.fc19.x86_64/arch/x86/include/asm/uaccess_64.h:62:28: warning: comparison between signed and unsigned integer expressions [-Wsign-compare]
  if (likely(sz == -1 || sz >= n))
                            ^
/usr/src/kernels/3.11.6-200.fc19.x86_64/include/linux/compiler.h:152:40: note: in definition of macro ‘likely’
 # define likely(x) __builtin_expect(!!(x), 1)
                                        ^
In file included from /usr/src/kernels/3.11.6-200.fc19.x86_64/include/drm/drm_crtc.h:32:0,
                 from /usr/src/kernels/3.11.6-200.fc19.x86_64/include/drm/drmP.h:688,
                 from /var/lib/dkms/nvidia/319.37/build/nv-drm.c:19:
/usr/src/kernels/3.11.6-200.fc19.x86_64/include/linux/fb.h: In function ‘__fb_pad_aligned_buffer’:
/usr/src/kernels/3.11.6-200.fc19.x86_64/include/linux/fb.h:650:17: warning: comparison between signed and unsigned integer expressions [-Wsign-compare]
   for (j = 0; j < s_pitch; j++)
                 ^
  if [ "-pg" = "-pg" ]; then if [ /var/lib/dkms/nvidia/319.37/build/nv-drm.o != "scripts/mod/empty.o" ]; then /usr/src/kernels/3.11.6-200.fc19.x86_64/scripts/recordmcount  "/var/lib/dkms/nvidia/319.37/build/nv-drm.o"; fi; fi;
  cc -Wp,-MD,/var/lib/dkms/nvidia/319.37/build/.nv-gvi.o.d  -nostdinc -isystem /usr/lib/gcc/x86_64-redhat-linux/4.8.2/include -I/usr/src/kernels/3.11.6-200.fc19.x86_64/arch/x86/include -Iarch/x86/include/generated  -I/usr/src/kernels/3.11.6-200.fc19.x86_64/include -Iinclude -I/usr/src/kernels/3.11.6-200.fc19.x86_64/arch/x86/include/uapi -Iarch/x86/include/generated/uapi -I/usr/src/kernels/3.11.6-200.fc19.x86_64/include/uapi -Iinclude/generated/uapi -include /usr/src/kernels/3.11.6-200.fc19.x86_64/include/linux/kconfig.h   -I/var/lib/dkms/nvidia/319.37/build -D__KERNEL__ -Wall -Wundef -Wstrict-prototypes -Wno-trigraphs -fno-strict-aliasing -fno-common -Werror-implicit-function-declaration -Wno-format-security -fno-delete-null-pointer-checks -O2 -m64 -mno-sse -mpreferred-stack-boundary=3 -mtune=generic -mno-red-zone -mcmodel=kernel -funit-at-a-time -maccumulate-outgoing-args -fstack-protector -DCONFIG_AS_CFI=1 -DCONFIG_AS_CFI_SIGNAL_FRAME=1 -DCONFIG_AS_CFI_SECTIONS=1 -DCONFIG_AS_FXSAVEQ=1 -DCONFIG_AS_AVX=1 -DCONFIG_AS_AVX2=1 -pipe -Wno-sign-compare -fno-asynchronous-unwind-tables -mno-sse -mno-mmx -mno-sse2 -mno-3dnow -mno-avx -Wframe-larger-than=2048 -Wno-unused-but-set-variable -fno-omit-frame-pointer -fno-optimize-sibling-calls -g -pg -mfentry -DCC_USING_FENTRY -Wdeclaration-after-statement -Wno-pointer-sign -fno-strict-overflow -fconserve-stack -DCC_HAVE_ASM_GOTO   -I/var/lib/dkms/nvidia/319.37/build -Wall -MD -Wsign-compare -Wno-cast-qual -Wno-error -D__KERNEL__ -DMODULE -DNVRM -DNV_VERSION_STRING=\"319.37\" -Wno-unused-function -Wuninitialized -mno-red-zone -mcmodel=kernel -UDEBUG -U_DEBUG -DNDEBUG -D__linux__  -DMODULE  -D"KBUILD_STR(s)=#s" -D"KBUILD_BASENAME=KBUILD_STR(nv_gvi)"  -D"KBUILD_MODNAME=KBUILD_STR(nvidia)" -c -o /var/lib/dkms/nvidia/319.37/build/nv-gvi.o /var/lib/dkms/nvidia/319.37/build/nv-gvi.c
In file included from /usr/src/kernels/3.11.6-200.fc19.x86_64/arch/x86/include/asm/bitops.h:514:0,
                 from /usr/src/kernels/3.11.6-200.fc19.x86_64/include/linux/bitops.h:22,
                 from /usr/src/kernels/3.11.6-200.fc19.x86_64/include/linux/kernel.h:10,
                 from /usr/src/kernels/3.11.6-200.fc19.x86_64/include/linux/sched.h:15,
                 from /usr/src/kernels/3.11.6-200.fc19.x86_64/include/linux/utsname.h:5,
                 from /var/lib/dkms/nvidia/319.37/build/nv-linux.h:44,
                 from /var/lib/dkms/nvidia/319.37/build/nv-gvi.c:15:
/usr/src/kernels/3.11.6-200.fc19.x86_64/include/linux/bitops.h: In function ‘hweight_long’:
/usr/src/kernels/3.11.6-200.fc19.x86_64/include/asm-generic/bitops/const_hweight.h:27:70: warning: signed and unsigned type in conditional expression [-Wsign-compare]
 #define hweight64(w) (__builtin_constant_p(w) ? __const_hweight64(w) : __arch_hweight64(w))
                                                                      ^
/usr/src/kernels/3.11.6-200.fc19.x86_64/include/linux/bitops.h:66:41: note: in expansion of macro ‘hweight64’
  return sizeof(w) == 4 ? hweight32(w) : hweight64(w);
                                         ^
In file included from /usr/src/kernels/3.11.6-200.fc19.x86_64/arch/x86/include/asm/cpumask.h:4:0,
                 from /usr/src/kernels/3.11.6-200.fc19.x86_64/arch/x86/include/asm/msr.h:10,
                 from /usr/src/kernels/3.11.6-200.fc19.x86_64/arch/x86/include/asm/processor.h:20,
                 from /usr/src/kernels/3.11.6-200.fc19.x86_64/arch/x86/include/asm/thread_info.h:22,
                 from /usr/src/kernels/3.11.6-200.fc19.x86_64/include/linux/thread_info.h:54,
                 from /usr/src/kernels/3.11.6-200.fc19.x86_64/include/linux/preempt.h:9,
                 from /usr/src/kernels/3.11.6-200.fc19.x86_64/include/linux/spinlock.h:50,
                 from /usr/src/kernels/3.11.6-200.fc19.x86_64/include/linux/seqlock.h:29,
                 from /usr/src/kernels/3.11.6-200.fc19.x86_64/include/linux/time.h:5,
                 from /usr/src/kernels/3.11.6-200.fc19.x86_64/include/uapi/linux/timex.h:56,
                 from /usr/src/kernels/3.11.6-200.fc19.x86_64/include/linux/timex.h:56,
                 from /usr/src/kernels/3.11.6-200.fc19.x86_64/include/linux/sched.h:17,
                 from /usr/src/kernels/3.11.6-200.fc19.x86_64/include/linux/utsname.h:5,
                 from /var/lib/dkms/nvidia/319.37/build/nv-linux.h:44,
                 from /var/lib/dkms/nvidia/319.37/build/nv-gvi.c:15:
/usr/src/kernels/3.11.6-200.fc19.x86_64/include/linux/cpumask.h: In function ‘cpumask_parse’:
/usr/src/kernels/3.11.6-200.fc19.x86_64/include/linux/cpumask.h:603:26: warning: signed and unsigned type in conditional expression [-Wsign-compare]
  int len = nl ? nl - buf : strlen(buf);
                          ^
In file included from /usr/src/kernels/3.11.6-200.fc19.x86_64/include/uapi/linux/stddef.h:1:0,
                 from /usr/src/kernels/3.11.6-200.fc19.x86_64/include/linux/stddef.h:4,
                 from /usr/src/kernels/3.11.6-200.fc19.x86_64/include/uapi/linux/posix_types.h:4,
                 from /usr/src/kernels/3.11.6-200.fc19.x86_64/include/uapi/linux/types.h:13,
                 from /usr/src/kernels/3.11.6-200.fc19.x86_64/include/linux/types.h:5,
                 from /usr/src/kernels/3.11.6-200.fc19.x86_64/include/uapi/linux/capability.h:16,
                 from /usr/src/kernels/3.11.6-200.fc19.x86_64/include/linux/capability.h:15,
                 from /usr/src/kernels/3.11.6-200.fc19.x86_64/include/linux/sched.h:13,
                 from /usr/src/kernels/3.11.6-200.fc19.x86_64/include/linux/utsname.h:5,
                 from /var/lib/dkms/nvidia/319.37/build/nv-linux.h:44,
                 from /var/lib/dkms/nvidia/319.37/build/nv-gvi.c:15:
/usr/src/kernels/3.11.6-200.fc19.x86_64/arch/x86/include/asm/uaccess_64.h: In function ‘copy_from_user’:
/usr/src/kernels/3.11.6-200.fc19.x86_64/arch/x86/include/asm/uaccess_64.h:62:28: warning: comparison between signed and unsigned integer expressions [-Wsign-compare]
  if (likely(sz == -1 || sz >= n))
                            ^
/usr/src/kernels/3.11.6-200.fc19.x86_64/include/linux/compiler.h:152:40: note: in definition of macro ‘likely’
 # define likely(x) __builtin_expect(!!(x), 1)
                                        ^
  if [ "-pg" = "-pg" ]; then if [ /var/lib/dkms/nvidia/319.37/build/nv-gvi.o != "scripts/mod/empty.o" ]; then /usr/src/kernels/3.11.6-200.fc19.x86_64/scripts/recordmcount  "/var/lib/dkms/nvidia/319.37/build/nv-gvi.o"; fi; fi;
  cc -Wp,-MD,/var/lib/dkms/nvidia/319.37/build/.nv-i2c.o.d  -nostdinc -isystem /usr/lib/gcc/x86_64-redhat-linux/4.8.2/include -I/usr/src/kernels/3.11.6-200.fc19.x86_64/arch/x86/include -Iarch/x86/include/generated  -I/usr/src/kernels/3.11.6-200.fc19.x86_64/include -Iinclude -I/usr/src/kernels/3.11.6-200.fc19.x86_64/arch/x86/include/uapi -Iarch/x86/include/generated/uapi -I/usr/src/kernels/3.11.6-200.fc19.x86_64/include/uapi -Iinclude/generated/uapi -include /usr/src/kernels/3.11.6-200.fc19.x86_64/include/linux/kconfig.h   -I/var/lib/dkms/nvidia/319.37/build -D__KERNEL__ -Wall -Wundef -Wstrict-prototypes -Wno-trigraphs -fno-strict-aliasing -fno-common -Werror-implicit-function-declaration -Wno-format-security -fno-delete-null-pointer-checks -O2 -m64 -mno-sse -mpreferred-stack-boundary=3 -mtune=generic -mno-red-zone -mcmodel=kernel -funit-at-a-time -maccumulate-outgoing-args -fstack-protector -DCONFIG_AS_CFI=1 -DCONFIG_AS_CFI_SIGNAL_FRAME=1 -DCONFIG_AS_CFI_SECTIONS=1 -DCONFIG_AS_FXSAVEQ=1 -DCONFIG_AS_AVX=1 -DCONFIG_AS_AVX2=1 -pipe -Wno-sign-compare -fno-asynchronous-unwind-tables -mno-sse -mno-mmx -mno-sse2 -mno-3dnow -mno-avx -Wframe-larger-than=2048 -Wno-unused-but-set-variable -fno-omit-frame-pointer -fno-optimize-sibling-calls -g -pg -mfentry -DCC_USING_FENTRY -Wdeclaration-after-statement -Wno-pointer-sign -fno-strict-overflow -fconserve-stack -DCC_HAVE_ASM_GOTO   -I/var/lib/dkms/nvidia/319.37/build -Wall -MD -Wsign-compare -Wno-cast-qual -Wno-error -D__KERNEL__ -DMODULE -DNVRM -DNV_VERSION_STRING=\"319.37\" -Wno-unused-function -Wuninitialized -mno-red-zone -mcmodel=kernel -UDEBUG -U_DEBUG -DNDEBUG -D__linux__  -DMODULE  -D"KBUILD_STR(s)=#s" -D"KBUILD_BASENAME=KBUILD_STR(nv_i2c)"  -D"KBUILD_MODNAME=KBUILD_STR(nvidia)" -c -o /var/lib/dkms/nvidia/319.37/build/nv-i2c.o /var/lib/dkms/nvidia/319.37/build/nv-i2c.c
In file included from /usr/src/kernels/3.11.6-200.fc19.x86_64/arch/x86/include/asm/bitops.h:514:0,
                 from /usr/src/kernels/3.11.6-200.fc19.x86_64/include/linux/bitops.h:22,
                 from /usr/src/kernels/3.11.6-200.fc19.x86_64/include/linux/kernel.h:10,
                 from /usr/src/kernels/3.11.6-200.fc19.x86_64/include/linux/sched.h:15,
                 from /usr/src/kernels/3.11.6-200.fc19.x86_64/include/linux/utsname.h:5,
                 from /var/lib/dkms/nvidia/319.37/build/nv-linux.h:44,
                 from /var/lib/dkms/nvidia/319.37/build/nv-i2c.c:15:
/usr/src/kernels/3.11.6-200.fc19.x86_64/include/linux/bitops.h: In function ‘hweight_long’:
/usr/src/kernels/3.11.6-200.fc19.x86_64/include/asm-generic/bitops/const_hweight.h:27:70: warning: signed and unsigned type in conditional expression [-Wsign-compare]
 #define hweight64(w) (__builtin_constant_p(w) ? __const_hweight64(w) : __arch_hweight64(w))
                                                                      ^
/usr/src/kernels/3.11.6-200.fc19.x86_64/include/linux/bitops.h:66:41: note: in expansion of macro ‘hweight64’
  return sizeof(w) == 4 ? hweight32(w) : hweight64(w);
                                         ^
In file included from /usr/src/kernels/3.11.6-200.fc19.x86_64/arch/x86/include/asm/cpumask.h:4:0,
                 from /usr/src/kernels/3.11.6-200.fc19.x86_64/arch/x86/include/asm/msr.h:10,
                 from /usr/src/kernels/3.11.6-200.fc19.x86_64/arch/x86/include/asm/processor.h:20,
                 from /usr/src/kernels/3.11.6-200.fc19.x86_64/arch/x86/include/asm/thread_info.h:22,
                 from /usr/src/kernels/3.11.6-200.fc19.x86_64/include/linux/thread_info.h:54,
                 from /usr/src/kernels/3.11.6-200.fc19.x86_64/include/linux/preempt.h:9,
                 from /usr/src/kernels/3.11.6-200.fc19.x86_64/include/linux/spinlock.h:50,
                 from /usr/src/kernels/3.11.6-200.fc19.x86_64/include/linux/seqlock.h:29,
                 from /usr/src/kernels/3.11.6-200.fc19.x86_64/include/linux/time.h:5,
                 from /usr/src/kernels/3.11.6-200.fc19.x86_64/include/uapi/linux/timex.h:56,
                 from /usr/src/kernels/3.11.6-200.fc19.x86_64/include/linux/timex.h:56,
                 from /usr/src/kernels/3.11.6-200.fc19.x86_64/include/linux/sched.h:17,
                 from /usr/src/kernels/3.11.6-200.fc19.x86_64/include/linux/utsname.h:5,
                 from /var/lib/dkms/nvidia/319.37/build/nv-linux.h:44,
                 from /var/lib/dkms/nvidia/319.37/build/nv-i2c.c:15:
/usr/src/kernels/3.11.6-200.fc19.x86_64/include/linux/cpumask.h: In function ‘cpumask_parse’:
/usr/src/kernels/3.11.6-200.fc19.x86_64/include/linux/cpumask.h:603:26: warning: signed and unsigned type in conditional expression [-Wsign-compare]
  int len = nl ? nl - buf : strlen(buf);
                          ^
In file included from /usr/src/kernels/3.11.6-200.fc19.x86_64/include/uapi/linux/stddef.h:1:0,
                 from /usr/src/kernels/3.11.6-200.fc19.x86_64/include/linux/stddef.h:4,
                 from /usr/src/kernels/3.11.6-200.fc19.x86_64/include/uapi/linux/posix_types.h:4,
                 from /usr/src/kernels/3.11.6-200.fc19.x86_64/include/uapi/linux/types.h:13,
                 from /usr/src/kernels/3.11.6-200.fc19.x86_64/include/linux/types.h:5,
                 from /usr/src/kernels/3.11.6-200.fc19.x86_64/include/uapi/linux/capability.h:16,
                 from /usr/src/kernels/3.11.6-200.fc19.x86_64/include/linux/capability.h:15,
                 from /usr/src/kernels/3.11.6-200.fc19.x86_64/include/linux/sched.h:13,
                 from /usr/src/kernels/3.11.6-200.fc19.x86_64/include/linux/utsname.h:5,
                 from /var/lib/dkms/nvidia/319.37/build/nv-linux.h:44,
                 from /var/lib/dkms/nvidia/319.37/build/nv-i2c.c:15:
/usr/src/kernels/3.11.6-200.fc19.x86_64/arch/x86/include/asm/uaccess_64.h: In function ‘copy_from_user’:
/usr/src/kernels/3.11.6-200.fc19.x86_64/arch/x86/include/asm/uaccess_64.h:62:28: warning: comparison between signed and unsigned integer expressions [-Wsign-compare]
  if (likely(sz == -1 || sz >= n))
                            ^
/usr/src/kernels/3.11.6-200.fc19.x86_64/include/linux/compiler.h:152:40: note: in definition of macro ‘likely’
 # define likely(x) __builtin_expect(!!(x), 1)
                                        ^
/var/lib/dkms/nvidia/319.37/build/nv-i2c.c: In function ‘nv_i2c_del_adapter’:
/var/lib/dkms/nvidia/319.37/build/nv-i2c.c:327:14: error: void value not ignored as it ought to be
     osstatus = i2c_del_adapter(pI2cAdapter);
              ^
make[4]: *** [/var/lib/dkms/nvidia/319.37/build/nv-i2c.o] Error 1
make[3]: *** [_module_/var/lib/dkms/nvidia/319.37/build] Error 2
make[2]: *** [sub-make] Error 2
NVIDIA: left KBUILD.
nvidia.ko failed to build!
make[1]: *** [module] Error 1
make: *** [module] Error 2

Same problem here on Opensuse 13.1 64 bits


/tmp/selfgz1500/NVIDIA-Linux-x86_64-319.17/kernel/nv-i2c.c: In function ‘nv_i2c_del_adapter’:
/tmp/selfgz1500/NVIDIA-Linux-x86_64-319.17/kernel/nv-i2c.c:327:14: error: void value not ignored as it ought to be
osstatus = i2c_del_adapter(pI2cAdapter);
^
make[4]: *** [/tmp/selfgz1500/NVIDIA-Linux-x86_64-319.17/kernel/nv-i2c.o] Error 1
make[3]: *** [module/tmp/selfgz1500/NVIDIA-Linux-x86_64-319.17/kernel] Error 2
make[2]: *** [sub-make] Error 2
NVIDIA: left KBUILD.
nvidia.ko failed to build!
make[1]: *** [module] Error 1
make: *** [module] Error 2
-> Error.
ERROR: Unable to build the NVIDIA kernel module.

The 319.37 driver in the CUDA repository does not support Linux kernel version 3.11, which is what it appears you are running, martinellison. In addition, I believe that OpenSUSE 13.1 ships with Linux kernel 3.11. Also, Fedora 19 and OpenSUSE 13.1 are not supported by CUDA 5.5 (see the release notes here: http://docs.nvidia.com/cuda/cuda-toolkit-release-notes/index.html#linux-5-5).

Later drivers, such as the new r331 drivers, do support Linux 3.11. I would suggest trying one of the new drivers.