don't working target after to flash DS9.0

Hi.

I used sdkmanager to flash DRIVE Pegasus

my linux host was installed only sdkmanager.

sdkmanager shows message that is success to flash xavier a+b but DRIVE Peagsus is not working!

please your help!

#/dev/ttyUSB2 & /dev/ttyUSB6 are same message!
I> bpmp-fw-dtb: Authentication init Done
I> Binary@ device:3/0 block-62976 (partition size: 0x40000)
I> parsing oem signed section of eks header done
I> eks binary init read from storage
I> bpmp-fw-dtb: Authentication Finalize Done
I> oem authentication of eks header done
I> eks binary done read from storage
I> eks: Authentication init Done
I> eks: Authentication Finalize Done
I> EKS (length: 0x610) @ VA:0x526fd400
I> GR Blob not found or corrupted. Skipping GR Dump for MB2 Stage
��NOTICE: BL31: v1.3(release):2e0bcb8
NOTICE: BL31: Built : 11:03:03, May 4 2019
��
��ERROR: trusty: failed to register fiq handler, ret = -37
��qb:[E]: Function: QbAuthenticateBuffer.part.1(0xff00093e0) Error: HashMismatc)
qb:[E]: Function: QbAuthenticateBCH(0xff000953c) Error: HashMismatch (0x1d)
qb:[E]: Function: QbReadBootCompHdr(0xff0009818) Error: HashMismatch (0x1d)
qb:[E]: Function: QbReadAndValidateImage(0xff0009ec4) Error: HashMismatch (0x1d)
qb:[E]: Chain of Trust Failure
qb:[E]: Unable to load kernel
qb:[E]: Function: QbLoadBootConfigById(0xff001e484) Error: HashMismatch (0x1d)
qb:[E]: Function: QbIsAndroidBoot(0xff001e234) Error: HashMismatch (0x1d)

$uname -r
inux Legion-C730 4.15.0-76-generic #86~16.04.1-Ubuntu SMP Mon Jan 20 11:02:50 UTC 2020 x86_64 x86_64 x86_64 GNU/Linux

#/dev/ttyUSB3

Shell>version

DDPX Aurix Serial Console
E3550-B03
with TLF35584 B/C-Step
SW Version 1.29.00
Debug Version, SW BUILD 7
TC397 Step A
Shell>

sdkm.log file
https://mydrive.hancommds.com/pm/linkdown.htm?lid=5e46bcf418ff50bc2e01

Hi theblue96,

DRIVE Software 10.0 is avaialble at https://developer.nvidia.com/drive/downloads . I would suggest you to upgrade if possible.

Regarding to your issue, there are a few errors in your sdkm.log.

Following is the first one I can see. Could you try with run the command manually and fix the problem?

2020-02-14 23:16:37.417 - info: exec_command: sudo apt-get update; sleep 0.5; sudo apt-get -y --allow-downgrades install cuda-toolkit-10-0=10.0.166*

2020-02-14 23:16:50.001 - error: E: Failed to fetch http://kr.archive.ubuntu.com/ubuntu/dists/xenial-updates/main/binary-amd64/by-hash/SHA256/81d4e449c8b2a9de6067734e9646a4ecdce8bea37313ff228f9916292285603b Hash Sum mismatch
2020-02-14 23:16:50.002 - info: E: Some index files failed to download. They have been ignored, or old ones used instead.

Hi VickNV

I was try to install DS10 But failed with the same issue.

What do you think reason? Software Update Sever?

What do you use update server in normally?

Nothing has changed.

Thank you for your help!

Hi VickNV

the following message is the cause.

please tell me how to fix~

41962 2020-02-17 10:58:42.544 - info: ADB server didn’t ACK^M
41963 2020-02-17 10:58:42.544 - info: * failed to start daemon *^M
41964 2020-02-17 10:58:42.545 - info: error: cannot connect to daemon^M
41965 2020-02-17 10:58:42.545 - info: * daemon not running. starting it now on p ort 5037

2020-02-17 10:58:54.327 - info: /mnt/disk/sdkm_image/DRIVE_Software_9.0_Li nux_hyperion_E3550/DriveSDK/drive-t186ref-foundation/tools/host/flashtools /bootburn_t19x/_temp_dump/_temp_dump_X5LFXFGdjK/flash-images/3460000.sdhci _24 failed^M

2020-02-17 10:58:54.327 - info: /mnt/disk/sdkm_image/DRIVE_Software_9.0_Li nux_hyperion_E3550/DriveSDK/drive-t186ref-foundation/tools/host/flashtools /bootburn_t19x/_temp_dump/_temp_dump_X5LFXFGdjK/flash-images/3460000.sdhci _24 failed^M

42142 2020-02-17 10:58:57.357 - info: adb: error: connect failed: device ‘TEGRA0 01019’ not found^M
42143 2020-02-17 10:58:57.357 - info: Tool OutPut to stderr:^M
42144 2020-02-17 10:58:57.358 - info: adb: error: connect failed: device ‘TEGRA0 01019’ not found^M
42145 2020-02-17 10:58:57.360 - info: error-adb-push – /mnt/disk/sdkm_image/DRI VE_Software_9.0_Linux_hyperion_E3550/DriveSDK/drive-t186ref-foundation/too ls/host/flashtools/bootburn_t19x/_temp_dump/_temp_dump_X5LFXFGdjK/flash-im ages/3460000.sdhci_24^M

42142 2020-02-17 10:58:57.357 - info: adb: error: connect failed: device ‘TEGRA0 01019’ not found^M
42143 2020-02-17 10:58:57.357 - info: Tool OutPut to stderr:^M
42144 2020-02-17 10:58:57.358 - info: adb: error: connect failed: device ‘TEGRA0 01019’ not found^M
42145 2020-02-17 10:58:57.360 - info: error-adb-push – /mnt/disk/sdkm_image/DRI VE_Software_9.0_Linux_hyperion_E3550/DriveSDK/drive-t186ref-foundation/too ls/host/flashtools/bootburn_t19x/_temp_dump/_temp_dump_X5LFXFGdjK/flash-im ages/3460000.sdhci_24^M

2020-02-17 10:58:57.362 - info: -------------------------------------^M
42174 2020-02-17 10:58:57.362 - info: ^M
42175 2020-02-17 10:58:57.362 - info: Tool OutPut:^M
42176 2020-02-17 10:58:57.456 - info: adb: error: connect failed: device ‘TEGRA0 01020’ not found^M
42177 2020-02-17 10:58:57.456 - info: Tool OutPut to stderr:^M
42178 2020-02-17 10:58:57.456 - info: adb: error: connect failed: device ‘TEGRA0 01020’ not found^M
42179 2020-02-17 10:58:57.456 - info: error-adb-push – /mnt/disk/sdkm_image/DRI VE_Software_9.0_Linux_hyperion_E3550/DriveSDK/drive-t186ref-foundation/too ls/host/flashtools/bootburn_t19x/_temp_dump/_temp_dump_bjnMuDXF7u/flash-im ages/3460000.sdhci_21^M

42297 *** Download Summary ***
42298
42299 - Bundle: DRIVE Software 9.0 Linux for DRIVE AGX Developer Kit
42300 - Download server: Unknown
42301 - 0B downloaded of 13.78GB
42302 - Download started on: Mon Feb 17 2020 10:26:41 GMT+0900 (KST).
42303 - Download ended on: Mon Feb 17 2020 10:26:41 GMT+0900 (KST).
42304 - Download duration: 0.257s.
42305 - Average total download speed: 0B/s = total downloaded bytes / do wnload duration.
42306 - Average total bandwidth: 0B/s, average accumulation of all file chunks speed, downloaded concurrently.
42307 - Average file chunks download speed: 0B/s, average of all downloa ded file chunks speed.
42308 - Max 6 concurrent files using 6 threads.
42309
42310 Total 22 files:
42311 - 0 downloaded, 0 cached, 22 failed
42312
42313 Details:
42314 - : .
42315 - : .

Thank you for your help!

Let’s focus on DRIVE Software 10.0 installation issue first.

Please show me what’s error messages showed in SDK Manager->TERMINAL->Message Type: Error and attached the log file exported by SDK Manager->top-right corner->Export Debug Logs (~/Downloads/nvidia/sdkm_downloads/SDKM_logs_.zip). Thanks!

I try to install DRIVE Software 10.0 but Drive Pegasus is not working

I attached sdkm.log and ttyUSB2, ttyUSB3, ttyUSB6 log files.

logs.zip

Please check Target system!!

This Host computer information

4.15.0-88-generic #88-Ubuntu SMP Tue Feb 11 20:11:34 UTC 2020 x86_64 x86_64 x86_64 GNU/Linux

DISTRIB_ID=Ubuntu
DISTRIB_RELEASE=18.04
DISTRIB_CODENAME=bionic
DISTRIB_DESCRIPTION=“Ubuntu 18.04 LTS”
NAME=“Ubuntu”
VERSION=“18.04 LTS (Bionic Beaver)”
ID=ubuntu
ID_LIKE=debian
PRETTY_NAME=“Ubuntu 18.04 LTS”
VERSION_ID=“18.04”
HOME_URL=“https://www.ubuntu.com/
SUPPORT_URL=“https://help.ubuntu.com/
BUG_REPORT_URL=“https://bugs.launchpad.net/ubuntu/
PRIVACY_POLICY_URL=“https://www.ubuntu.com/legal/terms-and-policies/privacy-policy
VERSION_CODENAME=bionic
UBUNTU_CODENAME=bionic

Please Let me know how to do it next but i want to apply RMA.

thanks for your help!!

Dear theblue96,
Could you please attach ~/.nvsdkm/logs folder too

Dear SivaRamaKrishna

I attached nvsdkm folder~

nvsdkm.zip

Thank for your help!

Dear SivaRamaKrishna

plz tell me about next step for RAM! or doing

Dear theblue96,
Do you see any issue in flashing. I do see the flashing is successful as per sdkm.log
Also, I do not see ADB server didn’t ACK in the log you have shared.

*** End of Download Summary ***
                    
2020-02-27 11:59:24.368 - info: 
Install summary of 22 components:

        Install started on: 11:00:07 GMT+0900 (KST).

        Install ended on: 11:59:24 GMT+0900 (KST).

        Install duration:  00:59:16 .

        Install idle time: 0.000s .

        Real install duration (duration - idle time): 00:59:16 .

        Install 22 components.

            - Up-to-date 21 components.

        Install failed 0 files.

        Install skipped 0 files.

        Install details:

        - NV_GNU_TOOLCHAINS_COMP@DDPX: Up-to-date.
- NV_DRIVE_FOUNDATION_PACKAGES_SDK_COMP@DDPX: Up-to-date.
- NV_DRIVE_FOUNDATION_OSS_COMP@DDPX: Up-to-date.
- NV_P3479_SPECIFIC_PACKAGE_COMP@DDPX: Up-to-date.
- NV_E3550_SPECIFIC_PACKAGE_COMP@DDPX: Up-to-date.
- NV_DRIVE_FOUNDATION_PDKINSTALLER@DDPX: Up-to-date.
- NV_OSS_AND_NV_PACKAGES_SDK_COMP@DDPX: Up-to-date.
- NV_DPX_PACKAGES_COMP@DDPX: Up-to-date.
- NV_AURIX_UPDATER_COMP@DDPX: Up-to-date.
- NV_DDS_TARGET_COMP@DDPX: Up-to-date.
- NV_DRIVE_LINUX_RELEASE_NOTES@DDPX: Up-to-date.
- NV_CUDA_TARGET_LINUX_COMP@DDPX: Up-to-date.
- NV_TENSORRT_TARGET_COMP@DDPX: Up-to-date.
- NV_DRIVE_AV_TARGET_COMP@DDPX: Up-to-date.
- NV_DRIVE_IX_TARGET_COMP@DDPX: Up-to-date.
- NV_DRIVE_AR_TARGET_COMP@DDPX: Up-to-date.
- NV_DRIVE_UX_TARGET_COMP@DDPX: Up-to-date.
- NV_DRIVE_PLATFORM_RFS_TARGET_COMP@DDPX: Up-to-date.
- NV_DRIVE_HYPERION_TARGET_COMP@DDPX: Up-to-date.
- NV_DRIVE_SERVICEFRAMEWORK_TARGET_COMP@DDPX: Up-to-date.
- NV_DRIVE_OTA_TARGET_COMP@DDPX: Up-to-date.
- NV_FLASH_XAVIER_PDKFLASH_PARALLEL_COMP@DDPX: Installed - 00:59:15 -start: 11:00:07 GMT+0900 (KST) - end: 11:59:23 GMT+0900 (KST).

2020-02-27 11:59:24.368 - info: All done!

Dear SivaRamaKrishnaNV

I solved this issue.

Thank for your help