TX2 Development kit USB not working after Flashing jetpack

I have flashed my jetson TX2 with Jetpack 3.3. Now i can use the USB. USB worked with previous OS.
Im using default Development kit P2597 board.

can anyone help me with this?

thanks

What if you reinstall previous jetpack now? Will the usb still work?

Hi…

Yes. But i need to install newer version on Jetpack.

Can i build jetpack manually by downloading these files. Check the URL please ( L4T | NVIDIA Developer ).

I was not just asking you “stay on the old jetpack release”.

What I want to know is whether this is a software issue or hardware issue. Currently, it sounds like a software problem.

You should provide the dmesg with error usb log inside.

HI…

Im trying to install L4T | NVIDIA Developer file system now. after extracting files apply_binaries.sh file returns

“The root filesystem, provided with this package,
has to be extracted with ‘sudo’ to this directory:”

this message

I extract JAX-TX2-Jetson_Linux_R32.1.0_aarch64 ‘without’ sudo and JAX-TX2-Tegra_Linux_Sample-Root-Filesystem_R32.1.0_aarch64 with 'sudo.

Can you help me with this please.

thanks

I would suggest you stop what you are doing now.

Just flash jetpack 3.3.3 share us the dmesg.

If you want to move to some release like rel-32, I would suggest directly try rel-32.5. No need to use old rel-32.1.

Also, if you want to prepare rootfs, it has to be run as root. That is why jetpack also asks your password because it needs to be as root for rootfs and flash too.

Ok. i will get the latest release.

Now i have downloaded these files. And im running these as root user. But still showing the previous error message

You can just use sdkmanager and it will download a prepared driver package for you. No need to stuck in preparing rootfs by yourself.

okay.

I tried that previously. And will try it again.

It shows " Failed to fetch http://ports.ubuntu.com/ubuntu-ports/dists/trusty/main/binary-amd64/Packages 404 Not Found [IP: 91.189.91.38 80]
E: Some index files failed to download. They have been ignored, or old ones used instead."

Can you tell what is “it” in your error? Where do you see this error? SDKM?

It shows " Failed to fetch http://ports.ubuntu.com/ubuntu-ports/dists/trusty/main/binary-amd64/Packages 404 Not Found [IP: 91.189.91.38 80]

This one…

SDK Manager is verifying system readiness to install.
Access to APT repository and ability to install Debian packages with it.
Your system is not ready for install, see specific errors below. Once fixed, click ‘Retry’ to verify system readiness again.
Access to APT repository and ability to install Debian packages with it.: Apt repository check failure (sudo -S apt-get update && sudo -S apt-get check).

E: Failed to fetch http://ports.ubuntu.com/ubuntu-ports/dists/trusty/main/binary-amd64/Packages 404 Not Found [IP: 91.189.91.39 80]
E: Some index files failed to download. They have been ignored, or old ones used instead.

Also i refer this Cannot install SDK components topic as well.

I have internet connection on host machine (Ubuntu 16.04) and TX2 pluged into host machine via USB. also plugged a network cable to the TX2 from my router. (no blinking light on network adapter both router and tx2)

Can you just select the OS and flash option from sdkmanager and forget about sdk at this moment?
If this issue is related to usb, then flash the os and boot up should be sufficient.

ok. shall i skip this and install then?

Just select as below and go to continue, make sure board is in recovery mode.

If there is still error, go to your ~/.nvsdkm folder and attach the whole directory as a zip file here.

okay. I tried like that…

Installation failed with these errors.

Terminal logs

10:51:39 ERROR: Install pre check Access to APT repository and ability to install Debian packages with it. verify failed.

10:54:28 INFO: *** Retrying to install. attempt number: 2

10:54:43 ERROR: Install pre check Access to APT repository and ability to install Debian packages with it. verify failed.

11:03:20 ERROR: Install pre check Access to APT repository and ability to install Debian packages with it. verify failed.

11:09:07 ERROR: Install pre check Access to APT repository and ability to install Debian packages with it. verify failed.

11:27:48 INFO: *** Retrying to install. attempt number: 3

11:28:04 ERROR: Install pre check Access to APT repository and ability to install Debian packages with it. verify failed.

11:28:30 INFO: NVIDIA Tegra Graphics Debugger - host: start to download https://developer.nvidia.com/assets/embedded/secure/tools/files/jetpack-sdks/jetpack-3.3.3/JETPACK_333_b8/2017_11_28_1956-23204764-NVIDIA_Tegra_Graphics_Debugger_2.5.17332.1956_Release_External_tgd-l4t_linux-l4t.run to /media/gayan/New_Volume/jetpack_4.5.1/sdk_download/2017_11_28_1956-23204764-NVIDIA_Tegra_Graphics_Debugger_2.5.17332.1956_Release_External_tgd-l4t_linux-l4t.run

11:28:30 INFO: NVIDIA System Profiler - host: start to download https://developer.nvidia.com/assets/embedded/secure/tools/files/jetpack-sdks/jetpack-3.3.3/JETPACK_333_b8/SystemProfiler-linux-public-4.0.387-eecbec0.tar.gz to /media/gayan/New_Volume/jetpack_4.5.1/sdk_download/SystemProfiler-linux-public-4.0.387-eecbec0.tar.gz

11:28:30 INFO: Drivers for Jetson TX2 & TX2i - target_image: start to download https://developer.nvidia.com/assets/embedded/secure/tools/files/jetpack-sdks/jetpack-3.3.3/JETPACK_333_b8/P3310/Tegra186_Linux_R28.4.0_aarch64.tbz2 to /media/gayan/New_Volume/jetpack_4.5.1/sdk_download/Tegra186_Linux_R28.4.0_aarch64.tbz2

11:28:30 INFO: DevTools Documentation - host: start to download https://developer.nvidia.com/assets/embedded/secure/tools/files/jetpack-sdks/jetpack-3.3.3/JETPACK_333_b8/devtools_docs.zip to /media/gayan/New_Volume/jetpack_4.5.1/sdk_download/devtools_docs.zip

11:28:30 INFO: File System and OS - target_image: start to download https://developer.nvidia.com/assets/embedded/secure/tools/files/jetpack-sdks/jetpack-3.3.3/JETPACK_333_b8/P3310/Tegra_Linux_Sample-Root-Filesystem_R28.4.0_aarch64.tbz2 to /media/gayan/New_Volume/jetpack_4.5.1/sdk_download/Tegra_Linux_Sample-Root-Filesystem_R28.4.0_aarch64.tbz2

11:29:32 : File System and OS - target_image: download https://developer.nvidia.com/assets/embedded/secure/tools/files/jetpack-sdks/jetpack-3.3.3/JETPACK_333_b8/P3310/Tegra_Linux_Sample-Root-Filesystem_R28.4.0_aarch64.tbz2 failed, retrying 1…

11:29:33 INFO: Drivers for Jetson TX2 & TX2i - target_image: start to download https://developer.nvidia.com/assets/embedded/secure/tools/files/jetpack-sdks/jetpack-3.3.3/JETPACK_333_b8/P3310/Tegra186_Linux_R28.4.0_aarch64.tbz2 to /media/gayan/New_Volume/jetpack_4.5.1/sdk_download/Tegra186_Linux_R28.4.0_aarch64.tbz2

11:29:33 INFO: NVIDIA Tegra Graphics Debugger - host: start to download https://developer.nvidia.com/assets/embedded/secure/tools/files/jetpack-sdks/jetpack-3.3.3/JETPACK_333_b8/2017_11_28_1956-23204764-NVIDIA_Tegra_Graphics_Debugger_2.5.17332.1956_Release_External_tgd-l4t_linux-l4t.run to /media/gayan/New_Volume/jetpack_4.5.1/sdk_download/2017_11_28_1956-23204764-NVIDIA_Tegra_Graphics_Debugger_2.5.17332.1956_Release_External_tgd-l4t_linux-l4t.run

11:29:33 INFO: NVIDIA System Profiler - host: start to download https://developer.nvidia.com/assets/embedded/secure/tools/files/jetpack-sdks/jetpack-3.3.3/JETPACK_333_b8/SystemProfiler-linux-public-4.0.387-eecbec0.tar.gz to /media/gayan/New_Volume/jetpack_4.5.1/sdk_download/SystemProfiler-linux-public-4.0.387-eecbec0.tar.gz

11:29:33 INFO: File System and OS - target_image: start to download https://developer.nvidia.com/assets/embedded/secure/tools/files/jetpack-sdks/jetpack-3.3.3/JETPACK_333_b8/P3310/Tegra_Linux_Sample-Root-Filesystem_R28.4.0_aarch64.tbz2 to /media/gayan/New_Volume/jetpack_4.5.1/sdk_download/Tegra_Linux_Sample-Root-Filesystem_R28.4.0_aarch64.tbz2

11:29:33 INFO: DevTools Documentation - host: start to download https://developer.nvidia.com/assets/embedded/secure/tools/files/jetpack-sdks/jetpack-3.3.3/JETPACK_333_b8/devtools_docs.zip to /media/gayan/New_Volume/jetpack_4.5.1/sdk_download/devtools_docs.zip

11:29:49 INFO: DevTools Documentation - host: verifying checksum of /media/gayan/New_Volume/jetpack_4.5.1/sdk_download/devtools_docs.zip

11:29:49 INFO: DevTools Documentation - host: download /media/gayan/New_Volume/jetpack_4.5.1/sdk_download/devtools_docs.zip successfully, checksum is correct

11:29:49 DEBUG: running command < true >

11:29:49 INFO: command finished successfully

11:29:49 DEBUG: DevTools Documentation - host: using adapter to install NV_DEVTOOLS_DOCS_L4T_COMP@host to /media/gayan/New_Volume/jetpack_4.5.1/nvidia_sdk/JetPack_3.3.3_Linux_GA

11:29:49 INFO: DevTools Documentation - host: NV_DEVTOOLS_DOCS_L4T_COMP include 1 package

11:29:49 INFO: DevTools Documentation - host: NVIDIA System Profiler 4.0/content/developertools/mobile/system_profiler/4.0-jetpack/01-overview.htm

11:29:49 INFO: DevTools Documentation - host: NVIDIA System Profiler 4.0/content/developertools/mobile/system_profiler/4.0-jetpack/02-release-notes.htm

11:29:49 INFO: DevTools Documentation - host: NVIDIA System Profiler 4.0/content/developertools/mobile/system_profiler/4.0-jetpack/03-system-requirements.htm

11:29:49 INFO: DevTools Documentation - host: NVIDIA System Profiler 4.0/content/developertools/mobile/system_profiler/4.0-jetpack/06-cuda-trace.htm

11:29:49 INFO: DevTools Documentation - host: NVIDIA System Profiler 4.0/content/developertools/mobile/system_profiler/4.0-jetpack/11-launch-stopped.htm

11:29:49 INFO: DevTools Documentation - host: NVIDIA System Profiler 4.0/content/developertools/mobile/system_profiler/4.0-jetpack/img/configure-cuda-trace.png

11:29:49 INFO: DevTools Documentation - host: NVIDIA System Profiler 4.0/content/developertools/mobile/system_profiler/4.0-jetpack/img/cuda-gpu-rows.png

11:29:49 INFO: DevTools Documentation - host: NVIDIA System Profiler 4.0/content/developertools/mobile/system_profiler/4.0-jetpack/img/process-attach-only.png

11:29:49 INFO: DevTools Documentation - host: NVIDIA System Profiler 4.0/content/developertools/mobile/system_profiler/4.0-jetpack/img/system-profiling-options.png

11:29:49 INFO: DevTools Documentation - host: NVIDIA System Profiler 4.0/content/resources/stylesheets/style.css

11:29:49 INFO: DevTools Documentation - host: NVIDIA System Profiler 4.0/Data/Alias.js

11:29:49 INFO: DevTools Documentation - host: NVIDIA System Profiler 4.0/Data/SearchPhrase_Chunk0.js

11:29:49 INFO: DevTools Documentation - host: NVIDIA System Profiler 4.0/index.js

11:29:49 INFO: DevTools Documentation - host: NVIDIA System Profiler 4.0/index.mcwebhelp

11:29:49 INFO: DevTools Documentation - host: NVIDIA System Profiler 4.0/Resources/Scripts/jquery.min.js

11:29:49 INFO: DevTools Documentation - host: NVIDIA System Profiler 4.0/Resources/Scripts/MadCapAll.js

11:29:49 INFO: DevTools Documentation - host: NVIDIA System Profiler 4.0/Resources/Scripts/plugins.min.js

11:29:49 INFO: DevTools Documentation - host: NVIDIA System Profiler 4.0/Skins/Default/Scripts/GW_TopicToolbar.js

11:29:49 INFO: DevTools Documentation - host: NVIDIA System Profiler 4.0/Skins/Default/Stylesheets/Components/Images/printer.png

11:29:49 INFO: DevTools Documentation - host: NVIDIA System Profiler 4.0/Skins/Default/Stylesheets/Images/diagonal_lines.png

11:29:49 INFO: DevTools Documentation - host: NVIDIA System Profiler 4.0/Skins/Default/Stylesheets/Images/login.png

11:29:49 INFO: DevTools Documentation - host: NVIDIA System Profiler 4.0/Skins/Default/Stylesheets/Images/star-full.png

11:29:49 INFO: DevTools Documentation - host: Tegra Graphics Debugger 2.5/content/developertools/mobile/tegra_graphics_debugger/images/

11:29:49 INFO: DevTools Documentation - host: Tegra Graphics Debugger 2.5/content/developertools/mobile/tegra_graphics_debugger/images/tgd_api_inspector_transform.003.png

11:29:49 INFO: DevTools Documentation - host: Tegra Graphics Debugger 2.5/content/developertools/mobile/tegra_graphics_debugger/images/tgd_current_view_back_left.001.png

11:29:49 INFO: DevTools Documentation - host: Tegra Graphics Debugger 2.5/content/developertools/mobile/tegra_graphics_debugger/images/tgd_current_view_back_left.001_700x433.png

INSTALLATION FAILED
Please review the terminal tab for details. Resolve and RETRY.

EXPORT LOGS

RETRY

FAILED ITEMS

STOP TRYING

Copyright © 2021, NVIDIA CORPORATION. All rights reserved. | NVIDIA Developer

Please make sure you didn’t select Host in this page.

And please stop directly pasting the error log on the forum comment. I already told this in previous comment.

If there is still error, go to your ~/.nvsdkm folder and attach the whole directory as a zip file here.

ok. i did that.

but still has the problem

12:10:53 DEBUG: Drivers for Jetson - target_image: using adapter to install NV_L4T_DRIVERS_T186_COMP@JETSON_TX2 to /media/gayan/New_Volume/jetpack_4.5.1/nvidia_sdk/JetPack_4.5.1_Linux_JETSON_TX2/

12:10:53 INFO: Drivers for Jetson - target_image: NV_L4T_DRIVERS_T186_COMP include 1 package

12:10:53 INFO: Drivers for Jetson - target_image: exec_command: sudo rm -rf /media/gayan/New_Volume/sdk_new/target/JetPack_4.5.1_Linux_JETSON_TX2/Linux_for_Tegra/

12:10:53 INFO: Drivers for Jetson - target_image: [host] [sudo] password for gayan:

12:10:53 INFO: Drivers for Jetson - target_image: [ Package Install Started ]

12:10:53 INFO: Drivers for Jetson - target_image: *begin sudo apt-get update , 5

12:10:53 INFO: Drivers for Jetson - target_image: Get:1 file:/var/cuda-repo-9-0-local InRelease

12:10:53 INFO: Drivers for Jetson - target_image: Get:5 file:/var/cuda-repo-9-0-local Release [574 B]

12:10:53 INFO: Drivers for Jetson - target_image: Get:7 file:/var/visionworks-sfm-repo Release [2,003 B]

12:10:53 INFO: Drivers for Jetson - target_image: Get:5 file:/var/cuda-repo-9-0-local Release [574 B]

12:10:53 INFO: Drivers for Jetson - target_image: Get:6 file:/var/visionworks-repo Release [1,999 B]

12:10:53 INFO: Drivers for Jetson - target_image: Get:8 file:/var/visionworks-tracking-repo Release [2,008 B]

12:10:55 INFO: Drivers for Jetson - target_image: Hit:13 http://lk.archive.ubuntu.com/ubuntu xenial InRelease

12:10:55 INFO: Drivers for Jetson - target_image: Get:15 http://security.ubuntu.com/ubuntu xenial-security InRelease [109 kB]

12:10:56 INFO: Drivers for Jetson - target_image: Hit:16 http://lk.archive.ubuntu.com/ubuntu xenial-updates InRelease

12:10:58 INFO: Drivers for Jetson - target_image: Get:18 http://lk.archive.ubuntu.com/ubuntu xenial-backports InRelease [107 kB]

12:11:00 INFO: Drivers for Jetson - target_image: Get:17 http://ports.ubuntu.com/ubuntu-ports trusty-updates InRelease [65.9 kB]

12:11:05 INFO: Drivers for Jetson - target_image: Get:19 http://ports.ubuntu.com/ubuntu-ports trusty-security InRelease [65.9 kB]

12:11:10 INFO: Drivers for Jetson - target_image: Get:20 http://ports.ubuntu.com/ubuntu-ports trusty Release [58.5 kB]

12:11:12 INFO: Drivers for Jetson - target_image: Get:21 http://ports.ubuntu.com/ubuntu-ports trusty-updates/main Sources [431 kB]

12:11:12 INFO: Drivers for Jetson - target_image: Ign:22 http://ports.ubuntu.com/ubuntu-ports trusty-updates/main amd64 Packages

12:11:13 INFO: Drivers for Jetson - target_image: Ign:23 http://ports.ubuntu.com/ubuntu-ports trusty-updates/main i386 Packages

12:11:13 INFO: Drivers for Jetson - target_image: Get:24 http://ports.ubuntu.com/ubuntu-ports trusty-updates/main Translation-en [582 kB]

12:11:14 INFO: Drivers for Jetson - target_image: Get:25 http://ports.ubuntu.com/ubuntu-ports trusty-security/main Sources [172 kB]

12:11:15 INFO: Drivers for Jetson - target_image: Ign:26 http://ports.ubuntu.com/ubuntu-ports trusty-security/main amd64 Packages

12:11:15 INFO: Drivers for Jetson - target_image: Ign:27 http://ports.ubuntu.com/ubuntu-ports trusty-security/main i386 Packages

12:11:17 INFO: Drivers for Jetson - target_image: Get:28 http://ports.ubuntu.com/ubuntu-ports trusty-security/main Translation-en [448 kB]

12:11:19 INFO: Drivers for Jetson - target_image: Get:29 http://ports.ubuntu.com/ubuntu-ports trusty Release.gpg [933 B]

12:11:19 INFO: Drivers for Jetson - target_image: Ign:22 http://ports.ubuntu.com/ubuntu-ports trusty-updates/main amd64 Packages

12:11:20 INFO: Drivers for Jetson - target_image: Ign:23 http://ports.ubuntu.com/ubuntu-ports trusty-updates/main i386 Packages

12:11:20 INFO: Drivers for Jetson - target_image: Ign:26 http://ports.ubuntu.com/ubuntu-ports trusty-security/main amd64 Packages

12:11:21 INFO: Drivers for Jetson - target_image: Ign:27 http://ports.ubuntu.com/ubuntu-ports trusty-security/main i386 Packages

12:11:21 INFO: Drivers for Jetson - target_image: Get:30 http://ports.ubuntu.com/ubuntu-ports trusty/main Sources [1,064 kB]

12:11:22 INFO: Drivers for Jetson - target_image: Ign:31 http://ports.ubuntu.com/ubuntu-ports trusty/main amd64 Packages

12:11:22 INFO: Drivers for Jetson - target_image: Ign:32 http://ports.ubuntu.com/ubuntu-ports trusty/main i386 Packages

12:11:23 INFO: Drivers for Jetson - target_image: 404 Not Found [IP: 2001:67c:1562::18 80]

12:11:24 INFO: Drivers for Jetson - target_image: Ign:23 http://ports.ubuntu.com/ubuntu-ports trusty-updates/main i386 Packages

12:11:24 INFO: Drivers for Jetson - target_image: 404 Not Found [IP: 2001:67c:1562::18 80]

12:11:28 INFO: Drivers for Jetson - target_image: Ign:27 http://ports.ubuntu.com/ubuntu-ports trusty-security/main i386 Packages

12:11:29 INFO: Drivers for Jetson - target_image: Ign:31 http://ports.ubuntu.com/ubuntu-ports trusty/main amd64 Packages

12:11:30 INFO: Drivers for Jetson - target_image: Ign:32 http://ports.ubuntu.com/ubuntu-ports trusty/main i386 Packages

12:11:30 INFO: Drivers for Jetson - target_image: 404 Not Found [IP: 2001:67c:1562::18 80]

12:11:31 INFO: Drivers for Jetson - target_image: Ign:32 http://ports.ubuntu.com/ubuntu-ports trusty/main i386 Packages

12:11:31 INFO: Drivers for Jetson - target_image: Fetched 407 kB in 37s (10.8 kB/s)

12:11:33 INFO: Drivers for Jetson - target_image: Reading package lists…

12:11:33 INFO: Drivers for Jetson - target_image: E: Some index files failed to download. They have been ignored, or old ones used instead.

12:11:33 ERROR: Drivers for Jetson - target_image: command terminated with error

12:11:33 SUMMARY: Flash Jetson TX2 - flash: Depends on failed component

12:11:33 INFO: File System and OS - target_image: stopped downloading https://developer.nvidia.com/assets/embedded/secure/tools/files/jetpack-sdks/jetpack-4.5.1/JETPACK_451_b17/T186/Tegra_Linux_Sample-Root-Filesystem_R32.5.1_aarch64.tbz2

INSTALLATION FAILED
Please review the terminal tab for details. Resolve and RETRY.

EXPORT LOGS

RETRY

FAILED ITEMS

STOP TRYING

Copyright © 2021, NVIDIA CORPORATION. All rights reserved. | NVIDIA Developer

Is there any problem to understand below comment?

If there is still error, go to your ~/.nvsdkm folder and attach the whole directory as a zip file here.