Can boot form secure boot

Hi
This months we try to apply the secureboot .Here we encountered some difficulties,hope get your help.Thanks.
First,We fuse the device with PKCSBK

sudo ./odmfuse.sh  -i 0x19 -p -k rsa_priv.pem -S sbk.key   --KEK2  kek2.key  jetson-xavier 

log here

weitianyu@weitianyu-Latitude-5421:~/external/flashtool_tztek_geac_xavier_jp4.6.1_510g3.1_v2.5.5.1/flashtool/flashtool/Linux_for_Tegra$ sudo ./odmfuse.sh  -i 0x19 -p -k rsa_priv.pem -S sbk.key   --KEK2  kek2.key  jetson-xavier 
.......applet(/home/weitianyu/external/flashtool_tztek_geac_xavier_jp4.6.1_510g3.1_v2.5.5.1/flashtool/flashtool/Linux_for_Tegra/bootloader/mb1_t194_prod.bin) reused.
./tegraflash.py --sdram_config tegra194-mb1-bct-memcfg-p2888.cfg,tegra194-memcfg-sw-override.cfg --misc_config tegra194-mb1-bct-misc-flash.cfg --pinmux_config tegra19x-mb1-pinmux-p2888-0000-a04-p2822-0000-b01.cfg --scr_config tegra194-mb1-bct-scr-cbb-mini.cfg --scr_cold_boot_config tegra194-mb1-bct-scr-cbb-mini.cfg --pmc_config tegra19x-mb1-padvoltage-p2888-0000-a00-p2822-0000-a00.cfg --pmic_config tegra194-mb1-bct-pmic-p2888-0001-a04-E-0-p2822-0000.cfg --br_cmd_config tegra194-mb1-bct-reset-p2888-0000-p2822-0000.cfg --prod_config tegra19x-mb1-prod-p2888-0000-p2822-0000.cfg --dev_params tegra194-br-bct-sdmmc.cfg --misc_cold_boot_config tegra194-mb1-bct-misc-l4t.cfg --device_config tegra19x-mb1-bct-device-sdmmc.cfg --uphy_config tegra194-mb1-uphy-lane-p2888-0000-p2822-0000.cfg --minratchet_config tegra194-mb1-bct-ratchet-p2888-0000-p2822-0000.cfg --gpioint_config tegra194-mb1-bct-gpioint-p2888-0000-p2822-0000.cfg --soft_fuses tegra194-mb1-soft-fuses-l4t.cfg  --bins "mb2_bootloader nvtboot_recovery_t194.bin; mts_preboot preboot_c10_prod_cr.bin; mts_mce mce_c10_prod_cr.bin; mts_proper mts_c10_prod_cr.bin; bootloader_dtb tegra194-p2888-0001-p2822-0000.dtb; bpmp_fw bpmp_t194.bin; bpmp_fw_dtb tegra194-a02-bpmp-p2888-a04.dtb; tlk tos-trusty_t194.img; eks eks.img; kernel boot.img; kernel_dtb tegra194-p2888-0001-p2822-0000.dtb; spe_fw spe_t194.bin" --cfg flash.xml --bl nvtboot_recovery_cpu_t194.bin --odmdata 0x9190000 --chip 0x19 --applet mb1_t194_prod.bin   --cmd "readfuses fuse_info.txt fuses_to_read.xml; reboot recovery"
Welcome to Tegra Flash
version 1.0.0
Type ? or help for help and q or quit to exit
Use ! to execute system commands
 
[   0.0059 ] Reading fuses
[   0.0059 ] Generating RCM messages
[   0.0084 ] tegrahost_v2 --chip 0x19 0 --magicid MB1B --appendsigheader mb1_t194_prod.bin zerosbk
[   0.0095 ] ...
[   3.1138 ] ['tegra194-mb1-bct-memcfg-p2888.cfg', 'tegra194-memcfg-sw-override.cfg']
[   3.1141 ] sw_memcfg_overlay.pl -c tegra194-mb1-bct-memcfg-p2888.cfg -s tegra194-memcfg-sw-override.cfg -o /home/weitianyu/external/flashtool_tztek_geac_xavier_jp4.6.1_510g3.1_v2.5.5.1/flashtool/flashtool/Linux_for_Tegra/bootloader/179491/tmprfp2nlqy1.cfg
[   3.1438 ] 
[   3.1439 ] Updating dev and MSS params in BR BCT
[   3.1440 ] tegrabct_v2 --dev_param tegra194-br-bct-sdmmc.cfg --sdram /home/weitianyu/external/flashtool_tztek_geac_xavier_jp4.6.1_510g3.1_v2.5.5.1/flashtool/flashtool/Linux_for_Tegra/bootloader/179491/tmprfp2nlqy1.cfg --brbct br_bct.cfg --sfuse tegra194-mb1-soft-fuses-l4t.cfg --chip 0x19 0
[   3.1819 ] 
[   3.1820 ] Updating bl info
[   3.1839 ] tegrabct_v2 --brbct br_bct_BR.bct --chip 0x19 0 --updateblinfo flash.xml.bin
[   3.1852 ] 
[   3.1852 ] Generating signatures
[   3.1871 ] tegrasign_v3.py --key None --list images_list.xml --pubkeyhash pub_key.key
[   3.1871 ] Assuming zero filled SBK key
[   3.2617 ] Generating br-bct
[   3.2633 ] Performing cfg overlay
[   3.2633 ] ['/home/weitianyu/external/flashtool_tztek_geac_xavier_jp4.6.1_510g3.1_v2.5.5.1/flashtool/flashtool/Linux_for_Tegra/bootloader/179491/tmprfp2nlqy1.cfg']
[   3.2633 ] Updating dev and MSS params in BR BCT
[   3.2634 ] tegrabct_v2 --dev_param tegra194-br-bct-sdmmc.cfg --sdram /home/weitianyu/external/flashtool_tztek_geac_xavier_jp4.6.1_510g3.1_v2.5.5.1/flashtool/flashtool/Linux_for_Tegra/bootloader/179491/tmprfp2nlqy1.cfg --brbct br_bct.cfg --sfuse tegra194-mb1-soft-fuses-l4t.cfg --chip 0x19 0
[   3.3009 ] 
[   3.3010 ] Updating bl info
[   3.3030 ] tegrabct_v2 --brbct br_bct_BR.bct --chip 0x19 0 --updateblinfo flash.xml.bin --updatesig images_list_signed.xml
[   3.3049 ] 
[   3.3049 ] Updating smd info
[   3.3068 ] tegrabct_v2 --brbct br_bct_BR.bct --chip 0x19 --updatesmdinfo flash.xml.bin
[   3.3080 ] 
[   3.3081 ] Updating Odmdata
[   3.3098 ] tegrabct_v2 --brbct br_bct_BR.bct --chip 0x19 0 --updatefields Odmdata =0x9190000
[   3.3107 ] 
[   3.3107 ] Get Signed section of bct
[   3.3122 ] tegrabct_v2 --brbct br_bct_BR.bct --chip 0x19 0 --listbct bct_list.xml
[   3.3129 ] 
[   3.3146 ] tegrasign_v3.py --key None --list bct_list.xml --pubkeyhash pub_key.key --getmontgomeryvalues montgomery.bin
[   3.3151 ] Assuming zero filled SBK key
[   3.3314 ] 
[   3.3314 ] Updating BCT with signature
[   3.3334 ] tegrabct_v2 --brbct br_bct_BR.bct --chip 0x19 0 --updatesig bct_list_signed.xml
[   3.3343 ] 
[   3.3343 ] Generating coldboot mb1-bct
[   3.3361 ] tegrabct_v2 --chip 0x19 0 --mb1bct mb1_cold_boot_bct.cfg --sdram /home/weitianyu/external/flashtool_tztek_geac_xavier_jp4.6.1_510g3.1_v2.5.5.1/flashtool/flashtool/Linux_for_Tegra/bootloader/179491/tmprfp2nlqy1.cfg --misc tegra194-mb1-bct-misc-l4t.cfg --scr tegra194-mb1-bct-scr-cbb-mini.cfg --pinmux tegra19x-mb1-pinmux-p2888-0000-a04-p2822-0000-b01.cfg --pmc tegra19x-mb1-padvoltage-p2888-0000-a00-p2822-0000-a00.cfg --pmic tegra194-mb1-bct-pmic-p2888-0001-a04-E-0-p2822-0000.cfg --brcommand tegra194-mb1-bct-reset-p2888-0000-p2822-0000.cfg --prod tegra19x-mb1-prod-p2888-0000-p2822-0000.cfg --gpioint tegra194-mb1-bct-gpioint-p2888-0000-p2822-0000.cfg --uphy tegra194-mb1-uphy-lane-p2888-0000-p2822-0000.cfg --device tegra19x-mb1-bct-device-sdmmc.cfg
[   3.3366 ] MB1-BCT version: 0x1

[   3.3368 ] Parsing config file :tegra19x-mb1-pinmux-p2888-0000-a04-p2822-0000-b01.cfg 
[   3.3370 ] Added Platform Config 0 data with size :- 3168

[   3.3380 ]...
[   4.5345 ] tegrarcm_v2 --download blob blob.bin
[   4.5350 ] Applet version 01.00.0000
[   4.9801 ] Sending blob
[   4.9801 ] [................................................] 100%
[   6.1614 ] 
[   6.1633 ] tegrarcm_v2 --boot recovery
[   6.1638 ] Applet version 01.00.0000
[   6.3041 ] 
[   7.3075 ] tegrarcm_v2 --isapplet
[   7.9228 ] 
[   7.9250 ] tegrarcm_v2 --ismb2
[   8.0646 ] 
[   8.0667 ] tegradevflash_v2 --iscpubl
[   8.0673 ] Bootloader version 01.00.0000
[   8.2439 ] Bootloader version 01.00.0000
[   8.2458 ] 
[   8.2459 ] tegradevflash_v2 --oem burnfuses blow_fuse_data.bin
[   8.2470 ] Bootloader version 01.00.0000
[   8.4321 ] Fusing burning successful
[   8.6230 ] 
[   8.6251 ] tegradevflash_v2 --reboot recovery
[   8.6257 ] Bootloader version 01.00.0000
[   8.7609 ] 
*** The fuse configuration is saved in bootloader/odmfuse_pkc.xml
*** The ODM fuse has been burned successfully.
*** done.

Then we flash our system with “-r option”

sudo ./flash.sh -u rsa_priv.pem -v sbk.key -r  jetson-xavier mmcblk0p1

here the flash_log

sudo ./flash.sh -u rsa_priv.pem -v sbk.key -r  jetson-xavier mmcblk0p1
###############################################################################
# L4T BSP Information:
# R32 , REVISION: 7.1
###############################################################################
sbk_keyfile is present, but no user_keyfile; set user_keyfile to zero keyfile
# Target Board Information:
# Name: jetson-xavier, Board Family: t186ref, SoC: Tegra 194, 
# OpMode: production, Boot Authentication: SBKPKC, 
# Disk encryption: disabled ,
###############################################################################
copying soft_fuses(/home/weitianyu/external/flashtool_tztek_geac_xavier_jp4.6.1_510g3.1_v2.5.5.1/flashtool/flashtool/Linux_for_Tegra/bootloader/t186ref/BCT/tegra194-mb1-soft-fuses-l4t.cfg)... done.
./tegraflash.py --chip 0x19 --applet "/home/weitianyu/external/flashtool_tztek_geac_xavier_jp4.6.1_510g3.1_v2.5.5.1/flashtool/flashtool/Linux_for_Tegra/bootloader/mb1_t194_prod.bin" --skipuid --soft_fuses tegra194-mb1-soft-fuses-l4t.cfg --bins "mb2_applet nvtboot_applet_t194.bin" --cmd "dump eeprom boardinfo cvm.bin;reboot recovery" --key "/home/weitianyu/external/flashtool_tztek_geac_xavier_jp4.6.1_510g3.1_v2.5.5.1/flashtool/flashtool/Linux_for_Tegra/rsa_priv.pem" --encrypt_key "/home/weitianyu/external/flashtool_tztek_geac_xavier_jp4.6.1_510g3.1_v2.5.5.1/flashtool/flashtool/Linux_for_Tegra/sbk.key" 
Welcome to Tegra Flash
version 1.0.0
Type ? or help for help and q or quit to exit
Use ! to execute system commands
 
[   0.0035 ] Generating RCM messages
[   0.0064 ] tegrasign_v3.py --key /home/weitianyu/external/flashtool_tztek_geac_xavier_jp4.6.1_510g3.1_v2.5.5.1/flashtool/flashtool/Linux_for_Tegra/sbk.key --file /home/weitianyu/external/flashtool_tztek_geac_xavier_jp4.6.1_510g3.1_v2.5.5.1/flashtool/flashtool/Linux_for_Tegra/bootloader/mb1_t194_prod.bin --offset 4096
[   0.0070 ] Key is a SBK key
[   0.0284 ] Key Size is 16 bytes
[   0.0285 ] 246336
[   0.0363 ] 
[   0.0392 ] tegrahost_v2 --chip 0x19 0 --magicid MB1B --appendsigheader /home/weitianyu/external/flashtool_tztek_geac_xavier_jp4.6.1_510g3.1_v2.5.5.1/flashtool/flashtool/Linux_for_Tegra/bootloader/mb1_t194_prod_encrypt.bin zerosbk
[   0.0401 ] Header already present for /home/weitianyu/external/flashtool_tztek_geac_xavier_jp4.6.1_510g3.1_v2.5.5.1/flashtool/flashtool/Linux_for_Tegra/bootloader/mb1_t194_prod_encrypt.bin
[   0.0428 ] 
[   0.0446 ] tegrasign_v3.py --getmode mode.txt --key /home/weitianyu/external/flashtool_tztek_geac_xavier_jp4.6.1_510g3.1_v2.5.5.1/flashtool/flashtool/Linux_for_Tegra/rsa_priv.pem
[   0.0461 ] K[   0.0484 ] ey size is 256 bytes
[   0.0518 ] tegrasign_v3.py --file /home/weitianyu/external/flashtool_tztek_geac_xavier_jp4.6.1_510g3.1_v2.5.5.1/flashtool/flashtool/Linux_for_Tegra/bootloader/mb1_t194_prod_encrypt_sigheader.bin --getmontgomeryvalues montgomery.bin --key /home/weitianyu/external/flashtool_tztek_geac_xavier_jp4.6.1_510g3.1_v2.5.5.1/flashtool/flashtool/Linux_for_Tegra/rsa_priv.pem --length 1136 --offset 2960 --pubkeyhash pub_key.key
[   0.0528 ] K[   0.0530 ] ey size is 256 bytes
[   0.0660 ] Saving pkc public key in pub_key.key
[   0.0680 ] tegrahost_v2 --chip 0x19 0 --pubkeyhash pub_key.key --setmontgomeryvalues montgomery.bin --updatesigheader /home/weitianyu/external/flashtool_tztek_geac_xavier_jp4.6.1_510g3.1_v2.5.5.1/flashtool/flashtool/Linux_for_Tegra/bootloader/mb1_t194_prod_encrypt_sigheader.bin /home/weitianyu/external/flashtool_tztek_geac_xavier_jp4.6.1_510g3.1_v2.5.5.1/flashtool/flashtool/Linux_for_Tegra/bootloader/mb1_t194_prod_encrypt_sigheader.sig oem-rsa
[   0.0708 ] 
[   0.0742 ] tegrabct_v2 --chip 0x19 0 --sfuse tegra194-mb1-soft-fuses-l4t.cfg.pdf sfuse.bin
[   0.0752 ] 
[   0.0768 ] tegrarcm_v2 --listrcm rcm_list.xml --chip 0x19 0 --sfuses sfuse.bin --download rcm /home/weitianyu/external/flashtool_tztek_geac_xavier_jp4.6.1_510g3.1_v2.5.5.1/flashtool/flashtool/Linux_for_Tegra/bootloader/mb1_t194_prod_encrypt_sigheader.bin 0 0
[   0.0773 ] RCM 0 is saved as rcm_0.rcm
[   0.0801 ] RCM 1 is saved as rcm_1.rcm
[   0.0801 ] RCM 2 is saved as rcm_2.rcm
[   0.0801 ] List of rcm files are saved in rcm_list.xml
[   0.0801 ] 
[   0.0801 ] Signing RCM messages
[   0.0829 ] tegrasign_v3.py --getmontgomeryvalues montgomery.bin --key /home/weitianyu/external/flashtool_tztek_geac_xavier_jp4.6.1_510g3.1_v2.5.5.1/flashtool/flashtool/Linux_for_Tegra/rsa_priv.pem --list rcm_list.xml --pubkeyhash pub_key.key
[   0.0840 ] K[   0.0843 ] ey size is 256 bytes
[   0.1198 ] Saving pkc public key in pub_key.key
[   0.1197 ] Copying signature to RCM mesages
[   0.1217 ] tegrarcm_v2 --chip 0x19 0 --updatesig rcm_list_signed.xml --pubkeyhash pub_key.key
[   0.1233 ] 
[   0.1234 ] Boot Rom communication
[   0.1250 ] tegrarcm_v2 --chip 0x19 0 --rcm rcm_list_signed.xml --skipuid
[   0.1256 ] RCM version 0X190001
[   0.2694 ] Boot Rom communication completed
[   1.3048 ] 
[   2.3095 ] tegrarcm_v2 --isapplet
[   2.3115 ] Applet version 01.00.0000
[   2.4448 ] 
[   2.4473 ] tegrarcm_v2 --ismb2
[   2.6325 ] 
[   2.6338 ] tegrahost_v2 --chip 0x19 --align nvtboot_applet_t194.bin
[   2.6346 ] 
[   2.6347 ] header_magic: 50000ea
[   2.6370 ] tegrasign_v3.py --key /home/weitianyu/external/flashtool_tztek_geac_xavier_jp4.6.1_510g3.1_v2.5.5.1/flashtool/flashtool/Linux_for_Tegra/sbk.key --list nvtboot_applet_t194.bin_list.xml
[   2.6370 ] Key is a SBK key
[   2.6370 ] Key Size is 16 bytes
[   2.6400 ] 123616
[   2.6466 ] tegrahost_v2 --chip 0x19 0 --updatesigheader nvtboot_applet_t194.bin.encrypt nvtboot_applet_t194.bin.hash zerosbk
[   2.6483 ] 
[   2.6508 ] tegrahost_v2 --chip 0x19 --align nvtboot_applet_t194.bin.encrypt
[   2.6518 ] 
[   2.6520 ] header_magic: 298f1684
[   2.6541 ] tegrahost_v2 --appendsigheader nvtboot_applet_t194.bin.encrypt oem-rsa-sbk --chip 0x19 0 --magicid PLDT
[   2.6550 ] adding BCH for nvtboot_applet_t194.bin.encrypt
[   2.6586 ] 
[   2.6611 ] tegrasign_v3.py --key /home/weitianyu/external/flashtool_tztek_geac_xavier_jp4.6.1_510g3.1_v2.5.5.1/flashtool/flashtool/Linux_for_Tegra/rsa_priv.pem --list nvtboot_applet_t194.bin_sigheader.encrypt_list.xml --pubkeyhash pub_key.key
[   2.6630 ] Key[   2.6635 ]  size is 256 bytes
[   2.6833 ] Saving pkc public key in pub_key.key
[   2.6852 ] tegrahost_v2 --chip 0x19 0 --updatesigheader nvtboot_applet_t194.bin_sigheader.encrypt.signed nvtboot_applet_t194.bin_sigheader.encrypt.sig oem-rsa --pubkeyhash pub_key.key
[   2.6873 ] 
[   2.6892 ] tegrarcm_v2 --download mb2 nvtboot_applet_t194.bin_sigheader.encrypt.signed
[   2.6900 ] Applet version 01.00.0000
[   2.8285 ] Sending mb2
[   2.8286 ] [................................................] 100%
[   2.8506 ] 
[   2.8526 ] tegrarcm_v2 --boot recovery
[   2.8531 ] Applet version 01.00.0000
[   3.2711 ] 
[   4.2755 ] tegrarcm_v2 --isapplet
[   4.4131 ] 
[   4.4144 ] tegrarcm_v2 --ismb2
[   4.4150 ] MB2 Applet version 01.00.0000
[   4.5484 ] 
[   4.5516 ] tegrarcm_v2 --ismb2
[   4.5532 ] MB2 Applet version 01.00.0000
[   4.7370 ] 
[   4.7405 ] Retrieving board information
[   4.7433 ] tegrarcm_v2 --oem platformdetails chip chip_info.bin
[   4.7447 ] MB2 Applet version 01.00.0000
[   4.9282 ] Saved platform info in chip_info.bin
[   4.9328 ] Chip minor revision: 2
[   4.9329 ] Bootrom revision: 0xf
[   4.9329 ] Ram code: 0x2
[   4.9330 ] Chip sku: 0xd0
[   4.9330 ] Chip Sample: non es
[   4.9337 ] 
[   4.9338 ] Retrieving EEPROM data
[   4.9339 ] tegrarcm_v2 --oem platformdetails eeprom cvm /home/weitianyu/external/flashtool_tztek_geac_xavier_jp4.6.1_510g3.1_v2.5.5.1/flashtool/flashtool/Linux_for_Tegra/bootloader/cvm.bin
[   4.9346 ] MB2 Applet version 01.00.0000
[   5.1152 ] Saved platform info in /home/weitianyu/external/flashtool_tztek_geac_xavier_jp4.6.1_510g3.1_v2.5.5.1/flashtool/flashtool/Linux_for_Tegra/bootloader/cvm.bin
[   5.1507 ] 
[   5.1508 ] Rebooting to recovery mode
[   5.1516 ] tegrarcm_v2 --ismb2
[   5.1521 ] MB2 Applet version 01.00.0000
[   5.2927 ] 
[   5.2927 ] Rebooting to recovery mode
[   5.2947 ] tegrarcm_v2 --reboot recovery
[   5.2952 ] MB2 Applet version 01.00.0000
[   5.7913 ] 
Board ID(2888) version(400) sku(0004) revision(L.0)
Copy /home/weitianyu/external/flashtool_tztek_geac_xavier_jp4.6.1_510g3.1_v2.5.5.1/flashtool/flashtool/Linux_for_Tegra/kernel/dtb/tegra194-p2888-0001-p2822-0000.dtb to /home/weitianyu/external/flashtool_tztek_geac_xavier_jp4.6.1_510g3.1_v2.5.5.1/flashtool/flashtool/Linux_for_Tegra/kernel/dtb/tegra194-p2888-0001-p2822-0000.dtb.rec
copying bctfile(/home/weitianyu/external/flashtool_tztek_geac_xavier_jp4.6.1_510g3.1_v2.5.5.1/flashtool/flashtool/Linux_for_Tegra/bootloader/t186ref/BCT/tegra194-mb1-bct-memcfg-p2888.cfg)... done.
copying bctfile1(/home/weitianyu/external/flashtool_tztek_geac_xavier_jp4.6.1_510g3.1_v2.5.5.1/flashtool/flashtool/Linux_for_Tegra/bootloader/t186ref/BCT/tegra194-memcfg-sw-override.cfg)... done.
copying uphy_config(/home/weitianyu/external/flashtool_tztek_geac_xavier_jp4.6.1_510g3.1_v2.5.5.1/flashtool/flashtool/Linux_for_Tegra/bootloader/t186ref/BCT/tegra194-mb1-uphy-lane-p2888-0000-p2822-0000.cfg)... done.
copying minratchet_config(/home/weitianyu/external/flashtool_tztek_geac_xavier_jp4.6.1_510g3.1_v2.5.5.1/flashtool/flashtool/Linux_for_Tegra/bootloader/t186ref/BCT/tegra194-mb1-bct-ratchet-p2888-0000-p2822-0000.cfg)... done.
copying device_config(/home/weitianyu/external/flashtool_tztek_geac_xavier_jp4.6.1_510g3.1_v2.5.5.1/flashtool/flashtool/Linux_for_Tegra/bootloader/t186ref/BCT/tegra19x-mb1-bct-device-sdmmc.cfg)... done.
copying misc_cold_boot_config(/home/weitianyu/external/flashtool_tztek_geac_xavier_jp4.6.1_510g3.1_v2.5.5.1/flashtool/flashtool/Linux_for_Tegra/bootloader/t186ref/BCT/tegra194-mb1-bct-misc-l4t.cfg)... done.
copying misc_config(/home/weitianyu/external/flashtool_tztek_geac_xavier_jp4.6.1_510g3.1_v2.5.5.1/flashtool/flashtool/Linux_for_Tegra/bootloader/t186ref/BCT/tegra194-mb1-bct-misc-flash.cfg)... done.
copying pinmux_config(/home/weitianyu/external/flashtool_tztek_geac_xavier_jp4.6.1_510g3.1_v2.5.5.1/flashtool/flashtool/Linux_for_Tegra/bootloader/t186ref/BCT/tegra19x-mb1-pinmux-p2888-0000-a04-p2822-0000-b01.cfg)... done.
copying gpioint_config(/home/weitianyu/external/flashtool_tztek_geac_xavier_jp4.6.1_510g3.1_v2.5.5.1/flashtool/flashtool/Linux_for_Tegra/bootloader/t186ref/BCT/tegra194-mb1-bct-gpioint-p2888-0000-p2822-0000.cfg)... done.
copying pmic_config(/home/weitianyu/external/flashtool_tztek_geac_xavier_jp4.6.1_510g3.1_v2.5.5.1/flashtool/flashtool/Linux_for_Tegra/bootloader/t186ref/BCT/tegra194-mb1-bct-pmic-p2888-0001-a04-E-0-p2822-0000.cfg)... done.
copying pmc_config(/home/weitianyu/external/flashtool_tztek_geac_xavier_jp4.6.1_510g3.1_v2.5.5.1/flashtool/flashtool/Linux_for_Tegra/bootloader/t186ref/BCT/tegra19x-mb1-padvoltage-p2888-0000-a00-p2822-0000-a00.cfg)... done.
copying prod_config(/home/weitianyu/external/flashtool_tztek_geac_xavier_jp4.6.1_510g3.1_v2.5.5.1/flashtool/flashtool/Linux_for_Tegra/bootloader/t186ref/BCT/tegra19x-mb1-prod-p2888-0000-p2822-0000.cfg)... done.
copying scr_config(/home/weitianyu/external/flashtool_tztek_geac_xavier_jp4.6.1_510g3.1_v2.5.5.1/flashtool/flashtool/Linux_for_Tegra/bootloader/t186ref/BCT/tegra194-mb1-bct-scr-cbb-mini.cfg)... done.
copying scr_cold_boot_config(/home/weitianyu/external/flashtool_tztek_geac_xavier_jp4.6.1_510g3.1_v2.5.5.1/flashtool/flashtool/Linux_for_Tegra/bootloader/t186ref/BCT/tegra194-mb1-bct-scr-cbb-mini.cfg)... done.
copying bootrom_config(/home/weitianyu/external/flashtool_tztek_geac_xavier_jp4.6.1_510g3.1_v2.5.5.1/flashtool/flashtool/Linux_for_Tegra/bootloader/t186ref/BCT/tegra194-mb1-bct-reset-p2888-0000-p2822-0000.cfg)... done.
copying dev_params(/home/weitianyu/external/flashtool_tztek_geac_xavier_jp4.6.1_510g3.1_v2.5.5.1/flashtool/flashtool/Linux_for_Tegra/bootloader/t186ref/BCT/tegra194-br-bct-sdmmc.cfg)... done.
Existing bootloader(/home/weitianyu/external/flashtool_tztek_geac_xavier_jp4.6.1_510g3.1_v2.5.5.1/flashtool/flashtool/Linux_for_Tegra/bootloader/nvtboot_cpu_t194.bin) reused.
copying initrd(/home/weitianyu/external/flashtool_tztek_geac_xavier_jp4.6.1_510g3.1_v2.5.5.1/flashtool/flashtool/Linux_for_Tegra/bootloader/l4t_initrd.img)... done.
Making Boot image... done.
/home/weitianyu/external/flashtool_tztek_geac_xavier_jp4.6.1_510g3.1_v2.5.5.1/flashtool/flashtool/Linux_for_Tegra/bootloader/tegraflash.py --chip 0x19 --key /home/weitianyu/external/flashtool_tztek_geac_xavier_jp4.6.1_510g3.1_v2.5.5.1/flashtool/flashtool/Linux_for_Tegra/rsa_priv.pem --encrypt_key /home/weitianyu/external/flashtool_tztek_geac_xavier_jp4.6.1_510g3.1_v2.5.5.1/flashtool/flashtool/Linux_for_Tegra/.zero_.key --minratchet_config tegra194-mb1-bct-ratchet-p2888-0000-p2822-0000.cfg --cmd sign boot.img kernel
Welcome to Tegra Flash
version 1.0.0
Type ? or help for help and q or quit to exit
Use ! to execute system commands
 
[   0.0007 ] Generating signature
[   0.0031 ] tegrasign_v3.py --getmode mode.txt --key /home/weitianyu/external/flashtool_tztek_geac_xavier_jp4.6.1_510g3.1_v2.5.5.1/flashtool/flashtool/Linux_for_Tegra/rsa_priv.pem
[   0.0043 ] K[   0.0044 ] ey size is 256 bytes
[   0.0072 ] tegrasign_v3.py --getmontgomeryvalues montgomery.bin --key /home/weitianyu/external/flashtool_tztek_geac_xavier_jp4.6.1_510g3.1_v2.5.5.1/flashtool/flashtool/Linux_for_Tegra/rsa_priv.pem
[   0.0084 ] K[   0.0087 ] ey size is 256 bytes
[   0.0088 ] Generating ratchet blob
[   0.0107 ] tegrabct_v2 --chip 0x19 0 --ratchet_blob ratchet_blob.bin --minratchet tegra194-mb1-bct-ratchet-p2888-0000-p2822-0000.cfg
[   0.0112 ] FwIndex: 1, MinRatchetLevel: 0
[   0.0114 ] FwIndex: 2, MinRatchetLevel: 0
[   0.0114 ] FwIndex: 3, MinRatchetLevel: 0
[   0.0114 ] FwIndex: 4, MinRatchetLevel: 0
[   0.0114 ] FwIndex: 5, MinRatchetLevel: 0
[   0.0114 ] FwIndex: 6, MinRatchetLevel: 0
[   0.0114 ] FwIndex: 7, MinRatchetLevel: 0
[   0.0114 ] FwIndex: 11, MinRatchetLevel: 0
[   0.0114 ] FwIndex: 12, MinRatchetLevel: 0
[   0.0114 ] FwIndex: 13, MinRatchetLevel: 0
[   0.0114 ] FwIndex: 14, MinRatchetLevel: 0
[   0.0114 ] FwIndex: 15, MinRatchetLevel: 0
[   0.0114 ] FwIndex: 16, MinRatchetLevel: 0
[   0.0114 ] FwIndex: 17, MinRatchetLevel: 0
[   0.0114 ] FwIndex: 18, MinRatchetLevel: 0
[   0.0114 ] FwIndex: 19, MinRatchetLevel: 0
[   0.0114 ] FwIndex: 30, MinRatchetLevel: 0
[   0.0114 ] FwIndex: 31, MinRatchetLevel: 0
[   0.0114 ] FwIndex: 32, MinRatchetLevel: 0
[   0.0114 ] 
[   0.0114 ] header_magic: 414e4452
[   0.0115 ] Encrypting file
[   0.0131 ] tegrahost_v2 --chip 0x19 --align 1_boot.img
[   0.0136 ] 
[   0.0137 ] header_magic: 414e4452
[   0.0159 ] tegrasign_v3.py --key /home/weitianyu/external/flashtool_tztek_geac_xavier_jp4.6.1_510g3.1_v2.5.5.1/flashtool/flashtool/Linux_for_Tegra/.zero_.key --list 1_boot.img_list.xml
[   0.0160 ] Key is a SBK key
[   0.0160 ] Key Size is 16 bytes
[   0.4699 ] tegrahost_v2 --chip 0x19 0 --updatesigheader 1_boot.img.encrypt 1_boot.img.hash zerosbk
[   0.5528 ] 
[   0.5548 ] tegrahost_v2 --chip 0x19 --align 1_boot.img.encrypt
[   0.5553 ] 
[   0.5554 ] header_magic: 414e4452
[   0.5570 ] tegrahost_v2 --appendsigheader 1_boot.img.encrypt oem-rsa-sbk --chip 0x19 0 --magicid KRNL --ratchet_blob ratchet_blob.bin
[   0.5576 ] adding BCH for 1_boot.img.encrypt
[   1.2771 ] 
[   1.2794 ] tegrasign_v3.py --key /home/weitianyu/external/flashtool_tztek_geac_xavier_jp4.6.1_510g3.1_v2.5.5.1/flashtool/flashtool/Linux_for_Tegra/rsa_priv.pem --list 1_boot.img_sigheader.encrypt_list.xml --pubkeyhash pub_key.key
[   1.2805 ] Key [   1.2806 ] size is 256 bytes
[   1.3335 ] Saving pkc public key in pub_key.key
[   1.3349 ] tegrahost_v2 --chip 0x19 0 --updatesigheader 1_boot.img_sigheader.encrypt.signed 1_boot.img_sigheader.encrypt.sig oem-rsa --pubkeyhash pub_key.key
[   1.7425 ] 
[   1.7638 ] Signed and encrypted file: /home/weitianyu/external/flashtool_tztek_geac_xavier_jp4.6.1_510g3.1_v2.5.5.1/flashtool/flashtool/Linux_for_Tegra/bootloader/temp_user_dir/boot.img_sigheader.encrypt.signed
l4t_sign_image.sh: Generate header for boot.img_sigheader.encrypt.signed
l4t_sign_image.sh: chip 0x19: add 0x2929800 to offset  0x8 in sig file
l4t_sign_image.sh: Generate 16-byte-size-aligned base file for boot.img_sigheader.encrypt.signed
l4t_sign_image.sh: the signed file is /home/weitianyu/external/flashtool_tztek_geac_xavier_jp4.6.1_510g3.1_v2.5.5.1/flashtool/flashtool/Linux_for_Tegra/bootloader/temp_user_dir/boot_sigheader.img.encrypt.signed
done.
Making recovery ramdisk for recovery image...
Re-generating recovery ramdisk for recovery image...
/home/weitianyu/external/flashtool_tztek_geac_xavier_jp4.6.1_510g3.1_v2.5.5.1/flashtool/flashtool/Linux_for_Tegra/bootloader/ramdisk_tmp /home/weitianyu/external/flashtool_tztek_geac_xavier_jp4.6.1_510g3.1_v2.5.5.1/flashtool/flashtool/Linux_for_Tegra/bootloader /home/weitianyu/external/flashtool_tztek_geac_xavier_jp4.6.1_510g3.1_v2.5.5.1/flashtool/flashtool/Linux_for_Tegra
30412 块
_BASE_KERNEL_VERSION=4.9.253-tegra
/home/weitianyu/external/flashtool_tztek_geac_xavier_jp4.6.1_510g3.1_v2.5.5.1/flashtool/flashtool/Linux_for_Tegra/bootloader/ramdisk_tmp/lib /home/weitianyu/external/flashtool_tztek_geac_xavier_jp4.6.1_510g3.1_v2.5.5.1/flashtool/flashtool/Linux_for_Tegra/bootloader/ramdisk_tmp /home/weitianyu/external/flashtool_tztek_geac_xavier_jp4.6.1_510g3.1_v2.5.5.1/flashtool/flashtool/Linux_for_Tegra/bootloader /home/weitianyu/external/flashtool_tztek_geac_xavier_jp4.6.1_510g3.1_v2.5.5.1/flashtool/flashtool/Linux_for_Tegra
115334 块
Making Recovery image...
copying recdtbfile(/home/weitianyu/external/flashtool_tztek_geac_xavier_jp4.6.1_510g3.1_v2.5.5.1/flashtool/flashtool/Linux_for_Tegra/kernel/dtb/tegra194-p2888-0001-p2822-0000.dtb.rec)... done.
记录了20+0 的读入
记录了20+0 的写出
20字节已复制,0.000120937 s,165 kB/s
Existing sosfile(/home/weitianyu/external/flashtool_tztek_geac_xavier_jp4.6.1_510g3.1_v2.5.5.1/flashtool/flashtool/Linux_for_Tegra/bootloader/mb1_t194_prod.bin) reused.
Existing tegraboot(/home/weitianyu/external/flashtool_tztek_geac_xavier_jp4.6.1_510g3.1_v2.5.5.1/flashtool/flashtool/Linux_for_Tegra/bootloader/nvtboot_t194.bin) reused.
Existing cpu_bootloader(/home/weitianyu/external/flashtool_tztek_geac_xavier_jp4.6.1_510g3.1_v2.5.5.1/flashtool/flashtool/Linux_for_Tegra/bootloader/nvtboot_cpu_t194.bin) reused.
Existing mb2blfile(/home/weitianyu/external/flashtool_tztek_geac_xavier_jp4.6.1_510g3.1_v2.5.5.1/flashtool/flashtool/Linux_for_Tegra/bootloader/nvtboot_recovery_t194.bin) reused.
Existing mtspreboot(/home/weitianyu/external/flashtool_tztek_geac_xavier_jp4.6.1_510g3.1_v2.5.5.1/flashtool/flashtool/Linux_for_Tegra/bootloader/preboot_c10_prod_cr.bin) reused.
Existing mcepreboot(/home/weitianyu/external/flashtool_tztek_geac_xavier_jp4.6.1_510g3.1_v2.5.5.1/flashtool/flashtool/Linux_for_Tegra/bootloader/mce_c10_prod_cr.bin) reused.
Existing mtsproper(/home/weitianyu/external/flashtool_tztek_geac_xavier_jp4.6.1_510g3.1_v2.5.5.1/flashtool/flashtool/Linux_for_Tegra/bootloader/mts_c10_prod_cr.bin) reused.
Existing mb1file(/home/weitianyu/external/flashtool_tztek_geac_xavier_jp4.6.1_510g3.1_v2.5.5.1/flashtool/flashtool/Linux_for_Tegra/bootloader/mb1_t194_prod.bin) reused.
Existing bpffile(/home/weitianyu/external/flashtool_tztek_geac_xavier_jp4.6.1_510g3.1_v2.5.5.1/flashtool/flashtool/Linux_for_Tegra/bootloader/bpmp_t194.bin) reused.
copying bpfdtbfile(/home/weitianyu/external/flashtool_tztek_geac_xavier_jp4.6.1_510g3.1_v2.5.5.1/flashtool/flashtool/Linux_for_Tegra/bootloader/t186ref/tegra194-a02-bpmp-p2888-a04.dtb)... done.
Existing scefile(/home/weitianyu/external/flashtool_tztek_geac_xavier_jp4.6.1_510g3.1_v2.5.5.1/flashtool/flashtool/Linux_for_Tegra/bootloader/camera-rtcpu-sce.img) reused.
Existing camerafw(/home/weitianyu/external/flashtool_tztek_geac_xavier_jp4.6.1_510g3.1_v2.5.5.1/flashtool/flashtool/Linux_for_Tegra/bootloader/camera-rtcpu-rce.img) reused.
Existing spefile(/home/weitianyu/external/flashtool_tztek_geac_xavier_jp4.6.1_510g3.1_v2.5.5.1/flashtool/flashtool/Linux_for_Tegra/bootloader/spe_t194.bin) reused.
Existing wb0boot(/home/weitianyu/external/flashtool_tztek_geac_xavier_jp4.6.1_510g3.1_v2.5.5.1/flashtool/flashtool/Linux_for_Tegra/bootloader/warmboot_t194_prod.bin) reused.
Existing tosfile(/home/weitianyu/external/flashtool_tztek_geac_xavier_jp4.6.1_510g3.1_v2.5.5.1/flashtool/flashtool/Linux_for_Tegra/bootloader/tos-trusty_t194.img) reused.
Existing eksfile(/home/weitianyu/external/flashtool_tztek_geac_xavier_jp4.6.1_510g3.1_v2.5.5.1/flashtool/flashtool/Linux_for_Tegra/bootloader/eks.img) reused.
copying soft_fuses(/home/weitianyu/external/flashtool_tztek_geac_xavier_jp4.6.1_510g3.1_v2.5.5.1/flashtool/flashtool/Linux_for_Tegra/bootloader/t186ref/BCT/tegra194-mb1-soft-fuses-l4t.cfg)... done.
copying dtbfile(/home/weitianyu/external/flashtool_tztek_geac_xavier_jp4.6.1_510g3.1_v2.5.5.1/flashtool/flashtool/Linux_for_Tegra/kernel/dtb/tegra194-p2888-0001-p2822-0000.dtb)... done.
Copying nv_boot_control.conf to rootfs
/home/weitianyu/external/flashtool_tztek_geac_xavier_jp4.6.1_510g3.1_v2.5.5.1/flashtool/flashtool/Linux_for_Tegra/bootloader/tegraflash.py --chip 0x19 --key /home/weitianyu/external/flashtool_tztek_geac_xavier_jp4.6.1_510g3.1_v2.5.5.1/flashtool/flashtool/Linux_for_Tegra/rsa_priv.pem --encrypt_key /home/weitianyu/external/flashtool_tztek_geac_xavier_jp4.6.1_510g3.1_v2.5.5.1/flashtool/flashtool/Linux_for_Tegra/.zero_.key --minratchet_config tegra194-mb1-bct-ratchet-p2888-0000-p2822-0000.cfg --cmd sign kernel_tegra194-p2888-0001-p2822-0000.dtb kernel_dtb
Welcome to Tegra Flash
version 1.0.0
Type ? or help for help and q or quit to exit
Use ! to execute system commands
 
[   0.0005 ] Generating signature
[   0.0023 ] tegrasign_v3.py --getmode mode.txt --key /home/weitianyu/external/flashtool_tztek_geac_xavier_jp4.6.1_510g3.1_v2.5.5.1/flashtool/flashtool/Linux_for_Tegra/rsa_priv.pem
[   0.0037 ] Ke[   0.0038 ] y size is 256 bytes
[   0.0061 ] tegrasign_v3.py --getmontgomeryvalues montgomery.bin --key /home/weitianyu/external/flashtool_tztek_geac_xavier_jp4.6.1_510g3.1_v2.5.5.1/flashtool/flashtool/Linux_for_Tegra/rsa_priv.pem
[   0.0077 ] K[   0.0082 ] ey size is 256 bytes
[   0.0082 ] Generating ratchet blob
[   0.0098 ] tegrabct_v2 --chip 0x19 0 --ratchet_blob ratchet_blob.bin --minratchet tegra194-mb1-bct-ratchet-p2888-0000-p2822-0000.cfg
[   0.0104 ] FwIndex: 1, MinRatchetLevel: 0
[   0.0105 ] FwIndex: 2, MinRatchetLevel: 0
[   0.0105 ] FwIndex: 3, MinRatchetLevel: 0
[   0.0105 ] FwIndex: 4, MinRatchetLevel: 0
[   0.0105 ] FwIndex: 5, MinRatchetLevel: 0
[   0.0105 ] FwIndex: 6, MinRatchetLevel: 0
[   0.0105 ] FwIndex: 7, MinRatchetLevel: 0
[   0.0105 ] FwIndex: 11, MinRatchetLevel: 0
[   0.0105 ] FwIndex: 12, MinRatchetLevel: 0
[   0.0105 ] FwIndex: 13, MinRatchetLevel: 0
[   0.0105 ] FwIndex: 14, MinRatchetLevel: 0
[   0.0105 ] FwIndex: 15, MinRatchetLevel: 0
[   0.0105 ] FwIndex: 16, MinRatchetLevel: 0
[   0.0105 ] FwIndex: 17, MinRatchetLevel: 0
[   0.0105 ] FwIndex: 18, MinRatchetLevel: 0
[   0.0105 ] FwIndex: 19, MinRatchetLevel: 0
[   0.0105 ] FwIndex: 30, MinRatchetLevel: 0
[   0.0105 ] FwIndex: 31, MinRatchetLevel: 0
[   0.0105 ] FwIndex: 32, MinRatchetLevel: 0
[   0.0105 ] 
[   0.0106 ] header_magic: d00dfeed
[   0.0106 ] Encrypting file
[   0.0123 ] tegrahost_v2 --chip 0x19 --align 1_kernel_tegra194-p2888-0001-p2822-0000.dtb
[   0.0134 ] 
[   0.0135 ] header_magic: d00dfeed
[   0.0158 ] tegrasign_v3.py --key /home/weitianyu/external/flashtool_tztek_geac_xavier_jp4.6.1_510g3.1_v2.5.5.1/flashtool/flashtool/Linux_for_Tegra/.zero_.key --list 1_kernel_tegra194-p2888-0001-p2822-0000.dtb_list.xml
[   0.0158 ] Key is a SBK key
[   0.0158 ] Key Size is 16 bytes
[   0.0227 ] tegrahost_v2 --chip 0x19 0 --updatesigheader 1_kernel_tegra194-p2888-0001-p2822-0000.dtb.encrypt 1_kernel_tegra194-p2888-0001-p2822-0000.dtb.hash zerosbk
[   0.0244 ] 
[   0.0263 ] tegrahost_v2 --chip 0x19 --align 1_kernel_tegra194-p2888-0001-p2822-0000.dtb.encrypt
[   0.0269 ] 
[   0.0270 ] header_magic: d00dfeed
[   0.0286 ] tegrahost_v2 --appendsigheader 1_kernel_tegra194-p2888-0001-p2822-0000.dtb.encrypt oem-rsa-sbk --chip 0x19 0 --magicid KDTB --ratchet_blob ratchet_blob.bin
[   0.0294 ] adding BCH for 1_kernel_tegra194-p2888-0001-p2822-0000.dtb.encrypt
[   0.0354 ] 
[   0.0376 ] tegrasign_v3.py --key /home/weitianyu/external/flashtool_tztek_geac_xavier_jp4.6.1_510g3.1_v2.5.5.1/flashtool/flashtool/Linux_for_Tegra/rsa_priv.pem --list 1_kernel_tegra194-p2888-0001-p2822-0000.dtb_sigheader.encrypt_list.xml --pubkeyhash pub_key.key
[   0.0389 ] K[   0.0391 ] ey size is 256 bytes
[   0.0522 ] Saving pkc public key in pub_key.key
[   0.0539 ] tegrahost_v2 --chip 0x19 0 --updatesigheader 1_kernel_tegra194-p2888-0001-p2822-0000.dtb_sigheader.encrypt.signed 1_kernel_tegra194-p2888-0001-p2822-0000.dtb_sigheader.encrypt.sig oem-rsa --pubkeyhash pub_key.key
[   0.0577 ] 
[   0.0582 ] Signed and encrypted file: /home/weitianyu/external/flashtool_tztek_geac_xavier_jp4.6.1_510g3.1_v2.5.5.1/flashtool/flashtool/Linux_for_Tegra/bootloader/temp_user_dir/kernel_tegra194-p2888-0001-p2822-0000.dtb_sigheader.encrypt.signed
l4t_sign_image.sh: Generate header for kernel_tegra194-p2888-0001-p2822-0000.dtb_sigheader.encrypt.signed
l4t_sign_image.sh: chip 0x19: add 0x49050 to offset  0x8 in sig file
l4t_sign_image.sh: Generate 16-byte-size-aligned base file for kernel_tegra194-p2888-0001-p2822-0000.dtb_sigheader.encrypt.signed
l4t_sign_image.sh: the signed file is /home/weitianyu/external/flashtool_tztek_geac_xavier_jp4.6.1_510g3.1_v2.5.5.1/flashtool/flashtool/Linux_for_Tegra/bootloader/temp_user_dir/kernel_tegra194-p2888-0001-p2822-0000_sigheader.dtb.encrypt.signed
done.
Reusing existing system.img... 
done.
Existing tbcfile(/home/weitianyu/external/flashtool_tztek_geac_xavier_jp4.6.1_510g3.1_v2.5.5.1/flashtool/flashtool/Linux_for_Tegra/bootloader/cboot_t194.bin) reused.
copying tbcdtbfile(/home/weitianyu/external/flashtool_tztek_geac_xavier_jp4.6.1_510g3.1_v2.5.5.1/flashtool/flashtool/Linux_for_Tegra/kernel/dtb/tegra194-p2888-0001-p2822-0000.dtb)... done.
copying cfgfile(/home/weitianyu/external/flashtool_tztek_geac_xavier_jp4.6.1_510g3.1_v2.5.5.1/flashtool/flashtool/Linux_for_Tegra/bootloader/t186ref/cfg/flash_t194_sdmmc.xml) to flash.xml... done.
Existing flasher(/home/weitianyu/external/flashtool_tztek_geac_xavier_jp4.6.1_510g3.1_v2.5.5.1/flashtool/flashtool/Linux_for_Tegra/bootloader/nvtboot_recovery_cpu_t194.bin) reused.
Existing flashapp(/home/weitianyu/external/flashtool_tztek_geac_xavier_jp4.6.1_510g3.1_v2.5.5.1/flashtool/flashtool/Linux_for_Tegra/bootloader/tegraflash.py) reused.
./tegraflash.py --bl nvtboot_recovery_cpu_t194.bin --sdram_config tegra194-mb1-bct-memcfg-p2888.cfg,tegra194-memcfg-sw-override.cfg  --odmdata 0x9190000 --applet mb1_t194_prod.bin --cmd "sign" --soft_fuses tegra194-mb1-soft-fuses-l4t.cfg  --cfg flash.xml --chip 0x19 --uphy_config tegra194-mb1-uphy-lane-p2888-0000-p2822-0000.cfg --minratchet_config tegra194-mb1-bct-ratchet-p2888-0000-p2822-0000.cfg --device_config tegra19x-mb1-bct-device-sdmmc.cfg --misc_cold_boot_config tegra194-mb1-bct-misc-l4t.cfg --misc_config tegra194-mb1-bct-misc-flash.cfg --pinmux_config tegra19x-mb1-pinmux-p2888-0000-a04-p2822-0000-b01.cfg --gpioint_config tegra194-mb1-bct-gpioint-p2888-0000-p2822-0000.cfg --pmic_config tegra194-mb1-bct-pmic-p2888-0001-a04-E-0-p2822-0000.cfg --pmc_config tegra19x-mb1-padvoltage-p2888-0000-a00-p2822-0000-a00.cfg --prod_config tegra19x-mb1-prod-p2888-0000-p2822-0000.cfg --scr_config tegra194-mb1-bct-scr-cbb-mini.cfg --scr_cold_boot_config tegra194-mb1-bct-scr-cbb-mini.cfg --br_cmd_config tegra194-mb1-bct-reset-p2888-0000-p2822-0000.cfg --dev_params tegra194-br-bct-sdmmc.cfg  --bin "mb2_bootloader nvtboot_recovery_t194.bin; mts_preboot preboot_c10_prod_cr.bin; mts_mce mce_c10_prod_cr.bin; mts_proper mts_c10_prod_cr.bin; bpmp_fw bpmp_t194.bin; bpmp_fw_dtb tegra194-a02-bpmp-p2888-a04.dtb; spe_fw spe_t194.bin; tlk tos-trusty_t194.img; eks eks.img; bootloader_dtb tegra194-p2888-0001-p2822-0000.dtb"  --key /home/weitianyu/external/flashtool_tztek_geac_xavier_jp4.6.1_510g3.1_v2.5.5.1/flashtool/flashtool/Linux_for_Tegra/rsa_priv.pem --encrypt_key /home/weitianyu/external/flashtool_tztek_geac_xavier_jp4.6.1_510g3.1_v2.5.5.1/flashtool/flashtool/Linux_for_Tegra/sbk.key 
Welcome to Tegra Flash
version 1.0.0
Type ? or help for help and q or quit to exit
Use ! to execute system commands
 
[   0.0063 ] Reading ramcode from backup chip_info.bin file
[   0.0064 ] RAMCODE Read from Device: 2

[   0.0064 ] Disable BPMP dtb trim, using default dtb
[   0.0064 ] 
[   0.0086 ] tegrasign_v3.py --getmode mode.txt --key /home/weitianyu/external/flashtool_tztek_geac_xavier_jp4.6.1_510g3.1_v2.5.5.1/flashtool/flashtool/Linux_for_Tegra/rsa_priv.pem
[   0.0099 ] Ke[   0.0101 ] y size is 256 bytes
[   0.0102 ] Generating RCM messages
[   0.0119 ] tegrasign_v3.py --key /home/weitianyu/external/flashtool_tztek_geac_xavier_jp4.6.1_510g3.1_v2.5.5.1/flashtool/flashtool/Linux_for_Tegra/sbk.key --file mb1_t194_prod.bin --offset 4096
[   0.0125 ] Key is a SBK key
[   0.0324 ] Key Size is 16 bytes
[   0.0326 ] 246336
[   0.0398 ] 
[   0.0418 ] tegrahost_v2 --chip 0x19 0 --magicid MB1B --appendsigheader mb1_t194_prod_encrypt.bin zerosbk
[   0.0425 ] Header already present for mb1_t194_prod_encrypt.bin
[   0.0448 ] 
[   0.0466 ] tegrasign_v3.py --getmode mode.txt --key /home/weitianyu/external/flashtool_tztek_geac_xavier_jp4.6.1_510g3.1_v2.5.5.1/flashtool/flashtool/Linux_for_Tegra/rsa_priv.pem
[   0.0481 ] K[   0.0484 ] ey size is 256 bytes
[   0.0508 ] tegrasign_v3.py --file mb1_t194_prod_encrypt_sigheader.bin --getmontgomeryvalues montgomery.bin --key /home/weitianyu/external/flashtool_tztek_geac_xavier_jp4.6.1_510g3.1_v2.5.5.1/flashtool/flashtool/Linux_for_Tegra/rsa_priv.pem --length 1136 --offset 2960 --pubkeyhash pub_key.key
[   0.0519 ] Key[   0.0520 ]  size is 256 bytes
[   0.0636 ] Saving pkc public key in pub_key.key
[   0.0657 ] tegrahost_v2 --chip 0x19 0 --pubkeyhash pub_key.key --setmontgomeryvalues montgomery.bin --updatesigheader mb1_t194_prod_encrypt_sigheader.bin mb1_t194_prod_encrypt_sigheader.sig oem-rsa
[   0.0698 ] 
[   0.0724 ] tegrabct_v2 --chip 0x19 0 --sfuse tegra194-mb1-soft-fuses-l4t.cfg sfuse.bin
[   0.0732 ] 
[   0.0749 ] tegrabct_v2 --chip 0x19 0 --ratchet_blob ratchet_blob.bin --minratchet tegra194-mb1-bct-ratchet-p2888-0000-p2822-0000.cfg
[   0.0755 ] FwIndex: 1, MinRatchetLevel: 0
[   0.0756 ] FwIndex: 2, MinRatchetLevel: 0
[   0.0756 ] FwIndex: 3, MinRatchetLevel: 0
[   0.0756 ] FwIndex: 4, MinRatchetLevel: 0
[   0.0756 ] FwIndex: 5, MinRatchetLevel: 0
[   0.0756 ] FwIndex: 6, MinRatchetLevel: 0
[   0.0756 ] FwIndex: 7, MinRatchetLevel: 0
[   0.0756 ] FwIndex: 11, MinRatchetLevel: 0
[   0.0756 ] FwIndex: 12, MinRatchetLevel: 0
[   0.0756 ] FwIndex: 13, MinRatchetLevel: 0
[   0.0756 ] FwIndex: 14, MinRatchetLevel: 0
[   0.0756 ] FwIndex: 15, MinRatchetLevel: 0
[   0.0756 ] FwIndex: 16, MinRatchetLevel: 0
[   0.0757 ] FwIndex: 17, MinRatchetLevel: 0
[   0.0757 ] FwIndex: 18, MinRatchetLevel: 0
[   0.0757 ] FwIndex: 19, MinRatchetLevel: 0
[   0.0757 ] FwIndex: 30, MinRatchetLevel: 0
[   0.0757 ] FwIndex: 31, MinRatchetLevel: 0
[   0.0757 ] FwIndex: 32, MinRatchetLevel: 0
[   0.0757 ] 
[   0.0774 ] tegrarcm_v2 --listrcm rcm_list.xml --chip 0x19 0 --sfuses sfuse.bin --download rcm mb1_t194_prod_encrypt_sigheader.bin 0 0
[   0.0779 ] RCM 0 is saved as rcm_0.rcm
[   0.0805 ] RCM 1 is saved as rcm_1.rcm
[   0.0805 ] RCM 2 is saved as rcm_2.rcm
[   0.0805 ] List of rcm files are saved in rcm_list.xml
[   0.0805 ] 
[   0.0806 ] Signing RCM messages
[   0.0830 ] tegrasign_v3.py --getmontgomeryvalues montgomery.bin --key /home/weitianyu/external/flashtool_tztek_geac_xavier_jp4.6.1_510g3.1_v2.5.5.1/flashtool/flashtool/Linux_for_Tegra/rsa_priv.pem --list rcm_list.xml --pubkeyhash pub_key.key
[   0.0851 ] K[   0.0854 ] ey size is 256 bytes
[   0.1255 ] Saving pkc public key in pub_key.key
[   0.1254 ] Copying signature to RCM mesages
[   0.1275 ] tegrarcm_v2 --chip 0x19 0 --updatesig rcm_list_signed.xml --pubkeyhash pub_key.key
[   0.1285 ] 
[   0.1286 ] Parsing partition layout
[   0.1309 ] tegraparser_v2 --pt flash.xml.tmp
[   0.1325 ] 
[   0.1325 ] Creating list of images to be signed
[   0.1341 ] tegrahost_v2 --chip 0x19 --partitionlayout flash.xml.bin --list images_list.xml --ratchet_blob ratchet_blob.bin
[   0.1347 ] MB1: Nvheader already present is mb1_t194_prod.bin
[   0.1349 ] Header already present for mb1_t194_prod_sigheader.bin
[   0.1352 ] MB1: Nvheader already present is mb1_t194_prod.bin
[   0.1377 ] Header already present for mb1_t194_prod_sigheader.bin
[   0.1383 ] adding BCH for spe_t194.bin
[   0.1407 ] adding BCH for spe_t194.bin
[   0.1422 ] adding BCH for nvtboot_t194.bin
[   0.1437 ] adding BCH for nvtboot_t194.bin
[   0.1468 ] Header already present for preboot_c10_prod_cr.bin
[   0.1501 ] Header already present for preboot_c10_prod_cr.bin
[   0.1502 ] Header already present for mce_c10_prod_cr.bin
[   0.1507 ] Header already present for mce_c10_prod_cr.bin
[   0.1516 ] adding BCH for mts_c10_prod_cr.bin
[   0.1555 ] adding BCH for mts_c10_prod_cr.bin
[   0.2146 ] adding BCH for cboot_t194.bin
[   0.2746 ] adding BCH for cboot_t194.bin
[   0.2823 ] adding BCH for tegra194-p2888-0001-p2822-0000.dtb
[   0.2907 ] adding BCH for tegra194-p2888-0001-p2822-0000.dtb
[   0.2957 ] adding BCH for tos-trusty_t194.img
[   0.3012 ] adding BCH for tos-trusty_t194.img
[   0.3085 ] adding BCH for eks.img
[   0.3157 ] adding BCH for eks.img
[   0.3158 ] adding BCH for bpmp_t194.bin
[   0.3160 ] adding BCH for bpmp_t194.bin
[   0.3309 ] adding BCH for tegra194-a02-bpmp-p2888-a04.dtb
[   0.3459 ] adding BCH for tegra194-a02-bpmp-p2888-a04.dtb
[   0.3591 ] adding BCH for xusb_sil_rel_fw
[   0.3731 ] adding BCH for xusb_sil_rel_fw
[   0.3754 ] adding BCH for camera-rtcpu-rce.img
[   0.3776 ] adding BCH for camera-rtcpu-rce.img
[   0.3823 ] adding BCH for adsp-fw.bin
[   0.3867 ] adding BCH for adsp-fw.bin
[   0.3881 ] Header already present for warmboot_t194_prod.bin
[   0.3895 ] Header already present for warmboot_t194_prod.bin
[   0.3901 ] adding BCH for recovery.img
[   0.4235 ] adding BCH for tegra194-p2888-0001-p2822-0000.dtb.rec
[   1.3827 ] adding BCH for boot.img
[   1.4106 ] adding BCH for boot.img
[   2.1440 ] adding BCH for kernel_tegra194-p2888-0001-p2822-0000.dtb
[   2.9073 ] adding BCH for kernel_tegra194-p2888-0001-p2822-0000.dtb
[   2.9174 ] 
[   2.9201 ] tegrasign_v3.py --key /home/weitianyu/external/flashtool_tztek_geac_xavier_jp4.6.1_510g3.1_v2.5.5.1/flashtool/flashtool/Linux_for_Tegra/rsa_priv.pem --list images_list.xml --pubkeyhash pub_key.key
[   2.9211 ] Key size is 256 bytes
[   2.9512 ] Saving pkc public key in pub_key.key
[   3.6930 ] 
[   3.6930 ] Generating br-bct
[   3.6949 ] Performing cfg overlay
[   3.6949 ] ['tegra194-mb1-bct-memcfg-p2888.cfg', 'tegra194-memcfg-sw-override.cfg']
[   3.6951 ] sw_memcfg_overlay.pl -c tegra194-mb1-bct-memcfg-p2888.cfg -s tegra194-memcfg-sw-override.cfg -o /home/weitianyu/external/flashtool_tztek_geac_xavier_jp4.6.1_510g3.1_v2.5.5.1/flashtool/flashtool/Linux_for_Tegra/bootloader/181827/tmpdmb7kebr1.cfg
[   3.7264 ] 
[   3.7265 ] Updating dev and MSS params in BR BCT
[   3.7265 ] tegrabct_v2 --dev_param tegra194-br-bct-sdmmc.cfg --sdram /home/weitianyu/external/flashtool_tztek_geac_xavier_jp4.6.1_510g3.1_v2.5.5.1/flashtool/flashtool/Linux_for_Tegra/bootloader/181827/tmpdmb7kebr1.cfg --brbct br_bct.cfg --sfuse tegra194-mb1-soft-fuses-l4t.cfg --chip 0x19 0
[   3.7670 ] 
[   3.7671 ] Updating bl info
[   3.7694 ] tegrabct_v2 --brbct br_bct_BR.bct --chip 0x19 0 --updateblinfo flash.xml.bin
[   3.7715 ] .../home/weitianyu/external/flashtool_tztek_geac_xavier_jp4.6.1_510g3.1_v2.5.5.1/flashtool/flashtool/Linux_for_Tegra/sbk.key --list tegra194-a02-bpmp-p2888-a04_sigheader.dtb_list.xml
[   5.0878 ] Key is a SBK key
[   5.0878 ] Key Size is 16 bytes
[   5.0891 ] 742448
[   5.1117 ] tegrahost_v2 --chip 0x19 0 --updatesigheader tegra194-a02-bpmp-p2888-a04_sigheader.dtb.encrypt tegra194-a02-bpmp-p2888-a04_sigheader.dtb.hash zerosbk
[   5.1194 ] 
[   5.1223 ] tegrahost_v2 --chip 0x19 --align tegra194-a02-bpmp-p2888-a04_sigheader.dtb.encrypt
[   5.1236 ] 
[   5.1238 ] header_magic: 4e564441
[   5.1261 ] tegrasign_v3.py --key /home/weitianyu/external/flashtool_tztek_geac_xavier_jp4.6.1_510g3.1_v2.5.5.1/flashtool/flashtool/Linux_for_Tegra/rsa_priv.pem --list tegra194-a02-bpmp-p2888-a04_sigheader.dtb.encrypt_list.xml --pubkeyhash pub_key.key
[   5.1274 ] K[   5.1276 ] ey size is 256 bytes
[   5.1402 ] Saving pkc public key in pub_key.key
[   5.1416 ] tegrahost_v2 --chip 0x19 0 --updatesigheader tegra194-a02-bpmp-p2888-a04_sigheader.dtb.encrypt.signed tegra194-a02-bpmp-p2888-a04_sigheader.dtb.encrypt.sig oem-rsa --pubkeyhash pub_key.key
[   5.1499 ] 
[   5.1515 ] tegrahost_v2 --chip 0x19 --align xusb_sil_rel_fw_sigheader
[   5.1526 ] 
[   5.1526 ] header_magic: 4e564441
[   5.1548 ] tegrasign_v3.py --key /home/weitianyu/external/flashtool_tztek_geac_xavier_jp4.6.1_510g3.1_v2.5.5.1/flashtool/flashtool/Linux_for_Tegra/sbk.key --list xusb_sil_rel_fw_sigheader_list.xml
[   5.1550 ] Key is a SBK key
[   5.1550 ] Key Size is 16 bytes
[   5.1555 ] 129024
[   5.1630 ] tegrahost_v2 --chip 0x19 0 --updatesigheader xusb_sil_rel_fw_sigheader.encrypt xusb_sil_rel_fw_sigheader.hash zerosbk
[   5.1652 ] 
[   5.1660 ] tegrahost_v2 --chip 0x19 --align xusb_sil_rel_fw_sigheader.encrypt
[   5.1668 ] 
[   5.1669 ] header_magic: 4e564441
[   5.1689 ] tegrasign_v3.py --key /home/weitianyu/external/flashtool_tztek_geac_xavier_jp4.6.1_510g3.1_v2.5.5.1/flashtool/flashtool/Linux_for_Tegra/rsa_priv.pem --list xusb_sil_rel_fw_sigheader.encrypt_list.xml --pubkeyhash pub_key.key
[   5.1704 ] Key s[   5.1710 ] ize is 256 bytes
[   5.1843 ] Saving pkc public key in pub_key.key
[   5.1861 ] tegrahost_v2 --chip 0x19 0 --updatesigheader xusb_sil_rel_fw_sigheader.encrypt.signed xusb_sil_rel_fw_sigheader.encrypt.sig oem-rsa --pubkeyhash pub_key.key
[   5.1886 ] 
[   5.1910 ] tegrahost_v2 --chip 0x19 --align xusb_sil_rel_fw_sigheader
[   5.1916 ] 
[   5.1917 ] header_magic: 4e564441
[   5.1937 ] tegrasign_v3.py --key /home/weitianyu/external/flashtool_tztek_geac_xavier_jp4.6.1_510g3.1_v2.5.5.1/flashtool/flashtool/Linux_for_Tegra/sbk.key --list xusb_sil_rel_fw_sigheader_list.xml
[   5.1938 ] Key is a SBK key
[   5.1938 ] Key Size is 16 bytes
[   5.1942 ] 129024
[   5.2023 ] tegrahost_v2 --chip 0x19 0 --updatesigheader xusb_sil_rel_fw_sigheader.encrypt xusb_sil_rel_fw_sigheader.hash zerosbk
[   5.2049 ] 
[   5.2068 ] tegrahost_v2 --chip 0x19 --align xusb_sil_rel_fw_sigheader.encrypt
[   5.2074 ] 
[   5.2075 ] header_magic: 4e564441
[   5.2095 ] tegrasign_v3.py --key /home/weitianyu/external/flashtool_tztek_geac_xavier_jp4.6.1_510g3.1_v2.5.5.1/flashtool/flashtool/Linux_for_Tegra/rsa_priv.pem --list xusb_sil_rel_fw_sigheader.encrypt_list.xml --pubkeyhash pub_key.key
[   5.2110 ] Key[   5.2111 ]  size is 256 bytes
[   5.2226 ] Saving pkc public key in pub_key.key
[   5.2244 ] tegrahost_v2 --chip 0x19 0 --updatesigheader xusb_sil_rel_fw_sigheader.encrypt.signed xusb_sil_rel_fw_sigheader.encrypt.sig oem-rsa --pubkeyhash pub_key.key
[   5.2263 ] 
[   5.2282 ] tegrahost_v2 --chip 0x19 --align camera-rtcpu-rce_sigheader.img
[   5.2290 ] 
[   5.2291 ] header_magic: 4e564441
[   5.2313 ] tegrasign_v3.py --key /home/weitianyu/external/flashtool_tztek_geac_xavier_jp4.6.1_510g3.1_v2.5.5.1/flashtool/flashtool/Linux_for_Tegra/sbk.key --list camera-rtcpu-rce_sigheader.img_list.xml
[   5.2314 ] Key is a SBK key
[   5.2314 ] Key Size is 16 bytes
[   5.2319 ] 267808
[   5.2441 ] tegrahost_v2 --chip 0x19 0 --updatesigheader camera-rtcpu-rce_sigheader.img.encrypt camera-rtcpu-rce_sigheader.img.hash zerosbk
[   5.2473 ] 
[   5.2494 ] tegrahost_v2 --chip 0x19 --align camera-rtcpu-rce_sigheader.img.encrypt
[   5.2503 ] 
[   5.2505 ] header_magic: 4e564441
[   5.2530 ] tegrasign_v3.py --key /home/weitianyu/external/flashtool_tztek_geac_xavier_jp4.6.1_510g3.1_v2.5.5.1/flashtool/flashtool/Linux_for_Tegra/rsa_priv.pem --list camera-rtcpu-rce_sigheader.img.encrypt_list.xml --pubkeyhash pub_key.key
[   5.2552 ] K[   5.2556 ] ey size is 256 bytes
[   5.2688 ] Saving pkc public key in pub_key.key
[   5.2717 ] tegrahost_v2 --chip 0x19 0 --updatesigheader camera-rtcpu-rce_sigheader.img.encrypt.signed camera-rtcpu-rce_sigheader.img.encrypt.sig oem-rsa --pubkeyhash pub_key.key
[   5.2757 ] 
[   5.2777 ] tegrahost_v2 --chip 0x19 --align camera-rtcpu-rce_sigheader.img
[   5.2784 ] 
[   5.2785 ] header_magic: 4e564441
[   5.2807 ] tegrasign_v3.py --key /home/weitianyu/external/flashtool_tztek_geac_xavier_jp4.6.1_510g3.1_v2.5.5.1/flashtool/flashtool/Linux_for_Tegra/sbk.key --list camera-rtcpu-rce_sigheader.img_list.xml
[   5.2808 ] Key is a SBK key
[   5.2808 ] Key Size is 16 bytes
[   5.2815 ] 267808
[   5.2938 ] tegrahost_v2 --chip 0x19 0 --updatesigheader camera-rtcpu-rce_sigheader.img.encrypt camera-rtcpu-rce_sigheader.img.hash zerosbk
[   5.2969 ] 
[   5.2987 ] tegrahost_v2 --chip 0x19 --align camera-rtcpu-rce_sigheader.img.encrypt
[   5.2996 ] 
[   5.2996 ] header_magic: 4e564441
[   5.3016 ] tegrasign_v3.py --key /home/weitianyu/external/flashtool_tztek_geac_xavier_jp4.6.1_510g3.1_v2.5.5.1/flashtool/flashtool/Linux_for_Tegra/rsa_priv.pem --list camera-rtcpu-rce_sigheader.img.encrypt_list.xml --pubkeyhash pub_key.key
[   5.3028 ] Ke[   5.3031 ] y size is 256 bytes
[   5.3163 ] Saving pkc public key in pub_key.key
[   5.3181 ] tegrahost_v2 --chip 0x19 0 --updatesigheader camera-rtcpu-rce_sigheader.img.encrypt.signed camera-rtcpu-rce_sigheader.img.encrypt.sig oem-rsa --pubkeyhash pub_key.key
[   5.3215 ] 
[   5.3244 ] tegrahost_v2 --chip 0x19 --align adsp-fw_sigheader.bin
[   5.3251 ] 
[   5.3252 ] header_magic: 4e564441
[   5.3273 ] tegrasign_v3.py --key /home/weitianyu/external/flashtool_tztek_geac_xavier_jp4.6.1_510g3.1_v2.5.5.1/flashtool/flashtool/Linux_for_Tegra/sbk.key --list adsp-fw_sigheader.bin_list.xml
[   5.3274 ] Key is a SBK key
[   5.3274 ] Key Size is 16 bytes
[   5.3277 ] 77216
[   5.3350 ] tegrahost_v2 --chip 0x19 0 --updatesigheader adsp-fw_sigheader.bin.encrypt adsp-fw_sigheader.bin.hash zerosbk
[   5.3363 ] 
[   5.3383 ] tegrahost_v2 --chip 0x19 --align adsp-fw_sigheader.bin.encrypt
[   5.3390 ] 
[   5.3391 ] header_magic: 4e564441
[   5.3412 ] tegrasign_v3.py --key /home/weitianyu/external/flashtool_tztek_geac_xavier_jp4.6.1_510g3.1_v2.5.5.1/flashtool/flashtool/Linux_for_Tegra/rsa_priv.pem --list adsp-fw_sigheader.bin.encrypt_list.xml --pubkeyhash pub_key.key
[   5.3424 ] K[   5.3426 ] ey size is 256 bytes
[   5.3553 ] Saving pkc public key in pub_key.key
[   5.3574 ] tegrahost_v2 --chip 0x19 0 --updatesigheader adsp-fw_sigheader.bin.encrypt.signed adsp-fw_sigheader.bin.encrypt.sig oem-rsa --pubkeyhash pub_key.key
[   5.3590 ] 
[   5.3613 ] tegrahost_v2 --chip 0x19 --align adsp-fw_sigheader.bin
[   5.3619 ] 
[   5.3620 ] header_magic: 4e564441
[   5.3640 ] tegrasign_v3.py --key /home/weitianyu/external/flashtool_tztek_geac_xavier_jp4.6.1_510g3.1_v2.5.5.1/flashtool/flashtool/Linux_for_Tegra/sbk.key --list adsp-fw_sigheader.bin_list.xml
[   5.3642 ] Key is a SBK key
[   5.3642 ] Key Size is 16 bytes
[   5.3645 ] 77216
[   5.3733 ] tegrahost_v2 --chip 0x19 0 --updatesigheader adsp-fw_sigheader.bin.encrypt adsp-fw_sigheader.bin.hash zerosbk
[   5.3748 ] 
[   5.3765 ] tegrahost_v2 --chip 0x19 --align adsp-fw_sigheader.bin.encrypt
[   5.3772 ] 
[   5.3772 ] header_magic: 4e564441
[   5.3794 ] tegrasign_v3.py --key /home/weitianyu/external/flashtool_tztek_geac_xavier_jp4.6.1_510g3.1_v2.5.5.1/flashtool/flashtool/Linux_for_Tegra/rsa_priv.pem --list adsp-fw_sigheader.bin.encrypt_list.xml --pubkeyhash pub_key.key
[   5.3810 ] Key s[   5.3813 ] ize is 256 bytes
[   5.3948 ] Saving pkc public key in pub_key.key
[   5.3968 ] tegrahost_v2 --chip 0x19 0 --updatesigheader adsp-fw_sigheader.bin.encrypt.signed adsp-fw_sigheader.bin.encrypt.sig oem-rsa --pubkeyhash pub_key.key
[   5.3982 ] 
[   5.3995 ] tegrahost_v2 --chip 0x19 --align warmboot_t194_prod_sigheader.bin
[   5.4002 ] 
[   5.4003 ] header_magic: 4e564441
[   5.4023 ] tegrasign_v3.py --key /home/weitianyu/external/flashtool_tztek_geac_xavier_jp4.6.1_510g3.1_v2.5.5.1/flashtool/flashtool/Linux_for_Tegra/sbk.key --list warmboot_t194_prod_sigheader.bin_list.xml
[   5.4023 ] Key is a SBK key
[   5.4023 ] Key Size is 16 bytes
[   5.4026 ] 61408
[   5.4093 ] tegrahost_v2 --chip 0x19 0 --updatesigheader warmboot_t194_prod_sigheader.bin.encrypt warmboot_t194_prod_sigheader.bin.hash zerosbk
[   5.4105 ] 
[   5.4122 ] tegrahost_v2 --chip 0x19 --align warmboot_t194_prod_sigheader.bin.encrypt
[   5.4129 ] 
[   5.4129 ] header_magic: 4e564441
[   5.4151 ] tegrasign_v3.py --key /home/weitianyu/external/flashtool_tztek_geac_xavier_jp4.6.1_510g3.1_v2.5.5.1/flashtool/flashtool/Linux_for_Tegra/rsa_priv.pem --list warmboot_t194_prod_sigheader.bin.encrypt_list.xml --pubkeyhash pub_key.key
[   5.4169 ] Key [   5.4171 ] size is 256 bytes
[   5.4291 ] Saving pkc public key in pub_key.key
[   5.4309 ] tegrahost_v2 --chip 0x19 0 --updatesigheader warmboot_t194_prod_sigheader.bin.encrypt.signed warmboot_t194_prod_sigheader.bin.encrypt.sig oem-rsa --pubkeyhash pub_key.key
[   5.4328 ] 
[   5.4349 ] tegrahost_v2 --chip 0x19 --align warmboot_t194_prod_sigheader.bin
[   5.4357 ] 
[   5.4358 ] header_magic: 4e564441
[   5.4380 ] tegrasign_v3.py --key /home/weitianyu/external/flashtool_tztek_geac_xavier_jp4.6.1_510g3.1_v2.5.5.1/flashtool/flashtool/Linux_for_Tegra/sbk.key --list warmboot_t194_prod_sigheader.bin_list.xml
[   5.4381 ] Key is a SBK key
[   5.4381 ] Key Size is 16 bytes
[   5.4385 ] 61408
[   5.4443 ] tegrahost_v2 --chip 0x19 0 --updatesigheader warmboot_t194_prod_sigheader.bin.encrypt warmboot_t194_prod_sigheader.bin.hash zerosbk
[   5.4454 ] 
[   5.4461 ] tegrahost_v2 --chip 0x19 --align warmboot_t194_prod_sigheader.bin.encrypt
[   5.4466 ] 
[   5.4467 ] header_magic: 4e564441
[   5.4487 ] tegrasign_v3.py --key /home/weitianyu/external/flashtool_tztek_geac_xavier_jp4.6.1_510g3.1_v2.5.5.1/flashtool/flashtool/Linux_for_Tegra/rsa_priv.pem --list warmboot_t194_prod_sigheader.bin.encrypt_list.xml --pubkeyhash pub_key.key
[   5.4505 ] K[   5.4507 ] ey size is 256 bytes
[   5.4626 ] Saving pkc public key in pub_key.key
[   5.4645 ] tegrahost_v2 --chip 0x19 0 --updatesigheader warmboot_t194_prod_sigheader.bin.encrypt.signed warmboot_t194_prod_sigheader.bin.encrypt.sig oem-rsa --pubkeyhash pub_key.key
[   5.4662 ] 
[   5.4680 ] tegrahost_v2 --chip 0x19 --align recovery_sigheader.img
[   5.4685 ] 
[   5.4686 ] header_magic: 4e564441
[   5.4705 ] tegrasign_v3.py --key /home/weitianyu/external/flashtool_tztek_geac_xavier_jp4.6.1_510g3.1_v2.5.5.1/flashtool/flashtool/Linux_for_Tegra/sbk.key --list recovery_sigheader.img_list.xml
[   5.4706 ] Key is a SBK key
[   5.4706 ] Key Size is 16 bytes
[   5.5571 ] 58351616
[   6.7951 ] tegrahost_v2 --chip 0x19 0 --updatesigheader recovery_sigheader.img.encrypt recovery_sigheader.img.hash zerosbk
[   7.3628 ] 
[   7.3639 ] tegrahost_v2 --chip 0x19 --align recovery_sigheader.img.encrypt
[   7.3649 ] 
[   7.3651 ] header_magic: 4e564441
[   7.3733 ] tegrasign_v3.py --key /home/weitianyu/external/flashtool_tztek_geac_xavier_jp4.6.1_510g3.1_v2.5.5.1/flashtool/flashtool/Linux_for_Tegra/rsa_priv.pem --list recovery_sigheader.img.encrypt_list.xml --pubkeyhash pub_key.key
[   7.3749 ] K[   7.3754 ] ey size is 256 bytes
[   7.4450 ] Saving pkc public key in pub_key.key
[   7.4472 ] tegrahost_v2 --chip 0x19 0 --updatesigheader recovery_sigheader.img.encrypt.signed recovery_sigheader.img.encrypt.sig oem-rsa --pubkeyhash pub_key.key
[   7.9967 ] 
[   8.0272 ] tegrahost_v2 --chip 0x19 --align tegra194-p2888-0001-p2822-0000.dtb_sigheader.rec
[   8.0278 ] 
[   8.0282 ] header_magic: 4e564441
[   8.0303 ] tegrasign_v3.py --key /home/weitianyu/external/flashtool_tztek_geac_xavier_jp4.6.1_510g3.1_v2.5.5.1/flashtool/flashtool/Linux_for_Tegra/sbk.key --list tegra194-p2888-0001-p2822-0000.dtb_sigheader.rec_list.xml
[   8.0303 ] Key is a SBK key
[   8.0304 ] Key Size is 16 bytes
[   8.0313 ] 299088..
[ 1631.7388 ] 
[ 1631.7388 ] Flashing completed

[ 1631.7389 ] Coldbooting the device
[ 1631.7417 ] tegrarcm_v2 --ismb2
[ 1631.8543 ] 
[ 1631.8576 ] tegradevflash_v2 --reboot coldboot
[ 1631.8593 ] Bootloader version 01.00.0000
[ 1632.0708 ] 

And the debug_log

[0000.062] W> RATCHET: MB1 binary ratchet value 4 is too large than ratchet level 2 from HW fuses.
[0000.070] I> MB1 (prd-version: 1.5.1.9-t194-41334769-73a9b7ef)
[0000.075] I> Boot-mode: Coldboot
[0000.078] I> Chip revision : A02P
[0000.081] I> Bootrom patch version : 15 (correctly patched)
[0000.087] I> ATE fuse revision : 0x200
[0000.090] I> Ram repair fuse : 0x0
[0000.093] I> Ram Code : 0x2
[0000.096] I> rst_source : 0xb
[0000.098] I> rst_level : 0x1
[0000.102] I> Boot-device: eMMC
[0000.117] I> sdmmc DDR50 mode
[0000.121] W> No valid slot number is found in scratch register
[0000.127] W> Return default slot: _a
[0000.130] I> Active Boot chain : 0
[0000.133] I> Boot-device: eMMC
[0000.138] W> MB1_PLATFORM_CONFIG: device prod data is empty in MB1 BCT.
[0000.144] I> Temperature = 30500
[0000.147] W> Skipping boost for clk: BPMP_CPU_NIC
[0000.151] W> Skipping boost for clk: BPMP_APB
[0000.156] W> Skipping boost for clk: AXI_CBB
[0000.159] W> Skipping boost for clk: AON_CPU_NIC
[0000.164] W> Skipping boost for clk: CAN1
[0000.167] W> Skipping boost for clk: CAN2
[0000.172] I> Boot-device: eMMC
[0000.175] I> Boot-device: eMMC
[0000.184] I> Sdmmc: HS400 mode enabled
[0000.190] I> ECC region[0]: Start:0x0, End:0x0
[0000.194] I> ECC region[1]: Start:0x0, End:0x0
[0000.198] I> ECC region[2]: Start:0x0, End:0x0
[0000.202] I> ECC region[3]: Start:0x0, End:0x0
[0000.206] I> ECC region[4]: Start:0x0, End:0x0
[0000.210] I> Non-ECC region[0]: Start:0x80000000, End:0x100000000
[0000.216] I> Non-ECC region[1]: Start:0x0, End:0x0
[0000.221] I> Non-ECC region[2]: Start:0x0, End:0x0
[0000.225] I> Non-ECC region[3]: Start:0x0, End:0x0
[0000.229] I> Non-ECC region[4]: Start:0x0, End:0x0
[0000.235] E> FAILED: Thermal config
[0000.242] E> FAILED: MEMIO rail config
[0000.261] I> Boot-device: eMMC
[0000.272] I> sdmmc bdev is already initialized
[0000.370] I> MB1 done

����main enter
SPE VERSION #: R01.00.14 Created: Sep 19 2018 @ 11:03:21
HW Function test
Start Scheduler.
in late init
��
  [0000.378] I> Welcome to MB2(TBoot-BPMP) (version: 00.00.2018.32-mobile-6fc80c72)
[0000.379] I> DMA Heap @ [0x526fa000 - 0x52ffa000]
[0000.379] I> Default Heap @ [0xd486400 - 0xd48a400]
[0000.380] E> DEVICE_PROD: Invalid value data = 70020000, size = 0.
[0000.386] W> device prod register failed
[0000.390] I> gpio framework initialized
[0000.393] I> tegrabl_gpio_driver_register: register 'nvidia,tegra194-gpio' driver
[0000.401] I> tegrabl_gpio_driver_register: register 'nvidia,tegra194-gpio-aon' driver
[0000.409] I> No valid sdcard_params in mb1_bct
[0000.413] I> Boot-device: eMMC
[0000.416] I> Boot_device: SDMMC_BOOT instance: 3
[0000.425] I> sdmmc-3 params source = boot args
[0000.426] I> sdmmc bdev is already initialized
[0000.429] I> sdmmc-3 params source = boot args
[0000.463] I> Found 17 partitions in SDMMC_BOOT (instance 3)
[0000.479] I> Found 42 partitions in SDMMC_USER (instance 3)
[0000.480] W> No valid slot number is found in scratch register
[0000.480] W> Return default slot: _a
[0000.480] I> Active Boot chain : 0
[0000.487] I> parsing oem signed section of bpmp-fw header done
[0000.494] I> bpmp-fw binary init read from storage
[0000.497] I> RSA PSS signature check: OK
[0000.498] I> oem authentication of bpmp-fw header done
[0000.500] I> bpmp-fw binary done read from storage
[0000.501] I> bpmp-fw: Authentication init Done
[0000.507] I> parsing oem signed section of cpubl header done
[0000.514] I> cpubl binary init read from storage
[0000.519] I> bpmp-fw: Authentication Finalize Done
[0000.522] I> RSA PSS signature check: OK
[0000.522] I> oem authentication of cpubl header done
[0000.523] I> cpubl binary done read from storage
[0000.527] I> cpubl: Authentication init Done
[0000.537] I> parsing oem signed section of rce header done
[0000.544] I> rce binary init read from storage
[0000.545] I> Relocating BR-BCT
[0000.548] I> cpubl: Authentication Finalize Done
[0000.551] I> RSA PSS signature check: OK
[0000.552] I> oem authentication of rce header done
[0000.557] I> rce binary done read from storage
[0000.561] I> rce: Authentication init Done
[0000.571] I> parsing oem signed section of ape header done
[0000.578] I> ape binary init read from storage
[0000.580] I> rce: Authentication Finalize Done
[0000.583] I> RSA PSS signature check: OK
[0000.584] I> oem authentication of ape header done
[0000.587] I> ape binary done read from storage
[0000.591] I> ape: Authentication init Done
[0000.602] I> parsing oem signed section of tos header done
[0000.608] I> tos binary init read from storage
[0000.610] I> ape: Authentication Finalize Done
[0000.613] I> RSA PSS signature check: OK
[0000.614] I> oem authentication of tos header done
[0000.618] I> tos binary done read from storage
[0000.622] I> tos: Authentication init Done
[0000.632] I> parsing oem signed section of bpmp-fw-dtb header done
[0000.639] I> bpmp-fw-dtb binary init read from storage
[0000.642] I> tos: Authentication Finalize Done
[0000.646] I> RSA PSS signature check: OK
[0000.647] I> oem authentication of bpmp-fw-dtb header done
[0000.653] I> bpmp-fw-dtb binary done read from storage
[0000.655] I> bpmp-fw-dtb: Authentication init Done
[0000.666] I> parsing oem signed section of cpubl-dtb header done
[0000.673] I> cpubl-dtb binary init read from storage
[0000.677] I> bpmp-fw-dtb: Authentication Finalize Done
[0000.712] I> RSA PSS signature check: OK
[0000.713] I> oem authentication of cpubl-dtb header done
[0000.713] I> cpubl-dtb binary done read from storage
[0000.714] I> cpubl-dtb: Authentication init Done
[0000.721] I> parsing oem signed section of eks header done
[0000.727] I> eks binary init read from storage
[0000.730] I> cpubl-dtb: Authentication Finalize Done
[0000.733] I> RSA PSS signature check: OK
[0000.733] I> oem authentication of eks header done
[0000.734] I> eks binary done read from storage
[0000.734] I> eks: Authentication init Done
[0000.737] I> eks: Authentication Finalize Done
[0000.741] I> EKB detected (length: 0x410) @ VA:0x52700400
��NOTICE:  BL31: v1.3(release):b5eeb33f7
NOTICE:  BL31: Built : 08:55:29, Feb 19 2022
ipc-unittest-main: 1519: Welcome to IPC unittest!!!
ipc-unittest-main: 1531: waiting forever
ipc-unittest-srv: 329: Init unittest services!!!
hwkey-agent: 41: hwkey-agent is running!!
hwkey-agent: 347: key_mgnt_processing .......
hwkey-agent: 162: ekb_verification: EKB_CMAC verification is not match.
hwkey-agent: 400: key_mgnt_processing: failed (-7)
hwkey-agent: 45: main: Failed to verify or extract EKB (-7).
exit called, thread 0xffffffffea8a4d58, name trusty_app_2_92b92883-f96a-4177
luks-srv: 40: luks-srv is running!!
platform_bootstrap_epilog: trusty bootstrap complete
��

welcome to lk
calling constructors
initializing heap
creating bootstrap completion thread
top of bootstrap2()
initializing platform
bpmp: platform_init
tag is e73a758761f0c6d24a1e69a2ac6b5035
tag_show initialized
dt initialized
mail initialized
chipid initialized
fuse initialized
sku initialized
speedo initialized
ec_get_ec_list: found 45 ecs
ec initialized
ec_mrq initialized
vmon_populate_monitors: found 3 monitors
vmon initialized
adc initialized
fmon_populate_monitors: found 73 monitors
fmon initialized
fmon_mrq initialized
reset initialized
nvhs initialized
392 clocks registered
WARNING: pll_c4 has no dyn ramp
clk_mrq_init: mrq handler registered
clk initialized
nvlink initialized
io_dpd initialized
io_dpd initialized
thermal initialized
i2c5 controller initialized
initialized i2c mrq handling
i2c initialized
regulator initialized
avfs_clk_platform initialized
soctherm initialized
aotag initialized
powergate initialized
dvs initialized
pm initialized
pg_late initialized
strap initialized
tag initialized
emc initialized
clk_dt initialized
avfs_ccplex_platform initialized
tj_max: dt node not found
tj_init initialized
uphy_mrq_init: mrq handler registered
uphy_dt initialized
uphy initialized
safereg_init: period 80 ms
ec_late initialized
��
  ��mrq initialized
��[0001.242] I> Welcome to Cboot
��fmon_post initialized
��[0001.243] I> Cboot Version: t194-d2b81f73
[0001.243] I> CPU-BL Params @ 0xf2820000
[0001.243] I>  0) Base:0x00000000 Size:0x00000000
[0001.247] I>  1) Base:0xf1100000 Size:0x00100000
[0001.252] I>  2) Base:0xf2000000 Size:0x00200000
[0001.256] I>  3) Base:0xf1200000 Size:0x00200000
[0001.261] I>  4) Base:0xf1000000 Size:0x00100000
��clk_set_parent failed for clk i2c2, parent pll_aon (-22)
clk_set_parent failed for clk i2c8, parent pll_aon (-22)
clk_dt_late initialized
machine_check initialized
pm_post initialized
dbells initialized
avfs_clk_platform_post initialized
dmce initialized
cvc initialized
ccplex_avfs_hw_init: nafll_cluster0: not monitored
ccplex_avfs_hw_init: nafll_cluster1: not monitored
ccplex_avfs_hw_init: nafll_cluster2: not monitored
ccplex_avfs_hw_init: nafll_cluster3: not monitored
avfs_clk_mach_post initialized
regulator_post initialized
rm initialized
sc7_diag initialized
thermal_test initialized
serial_late initialized
clk_post initialized
clk_dt_post initialized
mc_reg initialized
pg_post initialized
dyn_modules initialized
sku_debugfs initialized
speedo_debugfs initialized
adc_debugfs initialized
clk_debugfs initialized
��[0001.265] I>  5) Base:0xf0f00000 Size:0x00100000
[0001.345] I>  6) Base:0xf3800000 Size:0x00400000
[0001.349] I>  7) Base:0xf1c00000 Size:0x00400000
[0001.353] I>  8) Base:0xf0e00000 Size:0x00100000
[0001.358] I>  9) Base:0xf0d00000 Size:0x00100000
[0001.362] I> 10) Base:0xf3000000 Size:0x00800000
[0001.367] I> 11) Base:0x40000000 Size:0x00040000
[0001.371] I> 12) Base:0xf0c00000 Size:0x00100000
[0001.376] I> 13) Base:0x40046000 Size:0x00002000
[0001.380] I> 14) Base:0x40048000 Size:0x00002000
[0001.385] I> 15) Base:0xac000000 Size:0x00004000
��emc_debugfs initialized
dvs_debugfs initialized
fmon_debugfs initialized
vmon_debugfs initialized
pg_debugfs initialized
profile_fs initialized
debugfs_cons initialized
mail_fs initialized
profile initialized
cvc_debugfs initialized
dmce_debugfs initialized
ec_debugfs initialized
rm_debugfs initialized
soctherm_debug initialized
gr_reader initialized
mods initialized
dt_fs initialized
debugfs_mrq initialized
debug_mrq initialized
debug_safereg initialized
initializing target
calling apps_init()
starting app shell
entering main console loop
] ��[0001.389] I> 16) Base:0x4004a000 Size:0x00002000
[0001.444] I> 17) Base:0xf0b00000 Size:0x00100000
[0001.448] I> 18) Base:0x4004c000 Size:0x00002000
[0001.453] I> 19) Base:0xf2200000 Size:0x00600000
[0001.457] I> 20) Base:0x4004e000 Size:0x00002000
[0001.462] I> 21) Base:0xf0ad0000 Size:0x0000c000
[0001.466] I> 22) Base:0x00000000 Size:0x00000000
[0001.471] I> 23) Base:0xf0ae0000 Size:0x00020000
[0001.475] I> 24) Base:0xf6000000 Size:0x02000000
[0001.480] I> 25) Base:0x40050000 Size:0x00002000
[0001.484] I> 26) Base:0x40040000 Size:0x00006000
[0001.489] I> 27) Base:0xf1800000 Size:0x00400000
[0001.493] I> 28) Base:0xf4c00000 Size:0x01400000
[0001.498] I> 29) Base:0xf1400000 Size:0x00400000
[0001.502] I> 30) Base:0x00000000 Size:0x00000000
[0001.506] I> 31) Base:0x00000000 Size:0x00000000
[0001.511] I> 32) Base:0xf8000000 Size:0x08000000
[0001.515] I> 33) Base:0x00000000 Size:0x00000000
[0001.520] I> 34) Base:0xf3c00000 Size:0x01000000
[0001.524] I> 35) Base:0xab000000 Size:0x01000000
[0001.529] I> 36) Base:0xa0000000 Size:0x0b000000
[0001.533] I> 37) Base:0xf2800000 Size:0x00800000
[0001.538] I> 38) Base:0x80000000 Size:0x20000000
[0001.542] I> 39) Base:0xb0000000 Size:0x08000000
[0001.547] I> 40) Base:0x00000000 Size:0x00000000
[0001.551] I> 41) Base:0x00000000 Size:0x00000000
[0001.556] I> 42) Base:0x00000000 Size:0x00000000
[0001.560] I> 43) Base:0x00000000 Size:0x00000000
[0001.564] I> 44) Base:0x00000000 Size:0x00000000
[0001.569] I> 45) Base:0x00000000 Size:0x00000000
[0001.573] GIC-SPI Target CPU: 0
[0001.576] Interrupts Init done
[0001.579] calling constructors
[0001.582] initializing heap
[0001.585] I> Heap: [0xa069ab80 ... 0xab000000]
[0001.589] initializing threads
[0001.592] initializing timers
[0001.595] creating bootstrap completion thread
[0001.599] top of bootstrap2()
[0001.602] CPU: MIDR: 0x4E0F0040, MPIDR: 0x80000000
[0001.606] initializing platform
[0001.609] E> DEVICE_PROD: Invalid value data = 0, size = 0.
[0001.615] W> device prod register failed
[0001.619] I> Bl_dtb @0xaaf00000
[0001.625] W> "plugin-manager" doesn't exist, creating
[0001.627] W> "ids" doesn't exist, creating
[0001.631] W> "connection" doesn't exist, creating
[0001.635] W> "configs" doesn't exist, creating
[0001.649] E> failed to read label property for node 233684: 13
[0001.652] E> failed to read reg property for node 233772: 13
[0001.654] E> failed to read label property for node 233824: 13
[0001.658] E> failed to read label property for node 233892: 13
[0001.663] E> failed to read label property for node 233928: 13
[0001.669] E> failed to read label property for node 233964: 13
[0001.675] E> failed to read reg property for node 234032: 13
[0001.680] E> failed to read label property for node 234084: 13
[0001.688] I> Find /i2c@3160000's alias i2c0
[0001.688] I> Reading eeprom i2c=0 address=0x50
[0001.718] I> Device at /i2c@3160000:0x50
[0001.718] I> Reading eeprom i2c=0 address=0x56
[0001.719] E> I2C: slave not found in slaves.
[0001.719] E> I2C: Could not write 0 bytes to slave: 0x00ac with repeat start true.
[0001.720] E> I2C_DEV: Failed to send register address 0x00000000.
[0001.721] E> I2C_DEV: Could not read 256 registers of size 1 from slave 0xac at 0x00000000 via instance 0.
[0001.728] E> eeprom: Failed to read I2C slave device
[0001.733] I> Eeprom read failed 0x3526070d
[0001.739] I> Find /i2c@3180000's alias i2c2
[0001.741] I> Reading eeprom i2c=2 address=0x54
[0001.746] E> I2C: slave not found in slaves.
[0001.749] E> I2C: Could not write 0 bytes to slave: 0x00a8 with repeat start true.
[0001.757] E> I2C_DEV: Failed to send register address 0x00000000.
[0001.763] E> I2C_DEV: Could not read 256 registers of size 1 from slave 0xa8 at 0x00000000 via instance 2.
[0001.772] E> eeprom: Failed to read I2C slave device
[0001.777] I> Eeprom read failed 0x3526070d
[0001.781] I> Reading eeprom i2c=2 address=0x57
[0001.785] E> I2C: slave not found in slaves.
[0001.789] E> I2C: Could not write 0 bytes to slave: 0x00ae with repeat start true.
[0001.797] E> I2C_DEV: Failed to send register address 0x00000000.
[0001.803] E> I2C_DEV: Could not read 256 registers of size 1 from slave 0xae at 0x00000000 via instance 2.
[0001.812] E> eeprom: Failed to read I2C slave device
[0001.817] I> Eeprom read failed 0x3526070d
[0001.821] I> Reading eeprom i2c=2 address=0x52
[0001.825] E> I2C: slave not found in slaves.
[0001.829] E> I2C: Could not write 0 bytes to slave: 0x00a4 with repeat start true.
[0001.837] E> I2C_DEV: Failed to send register address 0x00000000.
[0001.843] E> I2C_DEV: Could not read 256 registers of size 1 from slave 0xa4 at 0x00000000 via instance 2.
[0001.852] E> eeprom: Failed to read I2C slave device
[0001.857] I> Eeprom read failed 0x3526070d
[0001.863] I> Find /i2c@c240000's alias i2c1
[0001.865] I> Reading eeprom i2c=1 address=0x52
[0001.871] E> I2C: slave not found in slaves.
[0001.874] E> I2C: Could not write 0 bytes to slave: 0x00a4 with repeat start true.
[0001.881] E> I2C_DEV: Failed to send register address 0x00000000.
[0001.887] E> I2C_DEV: Could not read 256 registers of size 1 from slave 0xa4 at 0x00000000 via instance 1.
[0001.896] E> eeprom: Retry to read I2C slave device.
[0001.901] E> I2C: slave not found in slaves.
[0001.905] E> I2C: Could not write 0 bytes to slave: 0x00a4 with repeat start true.
[0001.913] E> I2C_DEV: Failed to send register address 0x00000000.
[0001.919] E> I2C_DEV: Could not read 256 registers of size 1 from slave 0xa4 at 0x00000000 via instance 1.
[0001.928] E> eeprom: Failed to read I2C slave device
[0001.933] I> Eeprom read failed 0x3526070d
[0001.937] I> Reading eeprom i2c=1 address=0x50
[0001.941] E> I2C: slave not found in slaves.
[0001.945] E> I2C: Could not write 0 bytes to slave: 0x00a0 with repeat start true.
[0001.953] E> I2C_DEV: Failed to send register address 0x00000000.
[0001.959] E> I2C_DEV: Could not read 256 registers of size 1 from slave 0xa0 at 0x00000000 via instance 1.
[0001.968] E> eeprom: Retry to read I2C slave device.
[0001.973] E> I2C: slave not found in slaves.
[0001.977] E> I2C: Could not write 0 bytes to slave: 0x00a0 with repeat start true.
[0001.985] E> I2C_DEV: Failed to send register address 0x00000000.
[0001.991] E> I2C_DEV: Could not read 256 registers of size 1 from slave 0xa0 at 0x00000000 via instance 1.
[0002.000] E> eeprom: Failed to read I2C slave device
[0002.005] I> Eeprom read failed 0x3526070d
[0002.009] I> create_pm_ids: id: 2888-0004-400-L, len: 15
[0002.014] I> config: mem-type:00,power-config:00,misc-config:00,modem-config:00,touch-config:00,display-config:00,, len: 93
[0002.025] I> Adding plugin-manager/ids/2888-0004-400=/i2c@3160000:module@0x50
[0002.033] W> "i2c@3160000" doesn't exist, creating
[0002.037] W> "module@0x50" doesn't exist, creating
[0002.043] I> Adding plugin-manager/cvm
[0002.045] W> "chip-id" doesn't exist, creating
[0002.049] I> Adding plugin-manager/chip-id/A02P
[0002.054] I> Plugin-manager override starting
[0002.059] W> Failed to find /plugin-manager in DT
[0002.062] I> gpio framework initialized
[0002.069] I> tegrabl_gpio_driver_register: register 'nvidia,tegra194-gpio' driver
[0002.076] I> tegrabl_gpio_driver_register: register 'nvidia,tegra194-gpio-aon' driver
[0002.081] I> tegrabl_tca9539_init: i2c bus: 1, slave addr: 0x46
[0002.089] W> fetch_driver_phandle_from_dt: failed to get node with compatible ti,tca9539
[0002.097] W> fetch_driver_phandle_from_dt: failed to get node with compatible nxp,tca9539
[0002.103] W> tegrabl_tca9539_init: failed to fetch phandle from dt
[0002.109] I> tegrabl_tca9539_init: i2c bus: 1, slave addr: 0x44
[0002.117] W> fetch_driver_phandle_from_dt: failed to get node with compatible ti,tca9539
[0002.125] W> fetch_driver_phandle_from_dt: failed to get node with compatible nxp,tca9539
[0002.131] W> tegrabl_tca9539_init: failed to fetch phandle from dt
[0002.139] I> fixed regulator driver initialized
[0002.152] I> register 'maxim' power off handle
[0002.153] I> virtual i2c enabled
[0002.153] I> registered 'maxim,max20024' pmic
[0002.154] I> tegrabl_gpio_driver_register: register 'max20024-gpio' driver
[0002.159] I> Boot-device: eMMC
[0002.162] I> Boot_device: SDMMC_BOOT instance: 3
[0002.171] I> sdmmc-3 params source = boot args
[0002.171] I> create_pm_ids: id: 2888-0004-400-L, len: 15
[0002.176] I> config: mem-type:00,power-config:00,misc-config:00,modem-config:00,touch-config:00,display-config:00,, len: 93
[0002.187] I> sdmmc bdev is already initialized
[0002.192] I> sdmmc-3 params source = boot args
[0002.222] I> Found 17 partitions in SDMMC_BOOT (instance 3)
[0002.235] I> Found 42 partitions in SDMMC_USER (instance 3)
[0002.251] I> enabling 'vdd-hdmi-5v0' regulator
[0002.257] I> regulator 'vdd-hdmi-5v0' already enabled
[0002.257] I> hdmi cable connected
[0002.261] W> set volts not configured for 'vdd-1v0'
[0002.265] W> set volts not configured for 'vdd-1v8-hs'
[0002.265] I> retrieved tmds range from prod_list_hdmi_soc
[0002.267] E> cannot find any other nvdisp nodes
[0002.282] I> edid read success
[0002.295] I> edid read success
[0002.295] I> width = 640, height = 480, frequency = 25174825
[0002.295] I> width = 1920, height = 1080, frequency = 148500000
[0002.296] I> width = 1920, height = 1080, frequency = 148500000
[0002.296] I> width = 1920, height = 1080, frequency = 148351648
[0002.297] I> width = 1920, height = 1080, frequency = 148351648
[0002.301] I> width = 1280, height = 720, frequency = 74175824
[0002.307] I> width = 1280, height = 720, frequency = 74175824
[0002.312] I> width = 720, height = 480, frequency = 26973026
[0002.318] I> width = 720, height = 480, frequency = 26973026
[0002.323] I> width = 720, height = 576, frequency = 26973026
[0002.329] I> width = 720, height = 576, frequency = 26973026
[0002.334] I> Best mode Width = 1920, Height = 1080, freq = 148351648
[0002.344] I> hdmi_enable, starting HDMI initialisation
[0002.350] I> hdmi_enable, HDMI initialisation complete
[0002.359] I> Load in CBoot Boot Options partition and parse it
[0002.365] E> Error -9 when finding node with path /boot-configuration
[0002.366] E> tegrabl_cbo_parse_info: "boot-configuration" not found in CBO file.
[0002.370] I> Using default boot order
[0002.373] I> boot-dev-order :-
[0002.376] I> 1.sd
[0002.378] I> 2.usb
[0002.380] I> 3.nvme
[0002.382] I> 4.emmc
[0002.384] I> 5.net
[0002.385] I> Hit any key to stop autoboot:     4       3       2       1
[0004.393] initializing target
[0004.393] calling apps_init()
[0004.394] starting app kernel_boot_app
[0004.413] I> found decompressor handler: lz4-legacy
[0004.414] I> decompressing BMP blob ...
[0004.426] I> Kernel type = Normal
[0004.426] I> ########## SD (0) boot ##########
[0004.426] I> No sdcard
[0004.427] I> sdcard-0 params source = DT-BL
[0004.427] E> Blockdev open: exit error
[0004.427] E> SD boot failed, err: 724238353
[0004.428] I> ########## USB (0) boot ##########
[0004.433] W> No valid slot number is found in scratch register
[0004.433] W> Return default slot: _a
[0004.441] I> Validate XUSB-FW ...
[0004.442] I> T19x: Authenticate XUSB-FW (bin_type: 11), max size 0x28000
[0004.446] I> RSA PSS signature check: OK
[0004.450] W> keyslot 14 is zero
[0004.452] I> USB Firmware Version: 60.09 release
[0004.513] I> regulator of usb2-0 already enabled
[0004.521] I> regulator of usb2-1 already enabled
[0004.530] I> regulator of usb2-2 already enabled
[0004.539] I> regulator of usb2-3 already enabled
[0004.543] E> GPIO missing. Cannot disable regulator vdd-5v-sata
[0004.546] I> regulator 'vdd-5v-sata' already enabled
[0005.609] I> USB 2.0 port 2 new low-speed USB device detected
[0005.610] W> Change usb2 root port id to 3
[0005.610] W> Change usb2 root port id to 4
[0005.611] W> Change usb2 root port id to 2
[0005.612] W> WARNING: event and command not matching, cmd_trb_ptr = 0xa4ad3000, cmd_ring.dma = 0xa4ad30c0
[0005.713] I> Start to enumerate device
[0005.714] W> handle_command_completion_event: WARNING: Command was not successfully completed (0x11)
[0008.723] W> xusbh_wait_irq: Timed out! status = 0x00
[0011.732] W> xusbh_wait_irq: Timed out! status = 0x00
[0011.732] E> Failed to enumerate USB device
[0011.732] E> failed to start xhci controller
[0011.733] E> Error in init of XUSB host driver, err: 7979000c
[0011.733] W> Failed to initialize device 5-0
[0011.733] E> USB boot failed, err: 2037973004
[0011.734] I> ########## NVME (0) boot ##########
[0011.738] I> Initializing nvme device instance 0
[0011.742] I> Initializing nvme controller
[0011.747] I> tegrabl_locate_pcie_ctrl_in_dt: found match at 0x14180000
[0011.753] I> vpcie3v3-supply not found
[0011.756] I> vpcie12v-supply not found
[0011.760] W> Failed to get nvidia,plat-gpios
[0011.764] I> tegrabl_pcie_soc_preinit: (0):
[0011.768] I> Unpowergate
[0011.771] I> tegrabl_car_clk_disable(0) ...
[0011.774] I> tegrabl_car_rst_set(CORE, 0) ...
[0011.779] I> tegrabl_car_rst_set(APB, 0) ...
[0011.783] I> tegrabl_car_clk_enable(0) ...
[0011.787] I> tegrabl_car_rst_clear(APB, 0) ...
[0011.791] I> tegrabl_set_ctrl_state(0)
[0011.795] I> CLR PCIE_APB:6
[0011.797] I> tegrabl_pcie_soc_init: (0):
[0011.801] I> APPL initialization ...
[0011.804] I> poweron phys
[0011.807] I> tegrabl_locate_pcie_ctrl_in_dt: found match at 0x14180000
[0011.814] I> tegrabl_power_on_phy: power on phy @0x3e30000
[0011.819] I> tegrabl_power_on_phy: power on phy @0x3e40000
[0011.824] I> tegrabl_power_on_phy: power on phy @0x3e50000
[0011.830] I> tegrabl_power_on_phy: power on phy @0x3e60000
[0012.935] C> Failed to link up controller-0
[0012.935] I> PCIe (0) Link is not UP
[0012.936] W> Failed tegrabl_pcie_soc_init(), error=0x12
[0012.936] I> Failed to initialize SoC Host PCIe controller
[0012.936] E> tegrabl_nvme_init: Failed tegrabl_pcie_init(0); error=0x12
[0012.937] W> tegrabl_nvme_bdev_open: Failed NVME INIT; error=0x80800612
[0012.940] W> Failed to open NVME-0, err = 80800612
[0012.945] W> Failed to initialize device 10-0
[0012.949] E> NVME (0) boot failed, err: 0x80800612
[0012.954] I> ########## NVME (1) boot ##########
[0012.958] I> Initializing nvme device instance 1
[0012.963] I> Initializing nvme controller
[0012.968] I> tegrabl_locate_pcie_ctrl_in_dt: found match at 0x14100000
[0012.973] I> vpcie3v3-supply not found
[0012.977] I> vpcie12v-supply not found
[0012.980] W> Failed to get nvidia,plat-gpios
[0012.984] I> tegrabl_pcie_soc_preinit: (1):
[0012.988] I> Unpowergate
[0012.991] I> tegrabl_car_clk_disable(1) ...
[0012.995] I> tegrabl_car_rst_set(CORE, 1) ...
[0012.999] I> tegrabl_car_rst_set(APB, 1) ...
[0013.003] I> tegrabl_car_clk_enable(1) ...
[0013.007] I> tegrabl_car_rst_clear(APB, 1) ...
[0013.011] I> tegrabl_set_ctrl_state(1)
[0013.015] I> CLR PCIE_APB:6
[0013.018] I> tegrabl_pcie_soc_init: (1):
[0013.021] I> APPL initialization ...
[0013.025] I> poweron phys
[0013.028] I> tegrabl_locate_pcie_ctrl_in_dt: found match at 0x14100000
[0013.034] I> tegrabl_power_on_phy: power on phy @0x3e10000
[0013.165] I> PCIe controller-1 link is up
[0013.166] I> tegra_pcie_info[1].cfg0_base = 0x30000000
[0013.166] I> tegra_pcie_info[1].cfg1_base = 0x30020000
[0013.166] I> tegra_pcie_info[1].atu_dma_base = 0x30040000
[0013.167] I> tegra_pcie_bus[1].mem = 0x30200000
[0013.167] I> Scanning busnr: 0 devfn: 0
[0013.167] I> PCIe IDs: 0x1ad210de
[0013.171] I> PCIe RID_CC: 0x60400a1
[0013.174] I> Scanning busnr: 1 devfn: 0
[0013.178] I> PCIe IDs: 0x15218086
[0013.181] I> PCIe RID_CC: 0x2000001
[0013.184] I> PCI Config: I/O=0x30100000, Memory=0x30200000
[0013.189] I> MEM bar_num=0 bar=0x30200000
[0013.193] I> IO bar_num=2 bar=0x30100000
[0013.197] I> MEM bar_num=3 bar=0x30220000
[0013.201] I> Number of PCIe devices detected: 2
[0013.205] E> tegrabl_nvme_init: Failed tegrabl_pcie_get_dev(1); error=0x0
[0013.212] I> PCIe (1) link is UP
[0013.225] W> tegrabl_nvme_bdev_open: Failed NVME INIT; error=0x80800612
[0013.226] W> Failed to open NVME-1, err = 80800612
[0013.226] W> Failed to initialize device 10-1
[0013.230] E> NVME (1) boot failed, err: 0x80800612
[0013.235] I> ########## NVME (2) boot ##########
[0013.239] I> Initializing nvme device instance 2
[0013.244] I> Initializing nvme controller
[0013.249] I> tegrabl_locate_pcie_ctrl_in_dt: found match at 0x14120000
[0013.254] I> vpcie3v3-supply not found
[0013.258] I> vpcie12v-supply not found
[0013.261] W> Failed to get nvidia,plat-gpios
[0013.265] I> tegrabl_pcie_soc_preinit: (2):
[0013.269] I> Unpowergate
[0013.272] I> tegrabl_car_clk_disable(2) ...
[0013.276] I> tegrabl_car_rst_set(CORE, 2) ...
[0013.280] I> tegrabl_car_rst_set(APB, 2) ...
[0013.284] I> tegrabl_car_clk_enable(2) ...
[0013.288] I> tegrabl_car_rst_clear(APB, 2) ...
[0013.292] I> tegrabl_set_ctrl_state(2)
[0013.296] I> CLR PCIE_APB:6
[0013.299] I> tegrabl_pcie_soc_init: (2):
[0013.302] I> APPL initialization ...
[0013.306] I> poweron phys
[0013.310] I> tegrabl_locate_pcie_ctrl_in_dt: found match at 0x14120000
[0013.314] I> tegrabl_power_on_phy: controller 2 not available
[0013.320] E> Failed to power on phy on controller-2
[0013.325] I> PCIe (2) Link is not UP
[0013.329] W> Failed tegrabl_pcie_soc_init(), error=0x1
[0013.333] I> Failed to initialize SoC Host PCIe controller
[0013.339] E> tegrabl_nvme_init: Failed tegrabl_pcie_init(2); error=0x1
[0013.345] W> tegrabl_nvme_bdev_open: Failed NVME INIT; error=0x80800601
[0013.351] W> Failed to open NVME-2, err = 80800601
[0013.356] W> Failed to initialize device 10-2
[0013.360] E> NVME (2) boot failed, err: 0x80800601
[0013.365] I> ########## NVME (3) boot ##########
[0013.369] I> Initializing nvme device instance 3
[0013.374] I> Initializing nvme controller
[0013.380] I> tegrabl_locate_pcie_ctrl_in_dt: found match at 0x14140000
[0013.384] I> vpcie3v3-supply not found
[0013.388] I> vpcie12v-supply not found
[0013.391] W> Failed to get nvidia,plat-gpios
[0013.395] I> tegrabl_pcie_soc_preinit: (3):
[0013.399] I> Unpowergate
[0013.402] I> tegrabl_car_clk_disable(3) ...
[0013.406] I> tegrabl_car_rst_set(CORE, 3) ...
[0013.410] I> tegrabl_car_rst_set(APB, 3) ...
[0013.414] I> tegrabl_car_clk_enable(3) ...
[0013.418] I> tegrabl_car_rst_clear(APB, 3) ...
[0013.422] I> tegrabl_set_ctrl_state(3)
[0013.426] I> CLR PCIE_APB:6
[0013.429] I> tegrabl_pcie_soc_init: (3):
[0013.432] I> APPL initialization ...
[0013.436] I> poweron phys
[0013.440] I> tegrabl_locate_pcie_ctrl_in_dt: found match at 0x14140000
[0013.445] I> tegrabl_power_on_phy: power on phy @0x3e80000
[0013.563] I> PCIe controller-3 link is up
[0013.564] I> tegra_pcie_info[3].cfg0_base = 0x34000000
[0013.564] I> tegra_pcie_info[3].cfg1_base = 0x34020000
[0013.564] I> tegra_pcie_info[3].atu_dma_base = 0x34040000
[0013.565] I> tegra_pcie_bus[3].mem = 0x34200000
[0013.565] I> Scanning busnr: 0 devfn: 0
[0013.566] I> PCIe IDs: 0x1ad210de
[0013.569] I> PCIe RID_CC: 0x60400a1
[0013.572] I> Scanning busnr: 1 devfn: 0
[0013.576] I> PCIe IDs: 0x42328086
[0013.579] I> PCIe RID_CC: 0x2800000
[0013.582] I> PCI Config: I/O=0x34100000, Memory=0x34200000
[0013.587] I> MEM64 bar_num=0 bar=0x34200000
[0013.592] I> Number of PCIe devices detected: 2
[0013.596] E> tegrabl_nvme_init: Failed tegrabl_pcie_get_dev(3); error=0x0
[0013.602] I> PCIe (3) link is UP
[0013.616] W> tegrabl_nvme_bdev_open: Failed NVME INIT; error=0x80800612
[0013.616] W> Failed to open NVME-3, err = 80800612
[0013.617] W> Failed to initialize device 10-3
[0013.621] E> NVME (3) boot failed, err: 0x80800612
[0013.625] I> ########## NVME (4) boot ##########
[0013.630] I> Initializing nvme device instance 4
[0013.634] I> Initializing nvme controller
[0013.641] I> tegrabl_locate_pcie_ctrl_in_dt: found match at 0x14160000
[0013.645] I> vpcie3v3-supply not found
[0013.648] I> vpcie12v-supply not found
[0013.652] W> Failed to get nvidia,plat-gpios
[0013.656] I> tegrabl_pcie_soc_preinit: (4):
[0013.660] I> Unpowergate
[0013.663] I> tegrabl_car_clk_disable(4) ...
[0013.666] I> tegrabl_car_rst_set(CORE, 4) ...
[0013.671] I> tegrabl_car_rst_set(APB, 4) ...
[0013.675] I> tegrabl_car_clk_enable(4) ...
[0013.679] I> tegrabl_car_rst_clear(APB, 4) ...
[0013.683] I> tegrabl_set_ctrl_state(4)
[0013.687] I> CLR PCIE_APB:6
[0013.689] I> tegrabl_pcie_soc_init: (4):
[0013.693] I> APPL initialization ...
[0013.696] I> poweron phys
[0013.701] I> tegrabl_locate_pcie_ctrl_in_dt: found match at 0x14160000
[0013.706] I> tegrabl_power_on_phy: power on phy @0x3e90000
[0013.711] I> tegrabl_power_on_phy: power on phy @0x3ea0000
[0013.846] I> PCIe controller-4 link is up
[0013.846] I> tegra_pcie_info[4].cfg0_base = 0x36000000
[0013.846] I> tegra_pcie_info[4].cfg1_base = 0x36020000
[0013.847] I> tegra_pcie_info[4].atu_dma_base = 0x36040000
[0013.847] I> tegra_pcie_bus[4].mem = 0x36200000
[0013.848] I> Scanning busnr: 0 devfn: 0
[0013.848] I> PCIe IDs: 0x1ad110de
[0013.851] I> PCIe RID_CC: 0x60400a1
[0013.854] I> Scanning busnr: 1 devfn: 0
[0013.858] I> PCIe IDs: 0x22632646
[0013.861] I> PCIe RID_CC: 0x1080203
[0013.864] I> PCI Config: I/O=0x36100000, Memory=0x36200000
[0013.870] I> MEM64 bar_num=0 bar=0x36200000
[0013.874] I> Number of PCIe devices detected: 2
[0013.878] I> NVME page size: 4096
[0013.882] I> NVMe serial number: 50026B768466E8E2    
[0013.886] I> NVMe model number: KINGSTON SA2000M8500G                   
[0013.893] I> NVMe firmware revision: S5Z42105
[0013.897] I> block_count: 976773168
[0013.900] I> supported_lba: 0
[0013.903] I> block_size_log2: 0x9
[0013.906] I> tegrabl_create_io_queue_cmd: queue size: 2
[0013.911] I> tegrabl_create_io_queue_cmd: queue size: 2
[0013.916] I> nvme device id 000a0004
[0013.920] I> nvme-4 params source = 
[0013.924] W> Cannot find any partition table for 000a0004
[0013.929] I> Detect filesystem
[0013.931] I> fs_detect:173: Unsupported or no filesystem present
[0013.937] I> Loading kernel-bootctrl from partition
[0013.942] I> Loading partition kernel-bootctrl at 0xa4b30000 from device(0x1)
[0013.955] W> tegrabl_get_kernel_bootctrl: magic number(0x00000000) is invalid
[0013.956] W> tegrabl_get_kernel_bootctrl: use default dummy boot control data
[0013.969] I> removable_boot_load_kernel_and_dtb: force NVME bdev to close !!!
[0013.970] I> PCIe (4) link is UP
[0013.984] E> NVME (4) boot failed, err: 0x2b2b000d
[0013.984] I> ########## NVME (5) boot ##########
[0013.984] I> Initializing nvme device instance 5
[0013.987] I> Initializing nvme controller
[0013.993] I> tegrabl_locate_pcie_ctrl_in_dt: found match at 0x141a0000
[0013.997] I> i=0, reg_phandle=0x20
[0014.003] I> reg_voltage=3300000
[0014.003] I> tegrabl_pcie_enable_regulators: regulator_set_voltage(0x20, 3300000)
[0014.016] I> enabling 'vdd-3v3-pcie' regulator
[0014.017] I> i=1, reg_phandle=0x21
[0014.021] I> reg_voltage=1200000
[0014.021] I> tegrabl_pcie_enable_regulators: regulator_set_voltage(0x21, 1200000)
[0014.034] I> regulator 'vdd-12v-pcie' already enabled
[0014.035] I> tegrabl_pcie_soc_preinit: (5):
[0014.037] I> Unpowergate
[0014.040] I> tegrabl_car_clk_disable(5) ...
[0014.044] I> tegrabl_car_rst_set(CORE, 5) ...
[0014.048] I> tegrabl_car_rst_set(APB, 5) ...
[0014.052] I> tegrabl_car_clk_enable(5) ...
[0014.056] I> tegrabl_car_rst_clear(APB, 5) ...
[0014.060] I> tegrabl_set_ctrl_state(5)
[0014.064] I> CLR PCIE_APB:6
[0014.067] I> tegrabl_pcie_soc_init: (5):
[0014.070] I> APPL initialization ...
[0014.074] I> poweron phys
[0014.079] I> tegrabl_locate_pcie_ctrl_in_dt: found match at 0x141a0000
[0014.083] I> tegrabl_power_on_phy: power on phy @0x3eb0000
[0014.089] I> tegrabl_power_on_phy: power on phy @0x3ec0000
[0014.094] I> tegrabl_power_on_phy: power on phy @0x3ed0000
[0014.099] I> tegrabl_power_on_phy: power on phy @0x3ee0000
[0014.105] I> tegrabl_power_on_phy: power on phy @0x3ef0000
[0014.110] I> tegrabl_power_on_phy: power on phy @0x3f00000
[0014.115] I> tegrabl_power_on_phy: power on phy @0x3f10000
[0014.121] I> tegrabl_power_on_phy: power on phy @0x3f20000
[0015.225] C> Failed to link up controller-5
[0015.226] I> PCIe (5) Link is not UP
[0015.226] I> tegrabl_pcie_disable_regulators: disable regulator 0x20
[0015.230] I> disabling 'vdd-3v3-pcie' regulator
[0015.230] I> tegrabl_pcie_disable_regulators: disable regulator 0x21
[0015.233] E> GPIO missing. Cannot disable regulator vdd-12v-pcie
[0015.234] W> Failed tegrabl_pcie_soc_init(), error=0x12
[0015.235] I> Failed to initialize SoC Host PCIe controller
[0015.241] E> tegrabl_nvme_init: Failed tegrabl_pcie_init(5); error=0x12
[0015.247] W> tegrabl_nvme_bdev_open: Failed NVME INIT; error=0x80800612
[0015.254] W> Failed to open NVME-5, err = 80800612
[0015.258] W> Failed to initialize device 10-5
[0015.263] E> NVME (5) boot failed, err: 0x80800612
[0015.267] I> ########## Fixed storage boot ##########
[0015.272] I> Loading kernel-bootctrl from partition
[0015.277] I> Loading partition kernel-bootctrl at 0xa4b30000 from device(0x1)
[0015.292] W> tegrabl_get_kernel_bootctrl: magic number(0x00000000) is invalid
[0015.292] W> tegrabl_get_kernel_bootctrl: use default dummy boot control data
[0015.298] I> Already published: 00010003
[0015.302] I> Look for boot partition
[0015.305] I> Fallback: assuming 0th partition is boot partition
[0015.311] I> Detect filesystem
[0015.338] I> Loading extlinux.conf ...
[0015.338] I> Loading extlinux.conf binary from rootfs ...
[0015.339] I> rootfs path: /sdmmc_user/boot/extlinux/extlinux.conf
[0015.369] I> Loading extlinux.conf sig file from rootfs ...
[0015.370] I> rootfs path: /sdmmc_user/boot/extlinux/extlinux.conf.sig
[0015.394] I> overload load_size to 848 (from 850)
[0015.395] I> Validate extlinux.conf ...
[0015.395] I> T19x: Authenticate extlinux.conf (bin_type: 54), max size 0x2000
[0015.396] C> pcp hash validation failed!!!
[0015.396] C> OEM authentication of extlinux.conf header failed!
[0015.396] W> Failed to validate extlinux.conf binary from rootfs (err=353697816, fail=0)
[0015.402] E> Security fuse is burned, abort loading binary from rootfs
[0015.409] E> Failed to find/load /boot/extlinux/extlinux.conf
[0015.414] I> Loading kernel ...
[0015.417] I> No kernel binary path
[0015.421] I> Continue to load from partition ...
[0015.425] W> No valid slot number is found in scratch register
[0015.431] W> Return default slot: _a
[0015.434] I> A/B: bin_type (37) slot 0
[0015.438] I> Loading kernel from partition
[0015.442] I> Loading partition kernel at 0xa4b30000 from device(0x1)
[0015.932] I> Validate kernel ...
[0015.933] I> T19x: Authenticate kernel (bin_type: 37), max size 0x5000000
[0015.934] I> RSA PSS signature check: OK
[0016.326] W> keyslot 14 is zero
[0016.358] I> Checking boot.img header magic ... [0016.358] I> [OK]
[0016.358] I> Loading kernel-dtb ...
[0016.358] I> No kernel-dtb binary path
[0016.359] I> Continue to load from partition ...
[0016.359] W> No valid slot number is found in scratch register
[0016.359] W> Return default slot: _a
[0016.360] I> A/B: bin_type (38) slot 0
[0016.363] I> Loading kernel-dtb from partition
[0016.367] I> Loading partition kernel-dtb at 0x91000000 from device(0x1)
[0016.382] I> Validate kernel-dtb ...
[0016.382] I> T19x: Authenticate kernel-dtb (bin_type: 38), max size 0x400000
[0016.385] I> RSA PSS signature check: OK
[0016.390] W> keyslot 14 is zero
[0016.392] I> Kernel hdr @0xa4b30000
[0016.394] I> Kernel dtb @0x90000000
[0016.397] I> decompressor handler not found
[0016.401] I> Copying kernel image (35917832 bytes) from 0xa4b30800 to 0x80080000 ... [0016.417] I> Done
[0016.417] I> Move ramdisk (len: 7238358) from 0xa6d72000 to 0x92000000
[0016.421] I> Updated bpmp info to DTB
[0016.422] I> Ramdisk: Base: 0x92000000; Size: 0x6e72d6
[0016.425] I> Updated initrd info to DTB
[0016.429] W> WARN: Fail to override "console=none" in commandline
[0016.435] I> Active rootfs suffix: 
[0016.438] E> tegrabl_linuxboot_add_disp_param, du 1 failed to get display params
[0016.446] E> tegrabl_linuxboot_add_disp_param, du 1 failed to get display params
[0016.453] W> No valid slot number is found in scratch register
[0016.459] W> Return default slot: _a
[0016.462] I> Active slot suffix: 
[0016.465] I> add_boot_slot_suffix: slot_suffix = 
[0016.470] I> Linux Cmdline: root=/dev/mmcblk0p1 rw rootwait rootfstype=ext4 console=ttyTCU0,115200n8 console=tty0 fbcon=map:0 net.ifnames=0  
[0016.518] I> Updated bootarg info to DTB
[0016.522] W> MAC addr invalid!
[0016.525] E> Failed to get WIFI MAC address
[0016.529] W> MAC addr invalid!
[0016.532] E> Failed to get Bluetooth MAC address
[0016.536] I> eeprom_get_mac_addr: MAC (type: 2): 48:b0:2d:2f:fb:2d
[0016.543] W> "plugin-manager" doesn't exist, creating
[0016.548] I> Adding /chosen/plugin-manager/cvm
[0016.552] W> "chip-id" doesn't exist, creating
[0016.556] I> Adding /chosen/plugin-manager/chip-id
[0016.561] W> "configs" doesn't exist, creating
[0016.565] I> Adding /chosen/plugin-manager/configs
[0016.569] W> "ids" doesn't exist, creating
[0016.573] I> Adding /chosen/plugin-manager/ids
[0016.578] W> "odm-data" doesn't exist, creating
[0016.582] I> Adding /chosen/plugin-manager/odm-data
[0016.590] W> "memory" doesn't exist, creating
[0016.592] I> [0] START: 0x80000000, END: 0xac000000
[0016.596] I> [1] START: 0xac004000, END: 0xf0ad0000
[0016.600] I> [2] START: 0xf0adc000, END: 0xf0ae0000
[0016.605] I> dram_block larger than 80000000
[0016.609] I> [3] START: 0x100000000, END: 0x880000000
[0016.614] I> added [base:0x80000000, size:0x2c000000] to /memory
[0016.620] I> added [base:0xac200000, size:0x44800000] to /memory
[0016.626] I> added [base:0x100000000, size:0x780000000] to /memory
[0016.633] I> Updated memory info to DTB
[0016.636] E> add_disp_param: failed to get display params for du=1
[0016.642] W> "reset" doesn't exist, creating
[0016.646] I> Adding ecid(00000001647dd5011000000017fe81c0) to DT
[0016.652] I> NVG: Logical CPU: 0; MPIDR: 0x80000000
[0016.656] I> NVG: Logical CPU: 1; MPIDR: 0x80000001
[0016.661] I> NVG: Logical CPU: 2; MPIDR: 0x80000100
[0016.666] I> NVG: Logical CPU: 3; MPIDR: 0x80000101
[0016.670] I> NVG: Logical CPU: 4; MPIDR: 0x80000200
[0016.675] I> NVG: Logical CPU: 5; MPIDR: 0x80000201
[0016.680] I> NVG: Logical CPU: 6; MPIDR: 0x80000300
[0016.685] I> NVG: Logical CPU: 7; MPIDR: 0x80000301
[0016.692] W> "misc-data" doesn't exist, creating
[0016.694] I> Boot-device: eMMC
[0016.697] I> Add boot-sdmmc to plugin-manager/misc-data
[0016.702] I> Add storage-sdmmc to plugin-manager/misc-data
[0016.707] W> Unknown storage device
[0016.711] I> Add serial number:1420121080127 as DT property
[0016.717] I> Plugin-manager override starting
[0016.721] W> Failed to find /plugin-manager in DT
[0016.725] 
[0016.726] -----------------------------------------------
[0016.731] Synchronous Exception: DATA ABORT (FAR: 0)
[0016.736] -----------------------------------------------
[0016.741] PAR_ELX: 0x80f
[0016.743] 
[0016.745] ESR 0x96000007: ec 0x25, il 0x1, iss 0x7
[0016.749] -----------------------------------------------
[0016.754]  [Stack Trace]
[0016.757] 
[0016.758] => pc:0xA064ACE4, sp:0xA0EADA80
[0016.762] => pc:0xA06411AC, sp:0xA0EADCB0
[0016.766] => pc:0xA064321C, sp:0xA0EADD20
[0016.770] => pc:0xA0646A28, sp:0xA0EADE20
[0016.773] => pc:0xA0645340, sp:0xA0EAE690
[0016.777] => pc:0xA060F71C, sp:0xA0EAE6C0
[0016.781] => pc:0xA060F7E4, sp:0xA0EAE760
[0016.785] => pc:0xA060F7F8, sp:0xA0EAE7B0
[0016.789] => pc:0xA060F5E0, sp:0xA0EAE7E0
[0016.793] => pc:0xA060EB54, sp:0xA0EAE7F0
[0016.796] => pc:0xA060EB28, sp:0xA0EAE800
[0016.800] -----------------------------------------------
[0016.806] iframe 0xa0ead990:
[0016.808] x0  0x               0 x1  0x               0 x2  0x              73 x3  0x        ffffffe0
[0016.817] x4  0x               0 x5  0x              73 x6  0x               0 x7  0x               0
[0016.826] x8  0x              43 x9  0x               a x10 0x           3b5f4 x11 0x        a0eadddc
[0016.836] x12 0x        90000000 x13 0x        a0eae58c x14 0x        90000000 x15 0x             200
[0016.845] x16 0x            1500 x17 0x             240 x18 0x               0 x19 0x        a0eade20
[0016.854] x20 0x             800 x21 0x        a066a964 x22 0x              20 x23 0x        ffffffe8
[0016.863] x24 0x        a0eae09e x25 0x             5f1 x26 0x        a0667f29 x27 0x        a0eade20
[0016.872] x28 0x        a0667f28 x29 0x        a0eadcb0 lr  0x        a064b314 sp  0x        a0eada80
[0016.881] elr 0x        a064ace4
[0016.884] spsr 0x        a0000209
[0016.887] -----------------------------------------------
[0016.893] panic (caller 0xa0601238): die
[0016.896] HALT: spinning forever...

We look forward to your answers
Thank u

Hi,
Please refer to the steps in
Unable to burn fuses (dev kit) / no more output (serial/hdmi) / bricked? - #89 by DaneLLL

Please try two-step flash and see if the system can boot up.

$ sudo BOARDID=2888 FAB=400 BOARDSKU=0004 BOARDREV=K.0 ./flash.sh --no-flash -u rsa_priv.pem -v ./sbk.key jetson-xavier mmcblk0p1
$ cd bootloader
$ sudo bash ./flashcmd.txt

Hi DaneLLL
We want to use our system.img if the option"-r" can be used in secureboot
And I notice that in the debug will it effect the result?

[0015.396]pcp hash validation failed!!!
[0015.396] C> OEM authentication of extlinux.conf header failed!

Thanks

HELLO
When I try to remove the “-r” and generate the system.img from rootfs . It can boot .
With the 3 times flashing depend on “1. use -r and Nvidia system.img --success boot” ,“2. with -r and custom system.img–fail boot” ,"3. without -r but custom rootfs–success boot ".
In summary ,the different between system.img is the custom one comment “LINUX /boot/Image and INITRD /boot/initrd” out in extlinux.conf.
I wonder to know if the**./l4t_sign_image.sh** encrypt the inird or the boot.img or the extlinux.conf .Which one lead to unboot .
Thank u

Hi,
We would need to replicate the issue and check .So the steps work:

$ sudo BOARDID=2888 FAB=400 BOARDSKU=0004 BOARDREV=K.0 ./flash.sh --no-flash -u rsa_priv.pem -v ./sbk.key jetson-xavier mmcblk0p1
$ cd bootloader
$ sudo bash ./flashcmd.txt

And these do not work:

$ sudo BOARDID=2888 FAB=400 BOARDSKU=0004 BOARDREV=K.0 ./flash.sh --no-flash -u rsa_priv.pem -v ./sbk.key jetson-xavier mmcblk0p1
$ sudo BOARDID=2888 FAB=400 BOARDSKU=0004 BOARDREV=K.0 ./flash.sh -r --no-flash -u rsa_priv.pem -v ./sbk.key jetson-xavier mmcblk0p1
$ cd bootloader
$ sudo bash ./flashcmd.txt

Is it correclt?

YES
the first one can work,and the second fails
here the success debug_log

����Shutdown state requested 1
Rebooting system ...
��
[0000.062] W> RATCHET: MB1 binary ratchet value 4 is too large than ratchet level 2 from HW fuses.
[0000.070] I> MB1 (prd-version: 1.5.1.9-t194-41334769-73a9b7ef)
[0000.075] I> Boot-mode: Coldboot
[0000.078] I> Chip revision : A02P
[0000.081] I> Bootrom patch version : 15 (correctly patched)
[0000.087] I> ATE fuse revision : 0x200
[0000.090] I> Ram repair fuse : 0x0
[0000.093] I> Ram Code : 0x2
[0000.096] I> rst_source : 0xb
[0000.098] I> rst_level : 0x1
[0000.102] I> Boot-device: eMMC
[0000.117] I> sdmmc DDR50 mode
[0000.121] W> No valid slot number is found in scratch register
[0000.127] W> Return default slot: _a
[0000.130] I> Active Boot chain : 0
[0000.133] I> Boot-device: eMMC
[0000.138] W> MB1_PLATFORM_CONFIG: device prod data is empty in MB1 BCT.
[0000.144] I> Temperature = 29000
[0000.147] W> Skipping boost for clk: BPMP_CPU_NIC
[0000.151] W> Skipping boost for clk: BPMP_APB
[0000.156] W> Skipping boost for clk: AXI_CBB
[0000.159] W> Skipping boost for clk: AON_CPU_NIC
[0000.164] W> Skipping boost for clk: CAN1
[0000.167] W> Skipping boost for clk: CAN2
[0000.172] I> Boot-device: eMMC
[0000.175] I> Boot-device: eMMC
[0000.184] I> Sdmmc: HS400 mode enabled
[0000.190] I> ECC region[0]: Start:0x0, End:0x0
[0000.194] I> ECC region[1]: Start:0x0, End:0x0
[0000.198] I> ECC region[2]: Start:0x0, End:0x0
[0000.202] I> ECC region[3]: Start:0x0, End:0x0
[0000.206] I> ECC region[4]: Start:0x0, End:0x0
[0000.210] I> Non-ECC region[0]: Start:0x80000000, End:0x100000000
[0000.216] I> Non-ECC region[1]: Start:0x0, End:0x0
[0000.221] I> Non-ECC region[2]: Start:0x0, End:0x0
[0000.225] I> Non-ECC region[3]: Start:0x0, End:0x0
[0000.229] I> Non-ECC region[4]: Start:0x0, End:0x0
[0000.235] E> FAILED: Thermal config
[0000.242] E> FAILED: MEMIO rail config
[0000.261] I> Boot-device: eMMC
[0000.272] I> sdmmc bdev is already initialized
[0000.370] I> MB1 done

����main enter
SPE VERSION #: R01.00.14 Created: Sep 19 2018 @ 11:03:21
HW Function test
Start Scheduler.
in late init
��
  [0000.379] I> Welcome to MB2(TBoot-BPMP) (version: 00.00.2018.32-mobile-6fc80c72)
[0000.379] I> DMA Heap @ [0x526fa000 - 0x52ffa000]
[0000.380] I> Default Heap @ [0xd486400 - 0xd48a400]
[0000.381] E> DEVICE_PROD: Invalid value data = 70020000, size = 0.
[0000.387] W> device prod register failed
[0000.390] I> gpio framework initialized
[0000.394] I> tegrabl_gpio_driver_register: register 'nvidia,tegra194-gpio' driver
[0000.401] I> tegrabl_gpio_driver_register: register 'nvidia,tegra194-gpio-aon' driver
[0000.409] I> No valid sdcard_params in mb1_bct
[0000.413] I> Boot-device: eMMC
[0000.416] I> Boot_device: SDMMC_BOOT instance: 3
[0000.426] I> sdmmc-3 params source = boot args
[0000.426] I> sdmmc bdev is already initialized
[0000.429] I> sdmmc-3 params source = boot args
[0000.463] I> Found 17 partitions in SDMMC_BOOT (instance 3)
[0000.479] I> Found 42 partitions in SDMMC_USER (instance 3)
[0000.480] W> No valid slot number is found in scratch register
[0000.481] W> Return default slot: _a
[0000.481] I> Active Boot chain : 0
[0000.488] I> parsing oem signed section of bpmp-fw header done
[0000.494] I> bpmp-fw binary init read from storage
[0000.498] I> RSA PSS signature check: OK
[0000.498] I> oem authentication of bpmp-fw header done
[0000.500] I> bpmp-fw binary done read from storage
[0000.501] I> bpmp-fw: Authentication init Done
[0000.508] I> parsing oem signed section of cpubl header done
[0000.514] I> cpubl binary init read from storage
[0000.519] I> bpmp-fw: Authentication Finalize Done
[0000.522] I> RSA PSS signature check: OK
[0000.522] I> oem authentication of cpubl header done
[0000.523] I> cpubl binary done read from storage
[0000.528] I> cpubl: Authentication init Done
[0000.538] I> parsing oem signed section of rce header done
[0000.545] I> rce binary init read from storage
[0000.545] I> Relocating BR-BCT
[0000.549] I> cpubl: Authentication Finalize Done
[0000.552] I> RSA PSS signature check: OK
[0000.552] I> oem authentication of rce header done
[0000.557] I> rce binary done read from storage
[0000.561] I> rce: Authentication init Done
[0000.572] I> parsing oem signed section of ape header done
[0000.578] I> ape binary init read from storage
[0000.581] I> rce: Authentication Finalize Done
[0000.584] I> RSA PSS signature check: OK
[0000.584] I> oem authentication of ape header done
[0000.588] I> ape binary done read from storage
[0000.592] I> ape: Authentication init Done
[0000.602] I> parsing oem signed section of tos header done
[0000.609] I> tos binary init read from storage
[0000.610] I> ape: Authentication Finalize Done
[0000.614] I> RSA PSS signature check: OK
[0000.614] I> oem authentication of tos header done
[0000.618] I> tos binary done read from storage
[0000.622] I> tos: Authentication init Done
[0000.633] I> parsing oem signed section of bpmp-fw-dtb header done
[0000.639] I> bpmp-fw-dtb binary init read from storage
[0000.642] I> tos: Authentication Finalize Done
[0000.647] I> RSA PSS signature check: OK
[0000.647] I> oem authentication of bpmp-fw-dtb header done
[0000.654] I> bpmp-fw-dtb binary done read from storage
[0000.656] I> bpmp-fw-dtb: Authentication init Done
[0000.667] I> parsing oem signed section of cpubl-dtb header done
[0000.673] I> cpubl-dtb binary init read from storage
[0000.677] I> bpmp-fw-dtb: Authentication Finalize Done
[0000.713] I> RSA PSS signature check: OK
[0000.713] I> oem authentication of cpubl-dtb header done
[0000.714] I> cpubl-dtb binary done read from storage
[0000.714] I> cpubl-dtb: Authentication init Done
[0000.721] I> parsing oem signed section of eks header done
[0000.728] I> eks binary init read from storage
[0000.730] I> cpubl-dtb: Authentication Finalize Done
[0000.733] I> RSA PSS signature check: OK
[0000.734] I> oem authentication of eks header done
[0000.734] I> eks binary done read from storage
[0000.735] I> eks: Authentication init Done
[0000.738] I> eks: Authentication Finalize Done
[0000.741] I> EKB detected (length: 0x410) @ VA:0x52700400
��NOTICE:  BL31: v1.3(release):b5eeb33f7
NOTICE:  BL31: Built : 08:55:29, Feb 19 2022
ipc-unittest-main: 1519: Welcome to IPC unittest!!!
ipc-unittest-main: 1531: waiting forever
ipc-unittest-srv: 329: Init unittest services!!!
hwkey-agent: 41: hwkey-agent is running!!
hwkey-agent: 347: key_mgnt_processing .......
hwkey-agent: 162: ekb_verification: EKB_CMAC verification is not match.
hwkey-agent: 400: key_mgnt_processing: failed (-7)
hwkey-agent: 45: main: Failed to verify or extract EKB (-7).
exit called, thread 0xffffffffea8a4d58, name trusty_app_2_92b92883-f96a-4177
luks-srv: 40: luks-srv is running!!
platform_bootstrap_epilog: trusty bootstrap complete
��

welcome to lk
calling constructors
initializing heap
creating bootstrap completion thread
top of bootstrap2()
initializing platform
bpmp: platform_init
tag is e73a758761f0c6d24a1e69a2ac6b5035
tag_show initialized
dt initialized
mail initialized
chipid initialized
fuse initialized
sku initialized
speedo initialized
ec_get_ec_list: found 45 ecs
ec initialized
ec_mrq initialized
vmon_populate_monitors: found 3 monitors
vmon initialized
adc initialized
fmon_populate_monitors: found 73 monitors
fmon initialized
fmon_mrq initialized
reset initialized
nvhs initialized
392 clocks registered
WARNING: pll_c4 has no dyn ramp
clk_mrq_init: mrq handler registered
clk initialized
nvlink initialized
io_dpd initialized
io_dpd initialized
thermal initialized
i2c5 controller initialized
initialized i2c mrq handling
i2c initialized
regulator initialized
avfs_clk_platform initialized
soctherm initialized
aotag initialized
powergate initialized
dvs initialized
pm initialized
pg_late initialized
strap initialized
tag initialized
emc initialized
clk_dt initialized
avfs_ccplex_platform initialized
tj_max: dt node not found
tj_init initialized
uphy_mrq_init: mrq handler registered
uphy_dt initialized
uphy initialized
safereg_init: period 80 ms
ec_late initialized
mrq initialized
��
  [0001.243] I> Welcome to Cboot
��fmon_post initialized
��[0001.243] I> Cboot Version: t194-d2b81f73
[0001.244] I> CPU-BL Params @ 0xf2820000
[0001.244] I>  0) Base:0x00000000 Size:0x00000000
[0001.247] I>  1) Base:0xf1100000 Size:0x00100000
[0001.252] I>  2) Base:0xf2000000 Size:0x00200000
[0001.256] I>  3) Base:0xf1200000 Size:0x00200000
[0001.261] I>  4) Base:0xf1000000 Size:0x00100000
��clk_set_parent failed for clk i2c2, parent pll_aon (-22)
clk_set_parent failed for clk i2c8, parent pll_aon (-22)
clk_dt_late initialized
machine_check initialized
pm_post initialized
dbells initialized
avfs_clk_platform_post initialized
dmce initialized
cvc initialized
ccplex_avfs_hw_init: nafll_cluster0: not monitored
ccplex_avfs_hw_init: nafll_cluster1: not monitored
ccplex_avfs_hw_init: nafll_cluster2: not monitored
ccplex_avfs_hw_init: nafll_cluster3: not monitored
avfs_clk_mach_post initialized
regulator_post initialized
rm initialized
sc7_diag initialized
thermal_test initialized
serial_late initialized
clk_post initialized
clk_dt_post initialized
mc_reg initialized
pg_post initialized
dyn_modules initialized
sku_debugfs initialized
speedo_debugfs initialized
adc_debugfs initialized
clk_debugfs initialized
��[0001.265] I>  5) Base:0xf0f00000 Size:0x00100000
[0001.345] I>  6) Base:0xf3800000 Size:0x00400000
[0001.349] I>  7) Base:0xf1c00000 Size:0x00400000
[0001.354] I>  8) Base:0xf0e00000 Size:0x00100000
[0001.358] I>  9) Base:0xf0d00000 Size:0x00100000
[0001.363] I> 10) Base:0xf3000000 Size:0x00800000
[0001.367] I> 11) Base:0x40000000 Size:0x00040000
[0001.371] I> 12) Base:0xf0c00000 Size:0x00100000
[0001.376] I> 13) Base:0x40046000 Size:0x00002000
[0001.380] I> 14) Base:0x40048000 Size:0x00002000
��emc_debugfs initialized
dvs_debugfs initialized
��[0001.385] I> 15) Base:0xac000000 Size:0x00004000
[0001.394] I> 16) Base:0x4004a000 Size:0x00002000
��fmon_debugfs initialized
vmon_debugfs initialized
pg_debugfs initialized
profile_fs initialized
debugfs_cons initialized
mail_fs initialized
profile initialized
cvc_debugfs initialized
dmce_debugfs initialized
ec_debugfs initialized
rm_debugfs initialized
soctherm_debug initialized
gr_reader initialized
mods initialized
dt_fs initialized
debugfs_mrq initialized
debug_mrq initialized
debug_safereg initialized
initializing target
calling apps_init()
starting app shell
entering main console loop
] ��[0001.399] I> 17) Base:0xf0b00000 Size:0x00100000
[0001.449] I> 18) Base:0x4004c000 Size:0x00002000
[0001.453] I> 19) Base:0xf2200000 Size:0x00600000
[0001.458] I> 20) Base:0x4004e000 Size:0x00002000
[0001.462] I> 21) Base:0xf0ad0000 Size:0x0000c000
[0001.467] I> 22) Base:0x00000000 Size:0x00000000
[0001.471] I> 23) Base:0xf0ae0000 Size:0x00020000
[0001.476] I> 24) Base:0xf6000000 Size:0x02000000
[0001.480] I> 25) Base:0x40050000 Size:0x00002000
[0001.485] I> 26) Base:0x40040000 Size:0x00006000
[0001.489] I> 27) Base:0xf1800000 Size:0x00400000
[0001.494] I> 28) Base:0xf4c00000 Size:0x01400000
[0001.498] I> 29) Base:0xf1400000 Size:0x00400000
[0001.503] I> 30) Base:0x00000000 Size:0x00000000
[0001.507] I> 31) Base:0x00000000 Size:0x00000000
[0001.511] I> 32) Base:0xf8000000 Size:0x08000000
[0001.516] I> 33) Base:0x00000000 Size:0x00000000
[0001.520] I> 34) Base:0xf3c00000 Size:0x01000000
[0001.525] I> 35) Base:0xab000000 Size:0x01000000
[0001.529] I> 36) Base:0xa0000000 Size:0x0b000000
[0001.534] I> 37) Base:0xf2800000 Size:0x00800000
[0001.538] I> 38) Base:0x80000000 Size:0x20000000
[0001.543] I> 39) Base:0xb0000000 Size:0x08000000
[0001.547] I> 40) Base:0x00000000 Size:0x00000000
[0001.552] I> 41) Base:0x00000000 Size:0x00000000
[0001.556] I> 42) Base:0x00000000 Size:0x00000000
[0001.561] I> 43) Base:0x00000000 Size:0x00000000
[0001.565] I> 44) Base:0x00000000 Size:0x00000000
[0001.570] I> 45) Base:0x00000000 Size:0x00000000
[0001.574] GIC-SPI Target CPU: 0
[0001.577] Interrupts Init done
[0001.580] calling constructors
[0001.583] initializing heap
[0001.585] I> Heap: [0xa069ab80 ... 0xab000000]
[0001.590] initializing threads
[0001.593] initializing timers
[0001.595] creating bootstrap completion thread
[0001.600] top of bootstrap2()
[0001.602] CPU: MIDR: 0x4E0F0040, MPIDR: 0x80000000
[0001.607] initializing platform
[0001.610] E> DEVICE_PROD: Invalid value data = 0, size = 0.
[0001.615] W> device prod register failed
[0001.619] I> Bl_dtb @0xaaf00000
[0001.625] W> "plugin-manager" doesn't exist, creating
[0001.627] W> "ids" doesn't exist, creating
[0001.631] W> "connection" doesn't exist, creating
[0001.636] W> "configs" doesn't exist, creating
[0001.648] E> failed to read label property for node 233684: 13
[0001.651] E> failed to read reg property for node 233772: 13
[0001.653] E> failed to read label property for node 233824: 13
[0001.659] E> failed to read label property for node 233892: 13
[0001.664] E> failed to read label property for node 233928: 13
[0001.669] E> failed to read label property for node 233964: 13
[0001.675] E> failed to read reg property for node 234032: 13
[0001.681] E> failed to read label property for node 234084: 13
[0001.689] I> Find /i2c@3160000's alias i2c0
[0001.689] I> Reading eeprom i2c=0 address=0x50
[0001.719] I> Device at /i2c@3160000:0x50
[0001.719] I> Reading eeprom i2c=0 address=0x56
[0001.720] E> I2C: slave not found in slaves.
[0001.720] E> I2C: Could not write 0 bytes to slave: 0x00ac with repeat start true.
[0001.721] E> I2C_DEV: Failed to send register address 0x00000000.
[0001.721] E> I2C_DEV: Could not read 256 registers of size 1 from slave 0xac at 0x00000000 via instance 0.
[0001.729] E> eeprom: Failed to read I2C slave device
[0001.734] I> Eeprom read failed 0x3526070d
[0001.739] I> Find /i2c@3180000's alias i2c2
[0001.742] I> Reading eeprom i2c=2 address=0x54
[0001.747] E> I2C: slave not found in slaves.
[0001.750] E> I2C: Could not write 0 bytes to slave: 0x00a8 with repeat start true.
[0001.758] E> I2C_DEV: Failed to send register address 0x00000000.
[0001.763] E> I2C_DEV: Could not read 256 registers of size 1 from slave 0xa8 at 0x00000000 via instance 2.
[0001.773] E> eeprom: Failed to read I2C slave device
[0001.778] I> Eeprom read failed 0x3526070d
[0001.782] I> Reading eeprom i2c=2 address=0x57
[0001.786] E> I2C: slave not found in slaves.
[0001.790] E> I2C: Could not write 0 bytes to slave: 0x00ae with repeat start true.
[0001.798] E> I2C_DEV: Failed to send register address 0x00000000.
[0001.803] E> I2C_DEV: Could not read 256 registers of size 1 from slave 0xae at 0x00000000 via instance 2.
[0001.813] E> eeprom: Failed to read I2C slave device
[0001.818] I> Eeprom read failed 0x3526070d
[0001.822] I> Reading eeprom i2c=2 address=0x52
[0001.826] E> I2C: slave not found in slaves.
[0001.830] E> I2C: Could not write 0 bytes to slave: 0x00a4 with repeat start true.
[0001.838] E> I2C_DEV: Failed to send register address 0x00000000.
[0001.843] E> I2C_DEV: Could not read 256 registers of size 1 from slave 0xa4 at 0x00000000 via instance 2.
[0001.853] E> eeprom: Failed to read I2C slave device
[0001.858] I> Eeprom read failed 0x3526070d
[0001.863] I> Find /i2c@c240000's alias i2c1
[0001.866] I> Reading eeprom i2c=1 address=0x52
[0001.871] E> I2C: slave not found in slaves.
[0001.874] E> I2C: Could not write 0 bytes to slave: 0x00a4 with repeat start true.
[0001.882] E> I2C_DEV: Failed to send register address 0x00000000.
[0001.888] E> I2C_DEV: Could not read 256 registers of size 1 from slave 0xa4 at 0x00000000 via instance 1.
[0001.897] E> eeprom: Retry to read I2C slave device.
[0001.902] E> I2C: slave not found in slaves.
[0001.906] E> I2C: Could not write 0 bytes to slave: 0x00a4 with repeat start true.
[0001.914] E> I2C_DEV: Failed to send register address 0x00000000.
[0001.919] E> I2C_DEV: Could not read 256 registers of size 1 from slave 0xa4 at 0x00000000 via instance 1.
[0001.929] E> eeprom: Failed to read I2C slave device
[0001.934] I> Eeprom read failed 0x3526070d
[0001.938] I> Reading eeprom i2c=1 address=0x50
[0001.942] E> I2C: slave not found in slaves.
[0001.946] E> I2C: Could not write 0 bytes to slave: 0x00a0 with repeat start true.
[0001.954] E> I2C_DEV: Failed to send register address 0x00000000.
[0001.959] E> I2C_DEV: Could not read 256 registers of size 1 from slave 0xa0 at 0x00000000 via instance 1.
[0001.969] E> eeprom: Retry to read I2C slave device.
[0001.974] E> I2C: slave not found in slaves.
[0001.978] E> I2C: Could not write 0 bytes to slave: 0x00a0 with repeat start true.
[0001.986] E> I2C_DEV: Failed to send register address 0x00000000.
[0001.991] E> I2C_DEV: Could not read 256 registers of size 1 from slave 0xa0 at 0x00000000 via instance 1.
[0002.001] E> eeprom: Failed to read I2C slave device
[0002.006] I> Eeprom read failed 0x3526070d
[0002.010] I> create_pm_ids: id: 2888-0004-400-L, len: 15
[0002.015] I> config: mem-type:00,power-config:00,misc-config:00,modem-config:00,touch-config:00,display-config:00,, len: 93
[0002.026] I> Adding plugin-manager/ids/2888-0004-400=/i2c@3160000:module@0x50
[0002.033] W> "i2c@3160000" doesn't exist, creating
[0002.038] W> "module@0x50" doesn't exist, creating
[0002.043] I> Adding plugin-manager/cvm
[0002.046] W> "chip-id" doesn't exist, creating
[0002.050] I> Adding plugin-manager/chip-id/A02P
[0002.054] I> Plugin-manager override starting
[0002.059] W> Failed to find /plugin-manager in DT
[0002.063] I> gpio framework initialized
[0002.068] I> tegrabl_gpio_driver_register: register 'nvidia,tegra194-gpio' driver
[0002.076] I> tegrabl_gpio_driver_register: register 'nvidia,tegra194-gpio-aon' driver
[0002.082] I> tegrabl_tca9539_init: i2c bus: 1, slave addr: 0x46
[0002.090] W> fetch_driver_phandle_from_dt: failed to get node with compatible ti,tca9539
[0002.097] W> fetch_driver_phandle_from_dt: failed to get node with compatible nxp,tca9539
[0002.104] W> tegrabl_tca9539_init: failed to fetch phandle from dt
[0002.110] I> tegrabl_tca9539_init: i2c bus: 1, slave addr: 0x44
[0002.117] W> fetch_driver_phandle_from_dt: failed to get node with compatible ti,tca9539
[0002.125] W> fetch_driver_phandle_from_dt: failed to get node with compatible nxp,tca9539
[0002.131] W> tegrabl_tca9539_init: failed to fetch phandle from dt
[0002.139] I> fixed regulator driver initialized
[0002.153] I> register 'maxim' power off handle
[0002.154] I> virtual i2c enabled
[0002.154] I> registered 'maxim,max20024' pmic
[0002.155] I> tegrabl_gpio_driver_register: register 'max20024-gpio' driver
[0002.160] I> Boot-device: eMMC
[0002.163] I> Boot_device: SDMMC_BOOT instance: 3
[0002.172] I> sdmmc-3 params source = boot args
[0002.172] I> create_pm_ids: id: 2888-0004-400-L, len: 15
[0002.177] I> config: mem-type:00,power-config:00,misc-config:00,modem-config:00,touch-config:00,display-config:00,, len: 93
[0002.188] I> sdmmc bdev is already initialized
[0002.192] I> sdmmc-3 params source = boot args
[0002.223] I> Found 17 partitions in SDMMC_BOOT (instance 3)
[0002.236] I> Found 42 partitions in SDMMC_USER (instance 3)
[0002.249] I> enabling 'vdd-hdmi-5v0' regulator
[0002.255] I> regulator 'vdd-hdmi-5v0' already enabled
[0002.255] E> tegrabl_display_init_regulator: hdmi cable is not connected
[0002.256] E> tegrabl_display_get_pdata, failed to parse dtb settings
[0002.257] E> cannot find any other nvdisp nodes
[0002.257] E> no valid display unit config found in dtb
[0002.259] W> display init failed
[0002.260] I> Load in CBoot Boot Options partition and parse it
[0002.272] E> Error -9 when finding node with path /boot-configuration
[0002.272] E> tegrabl_cbo_parse_info: "boot-configuration" not found in CBO file.
[0002.279] I> Using default boot order
[0002.283] I> boot-dev-order :-
[0002.286] I> 1.sd
[0002.287] I> 2.usb
[0002.289] I> 3.nvme
[0002.291] I> 4.emmc
[0002.293] I> 5.net
[0002.295] I> Hit any key to stop autoboot:     4       3       2       1
[0004.303] initializing target
[0004.303] calling apps_init()
[0004.304] starting app kernel_boot_app
[0004.323] I> found decompressor handler: lz4-legacy
[0004.324] I> decompressing BMP blob ...
[0004.335] I> Kernel type = Normal
[0004.335] I> ########## SD (0) boot ##########
[0004.336] I> No sdcard
[0004.336] I> sdcard-0 params source = DT-BL
[0004.336] E> Blockdev open: exit error
[0004.337] E> SD boot failed, err: 724238353
[0004.337] I> ########## USB (0) boot ##########
[0004.342] W> No valid slot number is found in scratch register
[0004.342] W> Return default slot: _a
[0004.351] I> Validate XUSB-FW ...
[0004.351] I> T19x: Authenticate XUSB-FW (bin_type: 11), max size 0x28000
[0004.355] I> RSA PSS signature check: OK
[0004.359] W> keyslot 14 is zero
[0004.362] I> USB Firmware Version: 60.09 release
[0004.421] I> regulator of usb2-0 already enabled
[0004.429] I> regulator of usb2-1 already enabled
[0004.437] I> regulator of usb2-2 already enabled
[0004.444] I> regulator of usb2-3 already enabled
[0004.447] E> GPIO missing. Cannot disable regulator vdd-5v-sata
[0004.450] I> regulator 'vdd-5v-sata' already enabled
[0005.514] I> USB 2.0 port 3 new full-speed USB device detected
[0005.514] W> Change usb2 root port id to 4
[0005.514] W> Change usb2 root port id to 3
[0005.516] W> WARNING: event and command not matching, cmd_trb_ptr = 0xa42cf200, cmd_ring.dma = 0xa42cf240
[0005.617] I> Start to enumerate device
[0005.618] W> WARNING: event and command not matching, cmd_trb_ptr = 0xa42cf200, cmd_ring.dma = 0xa42cf240
[0005.622] I> This device is non-MSD, skip enumeration
[0005.622] E> Failed to enumerate USB device
[0005.622] E> failed to start xhci controller
[0005.623] E> Error in init of XUSB host driver, err: 7979000d
[0005.623] W> Failed to initialize device 5-0
[0005.627] E> USB boot failed, err: 2037973005
[0005.632] I> ########## NVME (0) boot ##########
[0005.636] I> Initializing nvme device instance 0
[0005.641] I> Initializing nvme controller
[0005.645] I> tegrabl_locate_pcie_ctrl_in_dt: found match at 0x14180000
[0005.651] I> vpcie3v3-supply not found
[0005.654] I> vpcie12v-supply not found
[0005.658] W> Failed to get nvidia,plat-gpios
[0005.662] I> tegrabl_pcie_soc_preinit: (0):
[0005.666] I> Unpowergate
[0005.669] I> tegrabl_car_clk_disable(0) ...
[0005.673] I> tegrabl_car_rst_set(CORE, 0) ...
[0005.677] I> tegrabl_car_rst_set(APB, 0) ...
[0005.681] I> tegrabl_car_clk_enable(0) ...
[0005.685] I> tegrabl_car_rst_clear(APB, 0) ...
[0005.689] I> tegrabl_set_ctrl_state(0)
[0005.693] I> CLR PCIE_APB:6
[0005.695] I> tegrabl_pcie_soc_init: (0):
[0005.699] I> APPL initialization ...
[0005.702] I> poweron phys
[0005.706] I> tegrabl_locate_pcie_ctrl_in_dt: found match at 0x14180000
[0005.712] I> tegrabl_power_on_phy: power on phy @0x3e30000
[0005.717] I> tegrabl_power_on_phy: power on phy @0x3e40000
[0005.723] I> tegrabl_power_on_phy: power on phy @0x3e50000
[0005.728] I> tegrabl_power_on_phy: power on phy @0x3e60000
[0006.833] C> Failed to link up controller-0
[0006.833] I> PCIe (0) Link is not UP
[0006.834] W> Failed tegrabl_pcie_soc_init(), error=0x12
[0006.834] I> Failed to initialize SoC Host PCIe controller
[0006.835] E> tegrabl_nvme_init: Failed tegrabl_pcie_init(0); error=0x12
[0006.835] W> tegrabl_nvme_bdev_open: Failed NVME INIT; error=0x80800612
[0006.838] W> Failed to open NVME-0, err = 80800612
[0006.843] W> Failed to initialize device 10-0
[0006.847] E> NVME (0) boot failed, err: 0x80800612
[0006.852] I> ########## NVME (1) boot ##########
[0006.856] I> Initializing nvme device instance 1
[0006.861] I> Initializing nvme controller
[0006.866] I> tegrabl_locate_pcie_ctrl_in_dt: found match at 0x14100000
[0006.871] I> vpcie3v3-supply not found
[0006.875] I> vpcie12v-supply not found
[0006.878] W> Failed to get nvidia,plat-gpios
[0006.882] I> tegrabl_pcie_soc_preinit: (1):
[0006.886] I> Unpowergate
[0006.889] I> tegrabl_car_clk_disable(1) ...
[0006.893] I> tegrabl_car_rst_set(CORE, 1) ...
[0006.897] I> tegrabl_car_rst_set(APB, 1) ...
[0006.901] I> tegrabl_car_clk_enable(1) ...
[0006.905] I> tegrabl_car_rst_clear(APB, 1) ...
[0006.909] I> tegrabl_set_ctrl_state(1)
[0006.913] I> CLR PCIE_APB:6
[0006.916] I> tegrabl_pcie_soc_init: (1):
[0006.919] I> APPL initialization ...
[0006.923] I> poweron phys
[0006.926] I> tegrabl_locate_pcie_ctrl_in_dt: found match at 0x14100000
[0006.932] I> tegrabl_power_on_phy: power on phy @0x3e10000
[0007.063] I> PCIe controller-1 link is up
[0007.064] I> tegra_pcie_info[1].cfg0_base = 0x30000000
[0007.064] I> tegra_pcie_info[1].cfg1_base = 0x30020000
[0007.065] I> tegra_pcie_info[1].atu_dma_base = 0x30040000
[0007.065] I> tegra_pcie_bus[1].mem = 0x30200000
[0007.065] I> Scanning busnr: 0 devfn: 0
[0007.066] I> PCIe IDs: 0x1ad210de
[0007.069] I> PCIe RID_CC: 0x60400a1
[0007.072] I> Scanning busnr: 1 devfn: 0
[0007.076] I> PCIe IDs: 0x15218086
[0007.079] I> PCIe RID_CC: 0x2000001
[0007.082] I> PCI Config: I/O=0x30100000, Memory=0x30200000
[0007.087] I> MEM bar_num=0 bar=0x30200000
[0007.091] I> IO bar_num=2 bar=0x30100000
[0007.095] I> MEM bar_num=3 bar=0x30220000
[0007.099] I> Number of PCIe devices detected: 2
[0007.103] E> tegrabl_nvme_init: Failed tegrabl_pcie_get_dev(1); error=0x0
[0007.110] I> PCIe (1) link is UP
[0007.123] W> tegrabl_nvme_bdev_open: Failed NVME INIT; error=0x80800612
[0007.124] W> Failed to open NVME-1, err = 80800612
[0007.124] W> Failed to initialize device 10-1
[0007.128] E> NVME (1) boot failed, err: 0x80800612
[0007.133] I> ########## NVME (2) boot ##########
[0007.137] I> Initializing nvme device instance 2
[0007.142] I> Initializing nvme controller
[0007.147] I> tegrabl_locate_pcie_ctrl_in_dt: found match at 0x14120000
[0007.152] I> vpcie3v3-supply not found
[0007.156] I> vpcie12v-supply not found
[0007.159] W> Failed to get nvidia,plat-gpios
[0007.163] I> tegrabl_pcie_soc_preinit: (2):
[0007.167] I> Unpowergate
[0007.170] I> tegrabl_car_clk_disable(2) ...
[0007.174] I> tegrabl_car_rst_set(CORE, 2) ...
[0007.178] I> tegrabl_car_rst_set(APB, 2) ...
[0007.182] I> tegrabl_car_clk_enable(2) ...
[0007.186] I> tegrabl_car_rst_clear(APB, 2) ...
[0007.190] I> tegrabl_set_ctrl_state(2)
[0007.194] I> CLR PCIE_APB:6
[0007.197] I> tegrabl_pcie_soc_init: (2):
[0007.200] I> APPL initialization ...
[0007.204] I> poweron phys
[0007.207] I> tegrabl_locate_pcie_ctrl_in_dt: found match at 0x14120000
[0007.213] I> tegrabl_power_on_phy: controller 2 not available
[0007.218] E> Failed to power on phy on controller-2
[0007.223] I> PCIe (2) Link is not UP
[0007.227] W> Failed tegrabl_pcie_soc_init(), error=0x1
[0007.231] I> Failed to initialize SoC Host PCIe controller
[0007.237] E> tegrabl_nvme_init: Failed tegrabl_pcie_init(2); error=0x1
[0007.243] W> tegrabl_nvme_bdev_open: Failed NVME INIT; error=0x80800601
[0007.249] W> Failed to open NVME-2, err = 80800601
[0007.254] W> Failed to initialize device 10-2
[0007.258] E> NVME (2) boot failed, err: 0x80800601
[0007.263] I> ########## NVME (3) boot ##########
[0007.267] I> Initializing nvme device instance 3
[0007.272] I> Initializing nvme controller
[0007.277] I> tegrabl_locate_pcie_ctrl_in_dt: found match at 0x14140000
[0007.282] I> vpcie3v3-supply not found
[0007.286] I> vpcie12v-supply not found
[0007.289] W> Failed to get nvidia,plat-gpios
[0007.293] I> tegrabl_pcie_soc_preinit: (3):
[0007.297] I> Unpowergate
[0007.300] I> tegrabl_car_clk_disable(3) ...
[0007.304] I> tegrabl_car_rst_set(CORE, 3) ...
[0007.308] I> tegrabl_car_rst_set(APB, 3) ...
[0007.312] I> tegrabl_car_clk_enable(3) ...
[0007.316] I> tegrabl_car_rst_clear(APB, 3) ...
[0007.320] I> tegrabl_set_ctrl_state(3)
[0007.324] I> CLR PCIE_APB:6
[0007.327] I> tegrabl_pcie_soc_init: (3):
[0007.330] I> APPL initialization ...
[0007.334] I> poweron phys
[0007.338] I> tegrabl_locate_pcie_ctrl_in_dt: found match at 0x14140000
[0007.343] I> tegrabl_power_on_phy: power on phy @0x3e80000
[0007.461] I> PCIe controller-3 link is up
[0007.462] I> tegra_pcie_info[3].cfg0_base = 0x34000000
[0007.462] I> tegra_pcie_info[3].cfg1_base = 0x34020000
[0007.463] I> tegra_pcie_info[3].atu_dma_base = 0x34040000
[0007.463] I> tegra_pcie_bus[3].mem = 0x34200000
[0007.463] I> Scanning busnr: 0 devfn: 0
[0007.464] I> PCIe IDs: 0x1ad210de
[0007.467] I> PCIe RID_CC: 0x60400a1
[0007.470] I> Scanning busnr: 1 devfn: 0
[0007.474] I> PCIe IDs: 0x42328086
[0007.477] I> PCIe RID_CC: 0x2800000
[0007.480] I> PCI Config: I/O=0x34100000, Memory=0x34200000
[0007.486] I> MEM64 bar_num=0 bar=0x34200000
[0007.490] I> Number of PCIe devices detected: 2
[0007.494] E> tegrabl_nvme_init: Failed tegrabl_pcie_get_dev(3); error=0x0
[0007.501] I> PCIe (3) link is UP
[0007.514] W> tegrabl_nvme_bdev_open: Failed NVME INIT; error=0x80800612
[0007.515] W> Failed to open NVME-3, err = 80800612
[0007.515] W> Failed to initialize device 10-3
[0007.519] E> NVME (3) boot failed, err: 0x80800612
[0007.524] I> ########## NVME (4) boot ##########
[0007.528] I> Initializing nvme device instance 4
[0007.533] I> Initializing nvme controller
[0007.538] I> tegrabl_locate_pcie_ctrl_in_dt: found match at 0x14160000
[0007.543] I> vpcie3v3-supply not found
[0007.546] I> vpcie12v-supply not found
[0007.550] W> Failed to get nvidia,plat-gpios
[0007.554] I> tegrabl_pcie_soc_preinit: (4):
[0007.558] I> Unpowergate
[0007.561] I> tegrabl_car_clk_disable(4) ...
[0007.565] I> tegrabl_car_rst_set(CORE, 4) ...
[0007.569] I> tegrabl_car_rst_set(APB, 4) ...
[0007.573] I> tegrabl_car_clk_enable(4) ...
[0007.577] I> tegrabl_car_rst_clear(APB, 4) ...
[0007.581] I> tegrabl_set_ctrl_state(4)
[0007.585] I> CLR PCIE_APB:6
[0007.587] I> tegrabl_pcie_soc_init: (4):
[0007.591] I> APPL initialization ...
[0007.594] I> poweron phys
[0007.599] I> tegrabl_locate_pcie_ctrl_in_dt: found match at 0x14160000
[0007.604] I> tegrabl_power_on_phy: power on phy @0x3e90000
[0007.609] I> tegrabl_power_on_phy: power on phy @0x3ea0000
[0008.714] C> Failed to link up controller-4
[0008.714] I> PCIe (4) Link is not UP
[0008.715] W> Failed tegrabl_pcie_soc_init(), error=0x12
[0008.716] I> Failed to initialize SoC Host PCIe controller
[0008.716] E> tegrabl_nvme_init: Failed tegrabl_pcie_init(4); error=0x12
[0008.716] W> tegrabl_nvme_bdev_open: Failed NVME INIT; error=0x80800612
[0008.720] W> Failed to open NVME-4, err = 80800612
[0008.724] W> Failed to initialize device 10-4
[0008.729] E> NVME (4) boot failed, err: 0x80800612
[0008.733] I> ########## NVME (5) boot ##########
[0008.738] I> Initializing nvme device instance 5
[0008.742] I> Initializing nvme controller
[0008.748] I> tegrabl_locate_pcie_ctrl_in_dt: found match at 0x141a0000
[0008.752] I> i=0, reg_phandle=0x20
[0008.758] I> reg_voltage=3300000
[0008.759] I> tegrabl_pcie_enable_regulators: regulator_set_voltage(0x20, 3300000)
[0008.771] I> enabling 'vdd-3v3-pcie' regulator
[0008.771] I> i=1, reg_phandle=0x21
[0008.776] I> reg_voltage=1200000
[0008.777] I> tegrabl_pcie_enable_regulators: regulator_set_voltage(0x21, 1200000)
[0008.789] I> regulator 'vdd-12v-pcie' already enabled
[0008.789] I> tegrabl_pcie_soc_preinit: (5):
[0008.793] I> Unpowergate
[0008.796] I> tegrabl_car_clk_disable(5) ...
[0008.799] I> tegrabl_car_rst_set(CORE, 5) ...
[0008.804] I> tegrabl_car_rst_set(APB, 5) ...
[0008.808] I> tegrabl_car_clk_enable(5) ...
[0008.812] I> tegrabl_car_rst_clear(APB, 5) ...
[0008.816] I> tegrabl_set_ctrl_state(5)
[0008.819] I> CLR PCIE_APB:6
[0008.822] I> tegrabl_pcie_soc_init: (5):
[0008.826] I> APPL initialization ...
[0008.829] I> poweron phys
[0008.834] I> tegrabl_locate_pcie_ctrl_in_dt: found match at 0x141a0000
[0008.839] I> tegrabl_power_on_phy: power on phy @0x3eb0000
[0008.844] I> tegrabl_power_on_phy: power on phy @0x3ec0000
[0008.849] I> tegrabl_power_on_phy: power on phy @0x3ed0000
[0008.855] I> tegrabl_power_on_phy: power on phy @0x3ee0000
[0008.860] I> tegrabl_power_on_phy: power on phy @0x3ef0000
[0008.865] I> tegrabl_power_on_phy: power on phy @0x3f00000
[0008.871] I> tegrabl_power_on_phy: power on phy @0x3f10000
[0008.876] I> tegrabl_power_on_phy: power on phy @0x3f20000
[0009.981] C> Failed to link up controller-5
[0009.981] I> PCIe (5) Link is not UP
[0009.982] I> tegrabl_pcie_disable_regulators: disable regulator 0x20
[0009.985] I> disabling 'vdd-3v3-pcie' regulator
[0009.985] I> tegrabl_pcie_disable_regulators: disable regulator 0x21
[0009.988] E> GPIO missing. Cannot disable regulator vdd-12v-pcie
[0009.988] W> Failed tegrabl_pcie_soc_init(), error=0x12
[0009.991] I> Failed to initialize SoC Host PCIe controller
[0009.996] E> tegrabl_nvme_init: Failed tegrabl_pcie_init(5); error=0x12
[0010.003] W> tegrabl_nvme_bdev_open: Failed NVME INIT; error=0x80800612
[0010.009] W> Failed to open NVME-5, err = 80800612
[0010.014] W> Failed to initialize device 10-5
[0010.018] E> NVME (5) boot failed, err: 0x80800612
[0010.023] I> ########## Fixed storage boot ##########
[0010.028] I> Loading kernel-bootctrl from partition
[0010.032] I> Loading partition kernel-bootctrl at 0xa4320000 from device(0x1)
[0010.046] W> tegrabl_get_kernel_bootctrl: magic number(0x00000000) is invalid
[0010.046] W> tegrabl_get_kernel_bootctrl: use default dummy boot control data
[0010.060] I> Already published: 00010003
[0010.060] I> Look for boot partition
[0010.061] I> Fallback: assuming 0th partition is boot partition
[0010.066] I> Detect filesystem
[0010.093] I> Loading extlinux.conf ...
[0010.094] I> Loading extlinux.conf binary from rootfs ...
[0010.094] I> rootfs path: /sdmmc_user/boot/extlinux/extlinux.conf
[0010.137] I> Loading extlinux.conf sig file from rootfs ...
[0010.137] I> rootfs path: /sdmmc_user/boot/extlinux/extlinux.conf.sig
[0010.162] I> Validate extlinux.conf ...
[0010.162] I> T19x: Authenticate extlinux.conf (bin_type: 54), max size 0x2000
[0010.164] I> RSA PSS signature check: OK
[0010.164] W> keyslot 14 is zero
[0010.164] I> L4T boot options
[0010.165] I> [1]: "primary kernel"
[0010.165] I> Enter choice: 
[0013.166] I> Continuing with default option: 1
[0013.166] I> Loading kernel ...
[0013.166] I> Loading kernel binary from rootfs ...
[0013.167] I> rootfs path: /sdmmc_user/boot/Image
[0013.387] I> Loading kernel sig file from rootfs ...
[0013.388] I> rootfs path: /sdmmc_user/boot/Image.sig
[0013.406] I> overload load_size to 34484232 (from 34484240)
[0013.407] I> Validate kernel ...
[0013.407] I> T19x: Authenticate kernel (bin_type: 37), max size 0x5000000
[0013.408] I> RSA PSS signature check: OK
[0013.722] W> keyslot 14 is zero
[0013.753] I> Loading kernel-dtb ...
[0013.753] I> No kernel-dtb binary path
[0013.754] I> Continue to load from partition ...
[0013.754] W> No valid slot number is found in scratch register
[0013.754] W> Return default slot: _a
[0013.755] I> A/B: bin_type (38) slot 0
[0013.755] I> Loading kernel-dtb from partition
[0013.756] I> Loading partition kernel-dtb at 0x91000000 from device(0x1)
[0013.771] I> Validate kernel-dtb ...
[0013.772] I> T19x: Authenticate kernel-dtb (bin_type: 38), max size 0x400000
[0013.774] I> RSA PSS signature check: OK
[0013.780] W> keyslot 14 is zero
[0013.781] I> Loading ramdisk from rootfs ...
[0013.784] I> Loading ramdisk binary from rootfs ...
[0013.789] I> rootfs path: /sdmmc_user/boot/initrd
[0013.852] I> Loading ramdisk sig file from rootfs ...
[0013.852] I> rootfs path: /sdmmc_user/boot/initrd.sig
[0013.871] I> overload load_size to 7238358 (from 7238368)
[0013.871] I> Validate ramdisk ...
[0013.872] I> T19x: Authenticate ramdisk (bin_type: 54), max size 0x4000000
[0013.873] I> RSA PSS signature check: OK
[0013.939] W> keyslot 14 is zero
[0013.952] I> Kernel hdr @0xa4320000
[0013.953] I> Kernel dtb @0x90000000
[0013.953] I> decompressor handler not found
[0013.953] I> Copying kernel image (34484232 bytes) from 0xa4320000 to 0x80080000 ... [0013.963] I> Done
[0013.964] I> Updated bpmp info to DTB
[0013.966] I> Ramdisk: Base: 0x92000000; Size: 0x6e72d6
[0013.966] I> Updated initrd info to DTB
[0013.966] W> WARN: Fail to override "console=none" in commandline
[0013.967] I> Active rootfs suffix: 
[0013.969] E> tegrabl_linuxboot_add_disp_param, du 0 failed to get display params
[0013.976] E> tegrabl_linuxboot_add_disp_param, du 0 failed to get display params
[0013.983] E> tegrabl_linuxboot_add_disp_param, du 0 failed to get display params
[0013.990] W> No valid slot number is found in scratch register
[0013.996] W> Return default slot: _a
[0014.000] I> Active slot suffix: 
[0014.003] I> add_boot_slot_suffix: slot_suffix = 
[0014.007] I> Linux Cmdline: root=/dev/mmcblk0p1 rw rootwait rootfstype=ext4 console=ttyTCU0,115200n8 console=tty0 fbcon=map:0 net.ifnames=0  
[0014.039] I> Updated bootarg info to DTB
[0014.043] W> MAC addr invalid!
[0014.046] E> Failed to get WIFI MAC address
[0014.050] W> MAC addr invalid!
[0014.053] E> Failed to get Bluetooth MAC address
[0014.057] I> eeprom_get_mac_addr: MAC (type: 2): 48:b0:2d:2f:fb:2d
[0014.064] W> "plugin-manager" doesn't exist, creating
[0014.069] I> Adding /chosen/plugin-manager/cvm
[0014.073] W> "chip-id" doesn't exist, creating
[0014.077] I> Adding /chosen/plugin-manager/chip-id
[0014.082] W> "configs" doesn't exist, creating
[0014.086] I> Adding /chosen/plugin-manager/configs
[0014.091] W> "ids" doesn't exist, creating
[0014.095] I> Adding /chosen/plugin-manager/ids
[0014.099] W> "odm-data" doesn't exist, creating
[0014.103] I> Adding /chosen/plugin-manager/odm-data
[0014.111] W> "memory" doesn't exist, creating
[0014.113] I> [0] START: 0x80000000, END: 0xac000000
[0014.117] I> [1] START: 0xac004000, END: 0xf0ad0000
[0014.121] I> [2] START: 0xf0adc000, END: 0xf0ae0000
[0014.126] I> dram_block larger than 80000000
[0014.130] I> [3] START: 0x100000000, END: 0x880000000
[0014.135] I> added [base:0x80000000, size:0x2c000000] to /memory
[0014.141] I> added [base:0xac200000, size:0x44800000] to /memory
[0014.147] I> added [base:0x100000000, size:0x780000000] to /memory
[0014.154] I> Updated memory info to DTB
[0014.157] E> add_disp_param: failed to get display params for du=0
[0014.163] W> "reset" doesn't exist, creating
[0014.167] I> Adding ecid(00000001647dd5011000000017fe81c0) to DT
[0014.173] I> NVG: Logical CPU: 0; MPIDR: 0x80000000
[0014.177] I> NVG: Logical CPU: 1; MPIDR: 0x80000001
[0014.182] I> NVG: Logical CPU: 2; MPIDR: 0x80000100
[0014.187] I> NVG: Logical CPU: 3; MPIDR: 0x80000101
[0014.192] I> NVG: Logical CPU: 4; MPIDR: 0x80000200
[0014.196] I> NVG: Logical CPU: 5; MPIDR: 0x80000201
[0014.201] I> NVG: Logical CPU: 6; MPIDR: 0x80000300
[0014.206] I> NVG: Logical CPU: 7; MPIDR: 0x80000301
[0014.212] W> "misc-data" doesn't exist, creating
[0014.215] I> Boot-device: eMMC
[0014.218] I> Add boot-sdmmc to plugin-manager/misc-data
[0014.223] I> Add storage-sdmmc to plugin-manager/misc-data
[0014.228] W> Unknown storage device
[0014.232] I> Add serial number:1420121080127 as DT property
[0014.238] I> Plugin-manager override starting
[0014.242] W> Failed to find /plugin-manager in DT
[0014.246] I> tegrabl_load_kernel_and_dtb: Done
[0014.250] E> tegrabl_display_clear: display is not initialized
[0014.256] W> Boot logo display failed...
[0014.259] I> Kernel EP: 0x80080000, DTB: 0x90000000
[    0.000000] Booting Linux on physical CPU 0x0
[    0.000000] Linux version 4.9.253-tegra (buildbrain@mobile-u64-5403-d8000) (gcc version 7.3.1 20180425 [linaro-7.3-2018.05 revision d291202
[    0.000000] Boot CPU: AArch64 Processor [4e0f0040]
[    0.000000] OF: fdt:memory scan node memory, reg size 48,
[    0.000000] OF: fdt: - 80000000 ,  2c000000
[    0.000000] OF: fdt: - ac200000 ,  44800000
[    0.000000] OF: fdt: - 100000000 ,  780000000
[    0.000000] earlycon: tegra_comb_uart0 at MMIO32 0x000000000c168000 (options '')
[    0.000000] bootconsole [tegra_comb_uart0] enabled
[    0.820736] tegra194-pinctrl 2430000.pinmux: function 'shutdown' not supported
[    0.820772] tegra194-pinctrl 2430000.pinmux: invalid function shutdown in map table
[    0.820803] tegra194-pinctrl 2430000.pinmux: Failed to add default setting: -22
[    0.982413] pca953x 0-0074: reg get err: -19
[    2.000363] pca954x 2-0070: vcc regualtor get failed, -19
[    2.445307] rt5659 7-001a: Device with ID register ffffff80 is not rt5659
[    5.233538] cgroup: cgroup2: unknown option "nsdelegate"
[    6.347950] imx185 2-001b: reset-gpios not found 0
[    6.348065] imx185 2-001b: unable to get platform data
[    6.348171] imx185 2-001b: tegra camera driver registration failed
[    6.348325] imx185: probe of 2-001b failed with error -14
[    6.348673] imx185 2-001c: reset-gpios not found 0
[    6.348771] imx185 2-001c: unable to get platform data
[    6.348857] imx185 2-001c: tegra camera driver registration failed
[    6.349012] imx185: probe of 2-001c failed with error -14
[    6.349239] imx185 2-001d: reset-gpios not found 0
[    6.349328] imx185 2-001d: unable to get platform data
[    6.349419] imx185 2-001d: tegra camera driver registration failed
[    6.349568] imx185: probe of 2-001d failed with error -14
[    6.349794] imx185 2-001e: reset-gpios not found 0                                  
[    6.350553] imx185 2-001e: unable to get platform data                              
[    6.350649] imx185 2-001e: tegra camera driver registration failed                  
[    6.350814] imx185: probe of 2-001e failed with error -14                           
[    6.352532] imx185 2-001f: reset-gpios not found 0                                  
[    6.352657] imx185 2-001f: unable to get platform data
[    6.353365] imx185 2-001f: tegra camera driver registration failed
[    6.360124] imx185: probe of 2-001f failed with error -14
[    6.365701] imx185 2-0020: reset-gpios not found 0
[    6.374322] imx185 2-0020: unable to get platform data
[    6.375478] imx185 2-0020: tegra camera driver registration failed
[    6.381670] imx185: probe of 2-0020 failed with error -14
[    6.387183] imx185 2-0021: reset-gpios not found 0
[    6.391623] imx185 2-0021: unable to get platform data
[    6.394099] using random self ethernet address
[    6.394102] using random host ethernet address
[    6.405458] imx185 2-0021: tegra camera driver registration failed
[    6.411741] imx185: probe of 2-0021 failed with error -14
[    6.417112] imx185 2-0022: reset-gpios not found 0
[    6.421938] imx185 2-0022: unable to get platform data
[    6.427356] imx185 2-0022: tegra camera driver registration failed
[    6.433547] imx185: probe of 2-0022 failed with error -14
[    6.693370] random: crng init done
[    6.693463] random: 7 urandom warning(s) missed due to ratelimiting
[    6.910289] using random self ethernet address
[    6.910404] using random host ethernet address
[   10.408267] Please complete system configuration setup on the serial port provided by Jetson's USB device mode connection. e.g. /dev/ttyAC.

Hi,
Could you try nvmflash.sh? Please refer to the steps and give it a try:
Boot failure after nvmflash.sh - #21 by carolyuu
How to flash a pre built image with secureboot? - #10 by DaneLLL

The settings are for Jetson Nano, please modify these to fit AGX Xavier:

BOARDID=3448 FAB=200 BOARDSKU=0002 -x 0x21

Hi
We have one devkit just fuse the PKC and we can use the flash.sh with “-r or -k” .
But for disk encryption we need the SBKPKC. So I will try your advice and also hope you can solve my doubts about if something in system.img will be encrypted or signed ;in other words ,if those files in rootfs are made to system.img will be signed or decrypted in the SBKPKC mode ?
And I also find that when I finish the disk encryption(emmc) and want to reflash the normal emmc that I need the --user_key be added
thank u

Hi
I have generated the mass flashing tarball successfully .
And I flash it successfully but still cant boot
here the minicom debug_log

0074.068] W> RATCHET: MB1 binary ratchet value 4 is too large than ratchet level 2 from HW fuses.
[0074.076] I> MB1 (prd-version: 1.5.1.9-t194-41334769-73a9b7ef)
[0074.082] I> Boot-mode: RCM
[0074.084] I> Chip revision : A02P
[0074.087] I> Bootrom patch version : 15 (correctly patched)
[0074.093] I> ATE fuse revision : 0x200
[0074.096] I> Ram repair fuse : 0x0
[0074.099] I> Ram Code : 0x2
[0074.102] I> rst_source : 0x0
[0074.104] I> rst_level : 0x0
[0074.108] I> USB configuration success
[0077.103] I> bct_bootrom image downloaded
[0077.115] W> MB1_PLATFORM_CONFIG: device prod data is empty in MB1 BCT.
[0077.123] I> Temperature = 29500
[0077.126] W> Skipping boost for clk: BPMP_CPU_NIC
[0077.130] W> Skipping boost for clk: BPMP_APB
[0077.134] W> Skipping boost for clk: AXI_CBB
[0077.138] W> Skipping boost for clk: AON_CPU_NIC
[0077.142] W> Skipping boost for clk: CAN1
[0077.146] W> Skipping boost for clk: CAN2
[0077.150] I> Boot-device: eMMC
[0077.153] I> Boot-device: eMMC
[0077.156] I> bct_mb1 image downloaded
[0077.170] I> ECC region[0]: Start:0x0, End:0x0
[0077.174] I> ECC region[1]: Start:0x0, End:0x0
[0077.178] I> ECC region[2]: Start:0x0, End:0x0
[0077.182] I> ECC region[3]: Start:0x0, End:0x0
[0077.186] I> ECC region[4]: Start:0x0, End:0x0
[0077.190] I> Non-ECC region[0]: Start:0x80000000, End:0x100000000
[0077.196] I> Non-ECC region[1]: Start:0x0, End:0x0
[0077.200] I> Non-ECC region[2]: Start:0x0, End:0x0
[0077.205] I> Non-ECC region[3]: Start:0x0, End:0x0
[0077.209] I> Non-ECC region[4]: Start:0x0, End:0x0
[0077.216] E> FAILED: Thermal config
[0077.223] E> FAILED: MEMIO rail config
[0077.241] I> bct_mem image downloaded
[0078.377] I> blob image downloaded
[0078.399] I> Recovery boot mode 0
[0078.494] I> MB1 done

����main enter
SPE VERSION #: R01.00.14 Created: Sep 19 2018 @ 11:03:21
HW Function test
Start Scheduler.
in late init
��
  [0078.503] I> Welcome to MB2(TBoot-BPMP) Recovery (version: 00.00.2018.32-mobile-326aea2d)
[0078.504] I> DMA Heap @ [0x526fa000 - 0x52ffa000]
[0078.504] I> Default Heap @ [0xd486400 - 0xd48a400]
[0078.506] E> DEVICE_PROD: Invalid value data = 70020000, size = 0.
[0078.511] W> device prod register failed
[0078.516] I> parsing oem signed section of bpmp-fw header done
[0078.524] I> bpmp-fw binary copied from blob
[0078.528] I> RSA PSS signature check: OK
[0078.529] I> oem authentication of bpmp-fw header done
[0078.534] I> bpmp-fw: Authentication init Done
[0078.538] I> parsing oem signed section of cpubl header done
[0078.544] I> cpubl binary copied from blob
[0078.552] I> bpmp-fw: Authentication Finalize Done
[0078.554] I> RSA PSS signature check: OK
[0078.556] I> oem authentication of cpubl header done
[0078.561] I> cpubl: Authentication init Done
[0078.565] I> parsing oem signed section of tos header done
[0078.572] I> tos binary copied from blob
[0078.574] I> Relocating BR-BCT
[0078.579] I> cpubl: Authentication Finalize Done
[0078.584] I> RSA PSS signature check: OK
[0078.585] I> oem authentication of tos header done
[0078.590] I> tos: Authentication init Done
[0078.594] I> parsing oem signed section of bpmp-fw-dtb header done
[0078.602] I> bpmp-fw-dtb binary copied from blob
[0078.606] I> tos: Authentication Finalize Done
[0078.612] I> RSA PSS signature check: OK
[0078.613] I> oem authentication of bpmp-fw-dtb header done
[0078.618] I> bpmp-fw-dtb: Authentication init Done
[0078.622] I> parsing oem signed section of cpubl-dtb header done
[0078.629] I> cpubl-dtb binary copied from blob
[0078.636] I> bpmp-fw-dtb: Authentication Finalize Done
[0078.820] I> RSA PSS signature check: OK
[0078.820] I> oem authentication of cpubl-dtb header done
[0078.821] I> cpubl-dtb: Authentication init Done
[0078.821] I> parsing oem signed section of eks header done
[0078.822] I> eks binary copied from blob
[0078.824] I> cpubl-dtb: Authentication Finalize Done
[0078.827] I> RSA PSS signature check: OK
[0078.827] I> oem authentication of eks header done
[0078.831] I> eks: Authentication init Done
[0078.835] I> eks: Authentication Finalize Done
[0078.839] I> EKB detected (length: 0x410) @ VA:0x526fb800
��NOTICE:  BL31: v1.3(release):b5eeb33f7
NOTICE:  BL31: Built : 08:55:29, Feb 19 2022
ipc-unittest-main: 1519: Welcome to IPC unittest!!!
ipc-unittest-main: 1531: waiting forever
ipc-unittest-srv: 329: Init unittest services!!!
hwkey-agent: 41: hwkey-agent is running!!
hwkey-agent: 347: key_mgnt_processing .......
hwkey-agent: 255: Setting EKB key 0 to slot 14
hwkey-agent: 178: Init hweky-agent services!!
luks-srv: 40: luks-srv is running!!
luks-srv: 157: Init luks-srv IPC services!!
platform_bootstrap_epilog: trusty bootstrap complete
��

welcome to lk
calling constructors
initializing heap
creating bootstrap completion thread
top of bootstrap2()
initializing platform
bpmp: platform_init
tag is e73a758761f0c6d24a1e69a2ac6b5035
tag_show initialized
dt initialized
mail initialized
chipid initialized
fuse initialized
sku initialized
speedo initialized
ec_get_ec_list: found 45 ecs
ec initialized
ec_mrq initialized
vmon_populate_monitors: found 3 monitors
vmon initialized
adc initialized
fmon_populate_monitors: found 73 monitors
fmon initialized
fmon_mrq initialized
reset initialized
nvhs initialized
392 clocks registered
clk_mrq_init: mrq handler registered
clk initialized
nvlink initialized
io_dpd initialized
io_dpd initialized
thermal initialized
i2c5 controller initialized
initialized i2c mrq handling
i2c initialized
regulator initialized
avfs_clk_platform initialized
soctherm initialized
aotag initialized
powergate initialized
dvs initialized
pm initialized
pg_late initialized
strap initialized
tag initialized
emc initialized
clk_dt initialized
avfs_ccplex_platform initialized
tj_max: dt node not found
tj_init initialized
/uphy is not enabled status = disabled
uphy_dt initialized
uphy initialized
safereg_init: period 80 ms
ec_late initialized
mrq initialized
��
  [0079.332] I> Welcome to TBoot-CPU Recovery
��fmon_post initialized
��[0079.333] I> Heap: [0xa4000000 ... 0xaa000000
[0079.338] I> gpio framework initialized
��clk_set_parent failed for clk i2c2, parent pll_aon (-22)
clk_set_parent failed for clk i2c8, parent pll_aon (-22)
��[0079.353] I> tegrabl_gpio_driver_register: register 'nvidia,tegra194-gpio' driver
��clk_dt_late initialized
machine_check initialized
pm_post initialized
dbells initialized
avfs_clk_platform_post initialized
dmce initialized
cvc initialized
ccplex_avfs_hw_init: nafll_cluster0: not monitored
ccplex_avfs_hw_init: nafll_cluster1: not monitored
ccplex_avfs_hw_init: nafll_cluster2: not monitored
ccplex_avfs_hw_init: nafll_cluster3: not monitored
avfs_clk_mach_post initialized
regulator_post initialized
rm initialized
sc7_diag initialized
thermal_test initialized
serial_late initialized
clk_post initialized
clk_dt_post initialized
mc_reg initialized
pg_post initialized
dyn_modules initialized
sku_debugfs initialized
speedo_debugfs initialized
adc_debugfs initialized
clk_debugfs initialized
��[0079.367] I> tegrabl_gpio_driver_register: register 'nvidia,tegra194-gpio-aon' driver
[0079.432] I> tegrabl_tca9539_init: i2c bus: 1, slave addr: 0x46
[0079.443] W> fetch_driver_phandle_from_dt: failed to get node with compatible ti,tca9539
[0079.451] W> fetch_driver_phandle_from_dt: failed to get node with compatible nxp,tca9539
[0079.454] W> tegrabl_tca9539_init: failed to fetch phandle from dt
[0079.460] I> tegrabl_tca9539_init: i2c bus: 1, slave addr: 0x44
��emc_debugfs initialized
dvs_debugfs initialized
��[0079.471] W> fetch_driver_phandle_from_dt: failed to get node with compatible ti,tca9539
��fmon_debugfs initialized
vmon_debugfs initialized
pg_debugfs initialized
profile_fs initialized
debugfs_cons initialized
mail_fs initialized
profile initialized
cvc_debugfs initialized
dmce_debugfs initialized
ec_debugfs initialized
rm_debugfs initialized
soctherm_debug initialized
gr_reader initialized
mods initialized
dt_fs initialized
debugfs_mrq initialized
debug_mrq initialized
debug_safereg initialized
initializing target
calling apps_init()
starting app shell
entering main console loop
] ��[0079.483] W> fetch_driver_phandle_from_dt: failed to get node with compatible nxp,tca9539
[0079.532] W> tegrabl_tca9539_init: failed to fetch phandle from dt
[0079.542] I> fixed regulator driver initialized
[0079.561] I> CPU: Nvidia Carmel
[0079.561] I> CPU: MIDR: 0x4e0f0040, MPIDR: 0x80000000
[0079.562] I> chip revision : A02P
[0079.562] I> Boot-device: eMMC
[0079.562] I> Boot_device: SDMMC_BOOT instance: 3
[0080.158] I> sdmmc-3 params source = boot args
[0080.159] I> sdmmc bdev is already initialized
[0080.159] I> sdmmc-3 params source = boot args
[0080.186] I> Found 17 partitions in SDMMC_BOOT (instance 3)
[0080.199] I> Found 42 partitions in SDMMC_USER (instance 3)
[0080.199] I> Recovery boot_type: 0
[0080.199] I> Entering 3p server
[0080.200] I> USB configuration success
[0083.236] I> Populate storage info
[0083.253] I> Erasing device 0: 3
[0084.290] I> Writing device 0: 3.
[0084.322] I> Found 17 partitions in SDMMC_BOOT (instance 3)
[0084.324] I> Erasing device 1: 3
[0085.100] I> Writing device 1: 3.
[0085.109] I> Writing device 1: 3.
[0085.129] I> Found 42 partitions in SDMMC_USER (instance 3)
[0085.131] I> Writing device 1: 3.
[0085.151] I> Found 42 partitions in SDMMC_USER (instance 3)
[0085.154] I> Writing mb1 partition.
[0085.270] I> Writing mb1_b partition.
[0085.309] I> Writing spe-fw partition.
[0085.337] I> Writing spe-fw_b partition.
[0085.362] I> Writing mb2 partition.
[0085.397] I> Writing mb2_b partition.
[0085.429] I> Writing mts-preboot partition.
[0085.525] I> Writing mts-preboot_b partition.
[0085.547] I> Writing SMD partition.
[0085.562] I> Writing SMD_b partition.
[0085.576] I> Writing VER_b partition.
[0085.592] I> Writing VER partition.
[0085.606] I> Writing device 1: 3.
[0085.616] I> Writing APP partition.
[0513.233] I> Writing mts-mce partition.
[0513.264] I> Writing mts-mce_b partition.
[0513.292] I> Writing mts-proper partition.
[0513.559] I> Writing mts-proper_b partition.
[0513.817] I> Writing cpu-bootloader partition.
[0513.868] I> Writing cpu-bootloader_b partition.
[0513.918] I> Writing bootloader-dtb partition.
[0513.958] I> Writing bootloader-dtb_b partition.
[0513.996] I> Writing secure-os partition.
[0514.043] I> Writing secure-os_b partition.
[0514.088] I> Writing eks partition.
[0514.110] I> Writing eks_b partition.
[0514.131] I> Writing bpmp-fw partition.
[0514.207] I> Writing bpmp-fw_b partition.
[0514.281] I> Writing bpmp-fw-dtb partition.
[0514.350] I> Writing bpmp-fw-dtb_b partition.
[0514.417] I> Writing xusb-fw partition.
[0514.433] I> Writing xusb-fw_b partition.
[0514.449] I> Writing rce-fw partition.
[0514.486] I> Writing rce-fw_b partition.
[0514.522] I> Writing adsp-fw partition.
[0514.548] I> Writing adsp-fw_b partition.
[0514.572] I> Writing sc7 partition.
[0514.597] I> Writing sc7_b partition.
[0514.621] I> Writing BMP partition.
[0514.661] I> Writing BMP_b partition.
[0514.690] I> Writing recovery partition.
[0519.104] I> Writing recovery-dtb partition.
[0519.147] I> Writing kernel-bootctrl partition.
[0519.163] I> Writing kernel-bootctrl_b partition.
[0519.179] I> Writing kernel partition.
[0522.674] I> Writing kernel_b partition.
[0526.194] I> Writing kernel-dtb partition.
[0526.241] I> Writing kernel-dtb_b partition.
[0526.318] I> Writing BCT partition.
[0526.487] I> Writing MB1_BCT partition.
[0526.543] I> Writing MB1_BCT_b partition.
[0526.600] I> Writing MEM_BCT partition.
[0526.662] I> Writing MEM_BCT_b partition.
[0526.723] I> Rebooting : reset-coldboot


����Shutdown state requested 1
Rebooting system ...
��
[0000.062] W> RATCHET: MB1 binary ratchet value 4 is too large than ratchet level 2 from HW fuses.
[0000.070] I> MB1 (prd-version: 1.5.1.9-t194-41334769-73a9b7ef)
[0000.075] I> Boot-mode: Coldboot
[0000.078] I> Chip revision : A02P
[0000.081] I> Bootrom patch version : 15 (correctly patched)
[0000.087] I> ATE fuse revision : 0x200
[0000.090] I> Ram repair fuse : 0x0
[0000.093] I> Ram Code : 0x2
[0000.096] I> rst_source : 0xb
[0000.098] I> rst_level : 0x1
[0000.102] I> Boot-device: eMMC
[0000.117] I> sdmmc DDR50 mode
[0000.121] W> No valid slot number is found in scratch register
[0000.127] W> Return default slot: _a
[0000.130] I> Active Boot chain : 0
[0000.133] I> Boot-device: eMMC
[0000.138] W> MB1_PLATFORM_CONFIG: device prod data is empty in MB1 BCT.
[0000.144] I> Temperature = 30000
[0000.147] W> Skipping boost for clk: BPMP_CPU_NIC
[0000.152] W> Skipping boost for clk: BPMP_APB
[0000.156] W> Skipping boost for clk: AXI_CBB
[0000.159] W> Skipping boost for clk: AON_CPU_NIC
[0000.164] W> Skipping boost for clk: CAN1
[0000.167] W> Skipping boost for clk: CAN2
[0000.172] I> Boot-device: eMMC
[0000.175] I> Boot-device: eMMC
[0000.184] I> Sdmmc: HS400 mode enabled
[0000.190] I> ECC region[0]: Start:0x0, End:0x0
[0000.194] I> ECC region[1]: Start:0x0, End:0x0
[0000.198] I> ECC region[2]: Start:0x0, End:0x0
[0000.202] I> ECC region[3]: Start:0x0, End:0x0
[0000.206] I> ECC region[4]: Start:0x0, End:0x0
[0000.210] I> Non-ECC region[0]: Start:0x80000000, End:0x100000000
[0000.216] I> Non-ECC region[1]: Start:0x0, End:0x0
[0000.221] I> Non-ECC region[2]: Start:0x0, End:0x0
[0000.225] I> Non-ECC region[3]: Start:0x0, End:0x0
[0000.229] I> Non-ECC region[4]: Start:0x0, End:0x0
[0000.235] E> FAILED: Thermal config
[0000.242] E> FAILED: MEMIO rail config
[0000.260] I> Boot-device: eMMC
[0000.272] I> sdmmc bdev is already initialized
[0000.370] I> MB1 done

����main enter
SPE VERSION #: R01.00.14 Created: Sep 19 2018 @ 11:03:21
HW Function test
Start Scheduler.
in late init
��
  [0000.379] I> Welcome to MB2(TBoot-BPMP) (version: 00.00.2018.32-mobile-6fc80c72)
[0000.379] I> DMA Heap @ [0x526fa000 - 0x52ffa000]
[0000.380] I> Default Heap @ [0xd486400 - 0xd48a400]
[0000.380] E> DEVICE_PROD: Invalid value data = 70020000, size = 0.
[0000.386] W> device prod register failed
[0000.390] I> gpio framework initialized
[0000.394] I> tegrabl_gpio_driver_register: register 'nvidia,tegra194-gpio' driver
[0000.401] I> tegrabl_gpio_driver_register: register 'nvidia,tegra194-gpio-aon' driver
[0000.409] I> No valid sdcard_params in mb1_bct
[0000.413] I> Boot-device: eMMC
[0000.416] I> Boot_device: SDMMC_BOOT instance: 3
[0000.425] I> sdmmc-3 params source = boot args
[0000.426] I> sdmmc bdev is already initialized
[0000.429] I> sdmmc-3 params source = boot args
[0000.463] I> Found 17 partitions in SDMMC_BOOT (instance 3)
[0000.479] I> Found 42 partitions in SDMMC_USER (instance 3)
[0000.480] W> No valid slot number is found in scratch register
[0000.480] W> Return default slot: _a
[0000.481] I> Active Boot chain : 0
[0000.487] I> parsing oem signed section of bpmp-fw header done
[0000.494] I> bpmp-fw binary init read from storage
[0000.497] I> RSA PSS signature check: OK
[0000.498] I> oem authentication of bpmp-fw header done
[0000.500] I> bpmp-fw binary done read from storage
[0000.501] I> bpmp-fw: Authentication init Done
[0000.507] I> parsing oem signed section of cpubl header done
[0000.514] I> cpubl binary init read from storage
[0000.519] I> bpmp-fw: Authentication Finalize Done
[0000.522] I> RSA PSS signature check: OK
[0000.522] I> oem authentication of cpubl header done
[0000.523] I> cpubl binary done read from storage
[0000.527] I> cpubl: Authentication init Done
[0000.538] I> parsing oem signed section of rce header done
[0000.544] I> rce binary init read from storage
[0000.545] I> Relocating BR-BCT
[0000.548] I> cpubl: Authentication Finalize Done
[0000.551] I> RSA PSS signature check: OK
[0000.552] I> oem authentication of rce header done
[0000.557] I> rce binary done read from storage
[0000.561] I> rce: Authentication init Done
[0000.571] I> parsing oem signed section of ape header done
[0000.578] I> ape binary init read from storage
[0000.580] I> rce: Authentication Finalize Done
[0000.583] I> RSA PSS signature check: OK
[0000.584] I> oem authentication of ape header done
[0000.587] I> ape binary done read from storage
[0000.592] I> ape: Authentication init Done
[0000.602] I> parsing oem signed section of tos header done
[0000.608] I> tos binary init read from storage
[0000.610] I> ape: Authentication Finalize Done
[0000.613] I> RSA PSS signature check: OK
[0000.614] I> oem authentication of tos header done
[0000.618] I> tos binary done read from storage
[0000.622] I> tos: Authentication init Done
[0000.632] I> parsing oem signed section of bpmp-fw-dtb header done
[0000.639] I> bpmp-fw-dtb binary init read from storage
[0000.642] I> tos: Authentication Finalize Done
[0000.646] I> RSA PSS signature check: OK
[0000.647] I> oem authentication of bpmp-fw-dtb header done
[0000.653] I> bpmp-fw-dtb binary done read from storage
[0000.656] I> bpmp-fw-dtb: Authentication init Done
[0000.666] I> parsing oem signed section of cpubl-dtb header done
[0000.673] I> cpubl-dtb binary init read from storage
[0000.677] I> bpmp-fw-dtb: Authentication Finalize Done
[0000.712] I> RSA PSS signature check: OK
[0000.713] I> oem authentication of cpubl-dtb header done
[0000.713] I> cpubl-dtb binary done read from storage
[0000.714] I> cpubl-dtb: Authentication init Done
[0000.721] I> parsing oem signed section of eks header done
[0000.727] I> eks binary init read from storage
[0000.730] I> cpubl-dtb: Authentication Finalize Done
[0000.733] I> RSA PSS signature check: OK
[0000.733] I> oem authentication of eks header done
[0000.734] I> eks binary done read from storage
[0000.734] I> eks: Authentication init Done
[0000.737] I> eks: Authentication Finalize Done
[0000.741] I> EKB detected (length: 0x410) @ VA:0x52700400
��NOTICE:  BL31: v1.3(release):b5eeb33f7
NOTICE:  BL31: Built : 08:55:29, Feb 19 2022
ipc-unittest-main: 1519: Welcome to IPC unittest!!!
ipc-unittest-main: 1531: waiting forever
ipc-unittest-srv: 329: Init unittest services!!!
hwkey-agent: 41: hwkey-agent is running!!
hwkey-agent: 347: key_mgnt_processing .......
hwkey-agent: 255: Setting EKB key 0 to slot 14
hwkey-agent: 178: Init hweky-agent services!!
luks-srv: 40: luks-srv is running!!
luks-srv: 157: Init luks-srv IPC services!!
platform_bootstrap_epilog: trusty bootstrap complete
��

welcome to lk
calling constructors
initializing heap
creating bootstrap completion thread
top of bootstrap2()
initializing platform
bpmp: platform_init
tag is e73a758761f0c6d24a1e69a2ac6b5035
tag_show initialized
dt initialized
mail initialized
chipid initialized
fuse initialized
sku initialized
speedo initialized
ec_get_ec_list: found 45 ecs
ec initialized
ec_mrq initialized
vmon_populate_monitors: found 3 monitors
vmon initialized
adc initialized
fmon_populate_monitors: found 73 monitors
fmon initialized
fmon_mrq initialized
reset initialized
nvhs initialized
392 clocks registered
WARNING: pll_c4 has no dyn ramp
clk_mrq_init: mrq handler registered
clk initialized
nvlink initialized
io_dpd initialized
io_dpd initialized
thermal initialized
i2c5 controller initialized
initialized i2c mrq handling
i2c initialized
regulator initialized
avfs_clk_platform initialized
soctherm initialized
aotag initialized
powergate initialized
dvs initialized
pm initialized
pg_late initialized
strap initialized
tag initialized
emc initialized
clk_dt initialized
avfs_ccplex_platform initialized
tj_max: dt node not found
tj_init initialized
uphy_mrq_init: mrq handler registered
uphy_dt initialized
uphy initialized
safereg_init: period 80 ms
ec_late initialized
��
  ��mrq initialized
��[0001.243] I> Welcome to Cboot
��fmon_post initialized
��[0001.243] I> Cboot Version: t194-d2b81f73
[0001.243] I> CPU-BL Params @ 0xf2820000
[0001.244] I>  0) Base:0x00000000 Size:0x00000000
[0001.248] I>  1) Base:0xf1100000 Size:0x00100000
[0001.252] I>  2) Base:0xf2000000 Size:0x00200000
[0001.256] I>  3) Base:0xf1200000 Size:0x00200000
[0001.261] I>  4) Base:0xf1000000 Size:0x00100000
[0001.265] I>  5) Base:0xf0f00000 Size:0x00100000
[0001.270] I>  6) Base:0xf3800000 Size:0x00400000
[0001.274] I>  7) Base:0xf1c00000 Size:0x00400000
[0001.279] I>  8) Base:0xf0e00000 Size:0x00100000
[0001.283] I>  9) Base:0xf0d00000 Size:0x00100000
��clk_set_parent failed for clk i2c2, parent pll_aon (-22)
clk_set_parent failed for clk i2c8, parent pll_aon (-22)
clk_dt_late initialized
machine_check initialized
pm_post initialized
dbells initialized
avfs_clk_platform_post initialized
dmce initialized
cvc initialized
ccplex_avfs_hw_init: nafll_cluster0: not monitored
ccplex_avfs_hw_init: nafll_cluster1: not monitored
ccplex_avfs_hw_init: nafll_cluster2: not monitored
ccplex_avfs_hw_init: nafll_cluster3: not monitored
avfs_clk_mach_post initialized
regulator_post initialized
rm initialized
sc7_diag initialized
thermal_test initialized
serial_late initialized
clk_post initialized
clk_dt_post initialized
mc_reg initialized
pg_post initialized
dyn_modules initialized
sku_debugfs initialized
speedo_debugfs initialized
adc_debugfs initialized
clk_debugfs initialized
��[0001.288] I> 10) Base:0xf3000000 Size:0x00800000
[0001.367] I> 11) Base:0x40000000 Size:0x00040000
[0001.372] I> 12) Base:0xf0c00000 Size:0x00100000
[0001.376] I> 13) Base:0x40046000 Size:0x00002000
[0001.381] I> 14) Base:0x40048000 Size:0x00002000
[0001.385] I> 15) Base:0xac000000 Size:0x00004000
[0001.389] I> 16) Base:0x4004a000 Size:0x00002000
[0001.394] I> 17) Base:0xf0b00000 Size:0x00100000
[0001.398] I> 18) Base:0x4004c000 Size:0x00002000��emc_debugfs initialized
dvs_debugfs initialized
fmon_debugfs initialized
vmon_debugfs initialized
pg_debugfs initialized
profile_fs initialized
debugfs_cons initialized
mail_fs initialized
profile initialized
cvc_debugfs initialized
dmce_debugfs initialized
ec_debugfs initialized
rm_debugfs initialized
soctherm_debug initialized
gr_reader initialized
mods initialized
dt_fs initialized
debugfs_mrq initialized
debug_mrq initialized
debug_safereg initialized
initializing target
calling apps_init()
starting app shell
entering main console loop
] ��
[0001.453] I> 19) Base:0xf2200000 Size:0x00600000
[0001.458] I> 20) Base:0x4004e000 Size:0x00002000
[0001.462] I> 21) Base:0xf0ad0000 Size:0x0000c000
[0001.467] I> 22) Base:0x00000000 Size:0x00000000
[0001.471] I> 23) Base:0xf0ae0000 Size:0x00020000
[0001.476] I> 24) Base:0xf6000000 Size:0x02000000
[0001.480] I> 25) Base:0x40050000 Size:0x00002000
[0001.484] I> 26) Base:0x40040000 Size:0x00006000
[0001.489] I> 27) Base:0xf1800000 Size:0x00400000
[0001.493] I> 28) Base:0xf4c00000 Size:0x01400000
[0001.498] I> 29) Base:0xf1400000 Size:0x00400000
[0001.502] I> 30) Base:0x00000000 Size:0x00000000
[0001.507] I> 31) Base:0x00000000 Size:0x00000000
[0001.511] I> 32) Base:0xf8000000 Size:0x08000000
[0001.516] I> 33) Base:0x00000000 Size:0x00000000
[0001.520] I> 34) Base:0xf3c00000 Size:0x01000000
[0001.525] I> 35) Base:0xab000000 Size:0x01000000
[0001.529] I> 36) Base:0xa0000000 Size:0x0b000000
[0001.534] I> 37) Base:0xf2800000 Size:0x00800000
[0001.538] I> 38) Base:0x80000000 Size:0x20000000
[0001.542] I> 39) Base:0xb0000000 Size:0x08000000
[0001.547] I> 40) Base:0x00000000 Size:0x00000000
[0001.551] I> 41) Base:0x00000000 Size:0x00000000
[0001.556] I> 42) Base:0x00000000 Size:0x00000000
[0001.560] I> 43) Base:0x00000000 Size:0x00000000
[0001.565] I> 44) Base:0x00000000 Size:0x00000000
[0001.569] I> 45) Base:0x00000000 Size:0x00000000
[0001.574] GIC-SPI Target CPU: 0
[0001.577] Interrupts Init done
[0001.580] calling constructors
[0001.582] initializing heap
[0001.585] I> Heap: [0xa069ab80 ... 0xab000000]
[0001.589] initializing threads
[0001.592] initializing timers
[0001.595] creating bootstrap completion thread
[0001.599] top of bootstrap2()
[0001.602] CPU: MIDR: 0x4E0F0040, MPIDR: 0x80000000
[0001.607] initializing platform
[0001.610] E> DEVICE_PROD: Invalid value data = 0, size = 0.
[0001.615] W> device prod register failed
[0001.619] I> Bl_dtb @0xaaf00000
[0001.625] W> "plugin-manager" doesn't exist, creating
[0001.627] W> "ids" doesn't exist, creating
[0001.631] W> "connection" doesn't exist, creating
[0001.635] W> "configs" doesn't exist, creating
[0001.647] E> failed to read label property for node 233684: 13
[0001.649] E> failed to read reg property for node 233772: 13
[0001.652] E> failed to read label property for node 233824: 13
[0001.658] E> failed to read label property for node 233892: 13
[0001.663] E> failed to read label property for node 233928: 13
[0001.669] E> failed to read label property for node 233964: 13
[0001.675] E> failed to read reg property for node 234032: 13
[0001.680] E> failed to read label property for node 234084: 13
[0001.688] I> Find /i2c@3160000's alias i2c0
[0001.689] I> Reading eeprom i2c=0 address=0x50
[0001.718] I> Device at /i2c@3160000:0x50
[0001.719] I> Reading eeprom i2c=0 address=0x56
[0001.719] E> I2C: slave not found in slaves.
[0001.720] E> I2C: Could not write 0 bytes to slave: 0x00ac with repeat start true.
[0001.721] E> I2C_DEV: Failed to send register address 0x00000000.
[0001.721] E> I2C_DEV: Could not read 256 registers of size 1 from slave 0xac at 0x00000000 via instance 0.
[0001.728] E> eeprom: Failed to read I2C slave device
[0001.733] I> Eeprom read failed 0x3526070d
[0001.739] I> Find /i2c@3180000's alias i2c2
[0001.741] I> Reading eeprom i2c=2 address=0x54
[0001.747] E> I2C: slave not found in slaves.
[0001.750] E> I2C: Could not write 0 bytes to slave: 0x00a8 with repeat start true.
[0001.758] E> I2C_DEV: Failed to send register address 0x00000000.
[0001.763] E> I2C_DEV: Could not read 256 registers of size 1 from slave 0xa8 at 0x00000000 via instance 2.
[0001.773] E> eeprom: Failed to read I2C slave device
[0001.777] I> Eeprom read failed 0x3526070d
[0001.781] I> Reading eeprom i2c=2 address=0x57
[0001.786] E> I2C: slave not found in slaves.
[0001.790] E> I2C: Could not write 0 bytes to slave: 0x00ae with repeat start true.
[0001.798] E> I2C_DEV: Failed to send register address 0x00000000.
[0001.803] E> I2C_DEV: Could not read 256 registers of size 1 from slave 0xae at 0x00000000 via instance 2.
[0001.813] E> eeprom: Failed to read I2C slave device
[0001.817] I> Eeprom read failed 0x3526070d
[0001.821] I> Reading eeprom i2c=2 address=0x52
[0001.826] E> I2C: slave not found in slaves.
[0001.830] E> I2C: Could not write 0 bytes to slave: 0x00a4 with repeat start true.
[0001.838] E> I2C_DEV: Failed to send register address 0x00000000.
[0001.843] E> I2C_DEV: Could not read 256 registers of size 1 from slave 0xa4 at 0x00000000 via instance 2.
[0001.853] E> eeprom: Failed to read I2C slave device
[0001.858] I> Eeprom read failed 0x3526070d
[0001.863] I> Find /i2c@c240000's alias i2c1
[0001.865] I> Reading eeprom i2c=1 address=0x52
[0001.871] E> I2C: slave not found in slaves.
[0001.874] E> I2C: Could not write 0 bytes to slave: 0x00a4 with repeat start true.
[0001.882] E> I2C_DEV: Failed to send register address 0x00000000.
[0001.887] E> I2C_DEV: Could not read 256 registers of size 1 from slave 0xa4 at 0x00000000 via instance 1.
[0001.897] E> eeprom: Retry to read I2C slave device.
[0001.902] E> I2C: slave not found in slaves.
[0001.906] E> I2C: Could not write 0 bytes to slave: 0x00a4 with repeat start true.
[0001.914] E> I2C_DEV: Failed to send register address 0x00000000.
[0001.919] E> I2C_DEV: Could not read 256 registers of size 1 from slave 0xa4 at 0x00000000 via instance 1.
[0001.929] E> eeprom: Failed to read I2C slave device
[0001.933] I> Eeprom read failed 0x3526070d
[0001.937] I> Reading eeprom i2c=1 address=0x50
[0001.942] E> I2C: slave not found in slaves.
[0001.946] E> I2C: Could not write 0 bytes to slave: 0x00a0 with repeat start true.
[0001.954] E> I2C_DEV: Failed to send register address 0x00000000.
[0001.959] E> I2C_DEV: Could not read 256 registers of size 1 from slave 0xa0 at 0x00000000 via instance 1.
[0001.969] E> eeprom: Retry to read I2C slave device.
[0001.974] E> I2C: slave not found in slaves.
[0001.978] E> I2C: Could not write 0 bytes to slave: 0x00a0 with repeat start true.
[0001.986] E> I2C_DEV: Failed to send register address 0x00000000.
[0001.991] E> I2C_DEV: Could not read 256 registers of size 1 from slave 0xa0 at 0x00000000 via instance 1.
[0002.001] E> eeprom: Failed to read I2C slave device
[0002.005] I> Eeprom read failed 0x3526070d
[0002.009] I> create_pm_ids: id: 2888-0004-400-L, len: 15
[0002.014] I> config: mem-type:00,power-config:00,misc-config:00,modem-config:00,touch-config:00,display-config:00,, len: 93
[0002.026] I> Adding plugin-manager/ids/2888-0004-400=/i2c@3160000:module@0x50
[0002.033] W> "i2c@3160000" doesn't exist, creating
[0002.037] W> "module@0x50" doesn't exist, creating
[0002.043] I> Adding plugin-manager/cvm
[0002.046] W> "chip-id" doesn't exist, creating
[0002.050] I> Adding plugin-manager/chip-id/A02P
[0002.054] I> Plugin-manager override starting
[0002.059] W> Failed to find /plugin-manager in DT
[0002.063] I> gpio framework initialized
[0002.069] I> tegrabl_gpio_driver_register: register 'nvidia,tegra194-gpio' driver
[0002.076] I> tegrabl_gpio_driver_register: register 'nvidia,tegra194-gpio-aon' driver
[0002.082] I> tegrabl_tca9539_init: i2c bus: 1, slave addr: 0x46
[0002.089] W> fetch_driver_phandle_from_dt: failed to get node with compatible ti,tca9539
[0002.097] W> fetch_driver_phandle_from_dt: failed to get node with compatible nxp,tca9539
[0002.103] W> tegrabl_tca9539_init: failed to fetch phandle from dt
[0002.109] I> tegrabl_tca9539_init: i2c bus: 1, slave addr: 0x44
[0002.117] W> fetch_driver_phandle_from_dt: failed to get node with compatible ti,tca9539
[0002.125] W> fetch_driver_phandle_from_dt: failed to get node with compatible nxp,tca9539
[0002.131] W> tegrabl_tca9539_init: failed to fetch phandle from dt
[0002.139] I> fixed regulator driver initialized
[0002.151] I> register 'maxim' power off handle
[0002.152] I> virtual i2c enabled
[0002.152] I> registered 'maxim,max20024' pmic
[0002.153] I> tegrabl_gpio_driver_register: register 'max20024-gpio' driver
[0002.160] I> Boot-device: eMMC
[0002.163] I> Boot_device: SDMMC_BOOT instance: 3
[0002.171] I> sdmmc-3 params source = boot args
[0002.172] I> create_pm_ids: id: 2888-0004-400-L, len: 15
[0002.177] I> config: mem-type:00,power-config:00,misc-config:00,modem-config:00,touch-config:00,display-config:00,, len: 93
[0002.188] I> sdmmc bdev is already initialized
[0002.192] I> sdmmc-3 params source = boot args
[0002.223] I> Found 17 partitions in SDMMC_BOOT (instance 3)
[0002.235] I> Found 42 partitions in SDMMC_USER (instance 3)
[0002.251] I> enabling 'vdd-hdmi-5v0' regulator
[0002.256] I> regulator 'vdd-hdmi-5v0' already enabled
[0002.257] E> tegrabl_display_init_regulator: hdmi cable is not connected
[0002.257] E> tegrabl_display_get_pdata, failed to parse dtb settings
[0002.258] E> cannot find any other nvdisp nodes
[0002.259] E> no valid display unit config found in dtb
[0002.260] W> display init failed
[0002.262] I> Load in CBoot Boot Options partition and parse it
[0002.273] E> Error -9 when finding node with path /boot-configuration
[0002.274] E> tegrabl_cbo_parse_info: "boot-configuration" not found in CBO file.
[0002.281] I> Using default boot order
[0002.284] I> boot-dev-order :-
[0002.287] I> 1.sd
[0002.289] I> 2.usb
[0002.291] I> 3.nvme
[0002.293] I> 4.emmc
[0002.295] I> 5.net
[0002.296] I> Hit any key to stop autoboot:     4       3       2       1
[0004.304] initializing target
[0004.304] calling apps_init()
[0004.305] starting app kernel_boot_app
[0004.324] I> found decompressor handler: lz4-legacy
[0004.325] I> decompressing BMP blob ...
[0004.336] I> Kernel type = Normal
[0004.337] I> ########## SD (0) boot ##########
[0004.337] I> No sdcard
[0004.338] I> sdcard-0 params source = DT-BL
[0004.338] E> Blockdev open: exit error
[0004.338] E> SD boot failed, err: 724238353
[0004.338] I> ########## USB (0) boot ##########
[0004.344] W> No valid slot number is found in scratch register
[0004.344] W> Return default slot: _a
[0004.352] I> Validate XUSB-FW ...
[0004.353] I> T19x: Authenticate XUSB-FW (bin_type: 11), max size 0x28000
[0004.357] I> RSA PSS signature check: OK
[0004.361] I> authenticate_oem_payload: Decrypt the binary
[0004.366] I> USB Firmware Version: 60.09 release
[0004.425] I> regulator of usb2-0 already enabled
[0004.433] I> regulator of usb2-1 already enabled
[0004.441] I> regulator of usb2-2 already enabled
[0004.448] I> regulator of usb2-3 already enabled
[0004.451] E> GPIO missing. Cannot disable regulator vdd-5v-sata
[0004.454] I> regulator 'vdd-5v-sata' already enabled
[0005.517] I> USB 2.0 port 4 new full-speed USB device detected
[0005.519] W> WARNING: event and command not matching, cmd_trb_ptr = 0xa42cf200, cmd_ring.dma = 0xa42cf240
[0005.620] I> Start to enumerate device
[0005.621] W> handle_command_completion_event: WARNING: Command was not successfully completed (0x04)
[0008.630] W> xusbh_wait_irq: Timed out! status = 0x00
[0011.638] W> xusbh_wait_irq: Timed out! status = 0x00
[0011.639] E> Failed to enumerate USB device
[0011.639] E> failed to start xhci controller
[0011.639] E> Error in init of XUSB host driver, err: 7979000c
[0011.640] W> Failed to initialize device 5-0
[0011.640] E> USB boot failed, err: 2037973004
[0011.640] I> ########## NVME (0) boot ##########
[0011.645] I> Initializing nvme device instance 0
[0011.649] I> Initializing nvme controller
[0011.654] I> tegrabl_locate_pcie_ctrl_in_dt: found match at 0x14180000
[0011.659] I> vpcie3v3-supply not found
[0011.663] I> vpcie12v-supply not found
[0011.666] W> Failed to get nvidia,plat-gpios
[0011.671] I> tegrabl_pcie_soc_preinit: (0):
[0011.675] I> Unpowergate
[0011.677] I> tegrabl_car_clk_disable(0) ...
[0011.681] I> tegrabl_car_rst_set(CORE, 0) ...
[0011.685] I> tegrabl_car_rst_set(APB, 0) ...
[0011.689] I> tegrabl_car_clk_enable(0) ...
[0011.693] I> tegrabl_car_rst_clear(APB, 0) ...
[0011.698] I> tegrabl_set_ctrl_state(0)
[0011.701] I> CLR PCIE_APB:6
[0011.704] I> tegrabl_pcie_soc_init: (0):
[0011.708] I> APPL initialization ...
[0011.711] I> poweron phys
[0011.714] I> tegrabl_locate_pcie_ctrl_in_dt: found match at 0x14180000
[0011.720] I> tegrabl_power_on_phy: power on phy @0x3e30000
[0011.726] I> tegrabl_power_on_phy: power on phy @0x3e40000
[0011.731] I> tegrabl_power_on_phy: power on phy @0x3e50000
[0011.736] I> tegrabl_power_on_phy: power on phy @0x3e60000
[0012.841] C> Failed to link up controller-0
[0012.842] I> PCIe (0) Link is not UP
[0012.842] W> Failed tegrabl_pcie_soc_init(), error=0x12
[0012.843] I> Failed to initialize SoC Host PCIe controller
[0012.843] E> tegrabl_nvme_init: Failed tegrabl_pcie_init(0); error=0x12
[0012.844] W> tegrabl_nvme_bdev_open: Failed NVME INIT; error=0x80800612
[0012.847] W> Failed to open NVME-0, err = 80800612
[0012.852] W> Failed to initialize device 10-0
[0012.856] E> NVME (0) boot failed, err: 0x80800612
[0012.860] I> ########## NVME (1) boot ##########
[0012.865] I> Initializing nvme device instance 1
[0012.869] I> Initializing nvme controller
[0012.874] I> tegrabl_locate_pcie_ctrl_in_dt: found match at 0x14100000
[0012.880] I> vpcie3v3-supply not found
[0012.883] I> vpcie12v-supply not found
[0012.887] W> Failed to get nvidia,plat-gpios
[0012.891] I> tegrabl_pcie_soc_preinit: (1):
[0012.895] I> Unpowergate
[0012.897] I> tegrabl_car_clk_disable(1) ...
[0012.901] I> tegrabl_car_rst_set(CORE, 1) ...
[0012.906] I> tegrabl_car_rst_set(APB, 1) ...
[0012.910] I> tegrabl_car_clk_enable(1) ...
[0012.914] I> tegrabl_car_rst_clear(APB, 1) ...
[0012.918] I> tegrabl_set_ctrl_state(1)
[0012.922] I> CLR PCIE_APB:6
[0012.924] I> tegrabl_pcie_soc_init: (1):
[0012.928] I> APPL initialization ...
[0012.931] I> poweron phys
[0012.935] I> tegrabl_locate_pcie_ctrl_in_dt: found match at 0x14100000
[0012.941] I> tegrabl_power_on_phy: power on phy @0x3e10000
[0013.072] I> PCIe controller-1 link is up
[0013.072] I> tegra_pcie_info[1].cfg0_base = 0x30000000
[0013.073] I> tegra_pcie_info[1].cfg1_base = 0x30020000
[0013.073] I> tegra_pcie_info[1].atu_dma_base = 0x30040000
[0013.073] I> tegra_pcie_bus[1].mem = 0x30200000
[0013.074] I> Scanning busnr: 0 devfn: 0
[0013.074] I> PCIe IDs: 0x1ad210de
[0013.077] I> PCIe RID_CC: 0x60400a1
[0013.081] I> Scanning busnr: 1 devfn: 0
[0013.084] I> PCIe IDs: 0x15218086
[0013.087] I> PCIe RID_CC: 0x2000001
[0013.091] I> PCI Config: I/O=0x30100000, Memory=0x30200000
[0013.096] I> MEM bar_num=0 bar=0x30200000
[0013.100] I> IO bar_num=2 bar=0x30100000
[0013.104] I> MEM bar_num=3 bar=0x30220000
[0013.108] I> Number of PCIe devices detected: 2
[0013.112] E> tegrabl_nvme_init: Failed tegrabl_pcie_get_dev(1); error=0x0
[0013.118] I> PCIe (1) link is UP
[0013.132] W> tegrabl_nvme_bdev_open: Failed NVME INIT; error=0x80800612
[0013.132] W> Failed to open NVME-1, err = 80800612
[0013.133] W> Failed to initialize device 10-1
[0013.137] E> NVME (1) boot failed, err: 0x80800612
[0013.141] I> ########## NVME (2) boot ##########
[0013.146] I> Initializing nvme device instance 2
[0013.150] I> Initializing nvme controller
[0013.156] I> tegrabl_locate_pcie_ctrl_in_dt: found match at 0x14120000
[0013.161] I> vpcie3v3-supply not found
[0013.164] I> vpcie12v-supply not found
[0013.168] W> Failed to get nvidia,plat-gpios
[0013.172] I> tegrabl_pcie_soc_preinit: (2):
[0013.176] I> Unpowergate
[0013.178] I> tegrabl_car_clk_disable(2) ...
[0013.182] I> tegrabl_car_rst_set(CORE, 2) ...
[0013.187] I> tegrabl_car_rst_set(APB, 2) ...
[0013.191] I> tegrabl_car_clk_enable(2) ...
[0013.195] I> tegrabl_car_rst_clear(APB, 2) ...
[0013.199] I> tegrabl_set_ctrl_state(2)
[0013.203] I> CLR PCIE_APB:6
[0013.205] I> tegrabl_pcie_soc_init: (2):
[0013.209] I> APPL initialization ...
[0013.212] I> poweron phys
[0013.216] I> tegrabl_locate_pcie_ctrl_in_dt: found match at 0x14120000
[0013.221] I> tegrabl_power_on_phy: controller 2 not available
[0013.227] E> Failed to power on phy on controller-2
[0013.231] I> PCIe (2) Link is not UP
[0013.235] W> Failed tegrabl_pcie_soc_init(), error=0x1
[0013.240] I> Failed to initialize SoC Host PCIe controller
[0013.245] E> tegrabl_nvme_init: Failed tegrabl_pcie_init(2); error=0x1
[0013.252] W> tegrabl_nvme_bdev_open: Failed NVME INIT; error=0x80800601
[0013.258] W> Failed to open NVME-2, err = 80800601
[0013.263] W> Failed to initialize device 10-2
[0013.267] E> NVME (2) boot failed, err: 0x80800601
[0013.272] I> ########## NVME (3) boot ##########
[0013.276] I> Initializing nvme device instance 3
[0013.280] I> Initializing nvme controller
[0013.286] I> tegrabl_locate_pcie_ctrl_in_dt: found match at 0x14140000
[0013.291] I> vpcie3v3-supply not found
[0013.294] I> vpcie12v-supply not found
[0013.298] W> Failed to get nvidia,plat-gpios
[0013.302] I> tegrabl_pcie_soc_preinit: (3):
[0013.306] I> Unpowergate
[0013.309] I> tegrabl_car_clk_disable(3) ...
[0013.312] I> tegrabl_car_rst_set(CORE, 3) ...
[0013.317] I> tegrabl_car_rst_set(APB, 3) ...
[0013.321] I> tegrabl_car_clk_enable(3) ...
[0013.325] I> tegrabl_car_rst_clear(APB, 3) ...
[0013.329] I> tegrabl_set_ctrl_state(3)
[0013.333] I> CLR PCIE_APB:6
[0013.335] I> tegrabl_pcie_soc_init: (3):
[0013.339] I> APPL initialization ...
[0013.342] I> poweron phys
[0013.346] I> tegrabl_locate_pcie_ctrl_in_dt: found match at 0x14140000
[0013.352] I> tegrabl_power_on_phy: power on phy @0x3e80000
[0013.470] I> PCIe controller-3 link is up
[0013.470] I> tegra_pcie_info[3].cfg0_base = 0x34000000
[0013.471] I> tegra_pcie_info[3].cfg1_base = 0x34020000
[0013.471] I> tegra_pcie_info[3].atu_dma_base = 0x34040000
[0013.472] I> tegra_pcie_bus[3].mem = 0x34200000
[0013.472] I> Scanning busnr: 0 devfn: 0
[0013.472] I> PCIe IDs: 0x1ad210de
[0013.475] I> PCIe RID_CC: 0x60400a1
[0013.479] I> Scanning busnr: 1 devfn: 0
[0013.482] I> PCIe IDs: 0x42328086
[0013.485] I> PCIe RID_CC: 0x2800000
[0013.489] I> PCI Config: I/O=0x34100000, Memory=0x34200000
[0013.494] I> MEM64 bar_num=0 bar=0x34200000
[0013.498] I> Number of PCIe devices detected: 2
[0013.503] E> tegrabl_nvme_init: Failed tegrabl_pcie_get_dev(3); error=0x0
[0013.509] I> PCIe (3) link is UP
[0013.523] W> tegrabl_nvme_bdev_open: Failed NVME INIT; error=0x80800612
[0013.523] W> Failed to open NVME-3, err = 80800612
[0013.523] W> Failed to initialize device 10-3
[0013.528] E> NVME (3) boot failed, err: 0x80800612
[0013.532] I> ########## NVME (4) boot ##########
[0013.537] I> Initializing nvme device instance 4
[0013.541] I> Initializing nvme controller
[0013.547] I> tegrabl_locate_pcie_ctrl_in_dt: found match at 0x14160000
[0013.551] I> vpcie3v3-supply not found
[0013.555] I> vpcie12v-supply not found
[0013.559] W> Failed to get nvidia,plat-gpios
[0013.563] I> tegrabl_pcie_soc_preinit: (4):
[0013.567] I> Unpowergate
[0013.569] I> tegrabl_car_clk_disable(4) ...
[0013.573] I> tegrabl_car_rst_set(CORE, 4) ...
[0013.577] I> tegrabl_car_rst_set(APB, 4) ...
[0013.581] I> tegrabl_car_clk_enable(4) ...
[0013.585] I> tegrabl_car_rst_clear(APB, 4) ...
[0013.590] I> tegrabl_set_ctrl_state(4)
[0013.593] I> CLR PCIE_APB:6
[0013.596] I> tegrabl_pcie_soc_init: (4):
[0013.600] I> APPL initialization ...
[0013.603] I> poweron phys
[0013.607] I> tegrabl_locate_pcie_ctrl_in_dt: found match at 0x14160000
[0013.612] I> tegrabl_power_on_phy: power on phy @0x3e90000
[0013.618] I> tegrabl_power_on_phy: power on phy @0x3ea0000
[0013.752] I> PCIe controller-4 link is up
[0013.753] I> tegra_pcie_info[4].cfg0_base = 0x36000000
[0013.753] I> tegra_pcie_info[4].cfg1_base = 0x36020000
[0013.754] I> tegra_pcie_info[4].atu_dma_base = 0x36040000
[0013.754] I> tegra_pcie_bus[4].mem = 0x36200000
[0013.754] I> Scanning busnr: 0 devfn: 0
[0013.755] I> PCIe IDs: 0x1ad110de
[0013.758] I> PCIe RID_CC: 0x60400a1
[0013.761] I> Scanning busnr: 1 devfn: 0
[0013.765] I> PCIe IDs: 0x22632646
[0013.768] I> PCIe RID_CC: 0x1080203
[0013.771] I> PCI Config: I/O=0x36100000, Memory=0x36200000
[0013.777] I> MEM64 bar_num=0 bar=0x36200000
[0013.781] I> Number of PCIe devices detected: 2
[0013.785] I> NVME page size: 4096
[0013.789] I> NVMe serial number: 50026B768466E8E2    
[0013.793] I> NVMe model number: KINGSTON SA2000M8500G                   
[0013.800] I> NVMe firmware revision: S5Z42105
[0013.804] I> block_count: 976773168
[0013.807] I> supported_lba: 0
[0013.810] I> block_size_log2: 0x9
[0013.813] I> tegrabl_create_io_queue_cmd: queue size: 2
[0013.818] I> tegrabl_create_io_queue_cmd: queue size: 2
[0013.823] I> nvme device id 000a0004
[0013.827] I> nvme-4 params source = 
[0013.830] W> Cannot find any partition table for 000a0004
[0013.835] I> Detect filesystem
[0013.838] I> fs_detect:173: Unsupported or no filesystem present
[0013.844] I> Loading kernel-bootctrl from partition
[0013.849] I> Loading partition kernel-bootctrl at 0xa4330000 from device(0x1)
[0013.862] W> tegrabl_get_kernel_bootctrl: magic number(0x00000000) is invalid
[0013.863] W> tegrabl_get_kernel_bootctrl: use default dummy boot control data
[0013.876] I> removable_boot_load_kernel_and_dtb: force NVME bdev to close !!!
[0013.877] I> PCIe (4) link is UP
[0013.890] E> NVME (4) boot failed, err: 0x2b2b000d
[0013.891] I> ########## NVME (5) boot ##########
[0013.891] I> Initializing nvme device instance 5
[0013.893] I> Initializing nvme controller
[0013.899] I> tegrabl_locate_pcie_ctrl_in_dt: found match at 0x141a0000
[0013.904] I> i=0, reg_phandle=0x20
[0013.909] I> reg_voltage=3300000
[0013.910] I> tegrabl_pcie_enable_regulators: regulator_set_voltage(0x20, 3300000)
[0013.922] I> enabling 'vdd-3v3-pcie' regulator
[0013.922] I> i=1, reg_phandle=0x21
[0013.927] I> reg_voltage=1200000
[0013.928] I> tegrabl_pcie_enable_regulators: regulator_set_voltage(0x21, 1200000)
[0013.940] I> regulator 'vdd-12v-pcie' already enabled
[0013.940] I> tegrabl_pcie_soc_preinit: (5):
[0013.944] I> Unpowergate
[0013.947] I> tegrabl_car_clk_disable(5) ...
[0013.951] I> tegrabl_car_rst_set(CORE, 5) ...
[0013.955] I> tegrabl_car_rst_set(APB, 5) ...
[0013.959] I> tegrabl_car_clk_enable(5) ...
[0013.963] I> tegrabl_car_rst_clear(APB, 5) ...
[0013.967] I> tegrabl_set_ctrl_state(5)
[0013.971] I> CLR PCIE_APB:6
[0013.973] I> tegrabl_pcie_soc_init: (5):
[0013.977] I> APPL initialization ...
[0013.980] I> poweron phys
[0013.985] I> tegrabl_locate_pcie_ctrl_in_dt: found match at 0x141a0000
[0013.990] I> tegrabl_power_on_phy: power on phy @0x3eb0000
[0013.995] I> tegrabl_power_on_phy: power on phy @0x3ec0000
[0014.000] I> tegrabl_power_on_phy: power on phy @0x3ed0000
[0014.006] I> tegrabl_power_on_phy: power on phy @0x3ee0000
[0014.011] I> tegrabl_power_on_phy: power on phy @0x3ef0000
[0014.016] I> tegrabl_power_on_phy: power on phy @0x3f00000
[0014.022] I> tegrabl_power_on_phy: power on phy @0x3f10000
[0014.027] I> tegrabl_power_on_phy: power on phy @0x3f20000
[0015.132] C> Failed to link up controller-5
[0015.132] I> PCIe (5) Link is not UP
[0015.133] I> tegrabl_pcie_disable_regulators: disable regulator 0x20
[0015.136] I> disabling 'vdd-3v3-pcie' regulator
[0015.136] I> tegrabl_pcie_disable_regulators: disable regulator 0x21
[0015.139] E> GPIO missing. Cannot disable regulator vdd-12v-pcie
[0015.139] W> Failed tegrabl_pcie_soc_init(), error=0x12
[0015.142] I> Failed to initialize SoC Host PCIe controller
[0015.148] E> tegrabl_nvme_init: Failed tegrabl_pcie_init(5); error=0x12
[0015.154] W> tegrabl_nvme_bdev_open: Failed NVME INIT; error=0x80800612
[0015.160] W> Failed to open NVME-5, err = 80800612
[0015.165] W> Failed to initialize device 10-5
[0015.169] E> NVME (5) boot failed, err: 0x80800612
[0015.174] I> ########## Fixed storage boot ##########
[0015.179] I> Loading kernel-bootctrl from partition
[0015.184] I> Loading partition kernel-bootctrl at 0xa4330000 from device(0x1)
[0015.199] W> tegrabl_get_kernel_bootctrl: magic number(0x00000000) is invalid
[0015.199] W> tegrabl_get_kernel_bootctrl: use default dummy boot control data
[0015.205] I> Already published: 00010003
[0015.208] I> Look for boot partition
[0015.212] I> Fallback: assuming 0th partition is boot partition
[0015.218] I> Detect filesystem
[0015.245] I> Loading extlinux.conf ...
[0015.245] I> Loading extlinux.conf binary from rootfs ...
[0015.245] I> rootfs path: /sdmmc_user/boot/extlinux/extlinux.conf
[0015.288] I> Loading extlinux.conf sig file from rootfs ...
[0015.289] I> rootfs path: /sdmmc_user/boot/extlinux/extlinux.conf.sig
[0015.313] I> Validate extlinux.conf ...
[0015.314] I> T19x: Authenticate extlinux.conf (bin_type: 54), max size 0x2000
[0015.315] I> RSA PSS signature check: OK
[0015.315] I> authenticate_oem_payload: Decrypt the binary
[0015.316] E> No valid entry found in extlinux.conf!
[0015.316] I> Loading kernel ...
[0015.316] I> No kernel binary path
[0015.319] I> Continue to load from partition ...
[0015.323] W> No valid slot number is found in scratch register
[0015.329] W> Return default slot: _a
[0015.332] I> A/B: bin_type (37) slot 0
[0015.336] I> Loading kernel from partition
[0015.340] I> Loading partition kernel at 0xa4330000 from device(0x1)
[0015.829] I> Validate kernel ...
[0015.829] I> T19x: Authenticate kernel (bin_type: 37), max size 0x5000000
[0015.831] I> RSA PSS signature check: OK
[0016.223] I> authenticate_oem_payload: Decrypt the binary
[0016.519] I> Checking boot.img header magic ... [0016.519] I> [OK]
[0016.519] I> Loading kernel-dtb ...
[0016.520] I> No kernel-dtb binary path
[0016.520] I> Continue to load from partition ...
[0016.520] W> No valid slot number is found in scratch register
[0016.521] W> Return default slot: _a
[0016.521] I> A/B: bin_type (38) slot 0
[0016.524] I> Loading kernel-dtb from partition
[0016.528] I> Loading partition kernel-dtb at 0x91000000 from device(0x1)
[0016.543] I> Validate kernel-dtb ...
[0016.543] I> T19x: Authenticate kernel-dtb (bin_type: 38), max size 0x400000
[0016.546] I> RSA PSS signature check: OK
[0016.552] I> authenticate_oem_payload: Decrypt the binary
[0016.557] I> Kernel hdr @0xa4330000
[0016.557] I> Kernel dtb @0x90000000
[0016.561] I> decompressor handler not found
[0016.565] I> Copying kernel image (35917832 bytes) from 0xa4330800 to 0x80080000 ... [0016.578] I> Done
[0016.578] I> Move ramdisk (len: 7238358) from 0xa6572000 to 0x92000000
[0016.582] I> Updated bpmp info to DTB
[0016.585] I> Ramdisk: Base: 0x92000000; Size: 0x6e72d6
[0016.589] I> Updated initrd info to DTB
[0016.593] W> WARN: Fail to override "console=none" in commandline
[0016.599] I> Active rootfs suffix: 
[0016.602] E> tegrabl_linuxboot_add_disp_param, du 0 failed to get display params
[0016.609] E> tegrabl_linuxboot_add_disp_param, du 0 failed to get display params
[0016.616] E> tegrabl_linuxboot_add_disp_param, du 0 failed to get display params
[0016.624] W> No valid slot number is found in scratch register
[0016.629] W> Return default slot: _a
[0016.633] I> Active slot suffix: 
[0016.636] I> add_boot_slot_suffix: slot_suffix = 
[0016.640] I> Linux Cmdline: root=/dev/mmcblk0p1 rw rootwait rootfstype=ext4 console=ttyTCU0,115200n8 console=tty0 fbcon=map:0 net.ifnames=0  
[0016.684] I> Updated bootarg info to DTB
[0016.688] W> MAC addr invalid!
[0016.691] E> Failed to get WIFI MAC address
[0016.695] W> MAC addr invalid!
[0016.697] E> Failed to get Bluetooth MAC address
[0016.702] I> eeprom_get_mac_addr: MAC (type: 2): 48:b0:2d:2f:fb:2d
[0016.709] W> "plugin-manager" doesn't exist, creating
[0016.713] I> Adding /chosen/plugin-manager/cvm
[0016.717] W> "chip-id" doesn't exist, creating
[0016.721] I> Adding /chosen/plugin-manager/chip-id
[0016.726] W> "configs" doesn't exist, creating
[0016.730] I> Adding /chosen/plugin-manager/configs
[0016.735] W> "ids" doesn't exist, creating
[0016.739] I> Adding /chosen/plugin-manager/ids
[0016.743] W> "odm-data" doesn't exist, creating
[0016.748] I> Adding /chosen/plugin-manager/odm-data
[0016.755] W> "memory" doesn't exist, creating
[0016.757] I> [0] START: 0x80000000, END: 0xac000000
[0016.761] I> [1] START: 0xac004000, END: 0xf0ad0000
[0016.766] I> [2] START: 0xf0adc000, END: 0xf0ae0000
[0016.771] I> dram_block larger than 80000000
[0016.775] I> [3] START: 0x100000000, END: 0x880000000
[0016.780] I> added [base:0x80000000, size:0x2c000000] to /memory
[0016.786] I> added [base:0xac200000, size:0x44800000] to /memory
[0016.791] I> added [base:0x100000000, size:0x780000000] to /memory
[0016.799] I> Updated memory info to DTB
[0016.801] E> add_disp_param: failed to get display params for du=0
[0016.808] W> "reset" doesn't exist, creating
[0016.812] I> Adding ecid(00000001647dd5011000000017fe81c0) to DT
[0016.817] I> NVG: Logical CPU: 0; MPIDR: 0x80000000
[0016.822] I> NVG: Logical CPU: 1; MPIDR: 0x80000001
[0016.827] I> NVG: Logical CPU: 2; MPIDR: 0x80000100
[0016.831] I> NVG: Logical CPU: 3; MPIDR: 0x80000101
[0016.836] I> NVG: Logical CPU: 4; MPIDR: 0x80000200
[0016.841] I> NVG: Logical CPU: 5; MPIDR: 0x80000201
[0016.845] I> NVG: Logical CPU: 6; MPIDR: 0x80000300
[0016.850] I> NVG: Logical CPU: 7; MPIDR: 0x80000301
[0016.856] W> "misc-data" doesn't exist, creating
[0016.859] I> Boot-device: eMMC
[0016.862] I> Add boot-sdmmc to plugin-manager/misc-data
[0016.867] I> Add storage-sdmmc to plugin-manager/misc-data
[0016.873] W> Unknown storage device
[0016.877] I> Add serial number:1420121080127 as DT property
[0016.883] I> Plugin-manager override starting
[0016.886] W> Failed to find /plugin-manager in DT
[0016.891] 
[0016.891] -----------------------------------------------
[0016.897] Synchronous Exception: DATA ABORT (FAR: 0)
[0016.901] -----------------------------------------------
[0016.907] PAR_ELX: 0x80f
[0016.909] 
[0016.910] ESR 0x96000007: ec 0x25, il 0x1, iss 0x7
[0016.915] -----------------------------------------------
[0016.920]  [Stack Trace]
[0016.922] 
[0016.924] => pc:0xA064ACE4, sp:0xA06A5480
[0016.927] => pc:0xA06411AC, sp:0xA06A56B0
[0016.931] => pc:0xA064321C, sp:0xA06A5720
[0016.935] => pc:0xA0646A28, sp:0xA06A5820
[0016.939] => pc:0xA0645340, sp:0xA06A6090
[0016.943] => pc:0xA060F71C, sp:0xA06A60C0
[0016.947] => pc:0xA060F7E4, sp:0xA06A6160
[0016.950] => pc:0xA060F7F8, sp:0xA06A61B0
[0016.954] => pc:0xA060F5E0, sp:0xA06A61E0
[0016.958] => pc:0xA060EB54, sp:0xA06A61F0
[0016.962] => pc:0xA060EB28, sp:0xA06A6200
[0016.966] -----------------------------------------------
[0016.971] iframe 0xa06a5390:
[0016.974] x0  0x               0 x1  0x               0 x2  0x              73 x3  0x        ffffffe0
[0016.983] x4  0x               0 x5  0x              73 x6  0x               0 x7  0x               0
[0016.992] x8  0x              43 x9  0x               a x10 0x           3b5f4 x11 0x        a06a57dc
[0017.001] x12 0x        90000000 x13 0x        a06a5f8c x14 0x        90000000 x15 0x             200
[0017.010] x16 0x            1500 x17 0x               0 x18 0x               0 x19 0x        a06a5820
[0017.019] x20 0x             800 x21 0x        a066a964 x22 0x              20 x23 0x        ffffffe8
[0017.028] x24 0x        a06a5a64 x25 0x             62b x26 0x        a0667f29 x27 0x        a06a5820
[0017.038] x28 0x        a0667f28 x29 0x        a06a56b0 lr  0x        a064b314 sp  0x        a06a5480
[0017.047] elr 0x        a064ace4
[0017.050] spsr 0x        a0000209
[0017.053] -----------------------------------------------
[0017.058] panic (caller 0xa0601238): die
[0017.062] HALT: spinning forever...

here the generate_mass_log and flash_log
generate_mass_log (112.6 KB)
flash_log (10.8 KB)

Hi,
We try the commands on AGX Xavier developer kit which enables PKC SBK:

$ sudo BOARDID=2888 FAB=400 BOARDSKU=0004 BOARDREV=K.0 ./flash.sh --no-flash -u rsa_priv.pem -v ./sbk.key jetson-xavier mmcblk0p1
$ sudo BOARDID=2888 FAB=400 BOARDSKU=0004 BOARDREV=K.0 ./flash.sh -r --no-flash -u rsa_priv.pem -v ./sbk.key jetson-xavier mmcblk0p1
$ cd bootloader
$ sudo bash ./flashcmd.txt

And the system can boot up successfully. Have you tried on Xavier developer kit? Or you have executed some other extra steps?

Thank u
we try to use the system.img which is not generated in SBKPKC environment,and failed .I note the step one u generate the system.img with SBKPKC If we must generate the system.img through the rootfs which in SBKPKC mode.
I try the system.img generated by SBKPKC,it did work

Thank u

Hi,
So the system image should be generated with PKC and SBK. Please follow this.